References
type: Property
sub property of: relation

YKL - Yleisten kirjastojen luokitusjärjestelmä
type: Ontology
creator: Helsingfors stadsbibliotek @sv
creator: Helsingin kaupunginkirjasto
creator: Helsinki City Library @en
creator: YKL-työryhmä
description: KAB är de allmänna bibliotekens klassifikationssystem. Du kan skicka respons till klassifikationssystemets upprätthållare på blanketten som nås via sidans överbalk eller per e-post till adressen: ykl-kauno@kirjastot.fi @sv
description: PLC is the Finnish Public Libraries Classification System. @en
description: YKL on yleisten kirjastojen luokitusjärjestelmä. Voit lähettää palautetta luokituksen ylläpitäjälle tämän sivun ylälaidan palaute-lomakkeella tai sähköpostitse osoitteeseen: ykl-kauno@kirjastot.fi Ohjeet Muutokset
publisher: Kansalliskirjasto
publisher: National Library of Finland @en
publisher: Nationalbiblioteket i Finland @sv
title: KAB - Allmänna bibliotekens klassifikationssystem @sv
title: PLC - Finnish Public Libraries Classification System @en
language: fin
language: swe
license: http://creativecommons.org/publicdomain/zero/1.0/
modified: 2026-05-12T12:52:20+00:00
type: ConceptScheme
has top concept: YLEISTEOKSET. KIRJA-ALA. KIRJASTOTOIMI YLEINEN KULTTUURIPOLITIIKKA. JOUKKOTIEDOTUS
has top concept: FILOSOFIA. PSYKOLOGIA. RAJATIETO. TIEDEOPPI
has top concept: USKONTO
has top concept: YHTEISKUNTA
has top concept: MAANTIEDE. MATKAT. KANSATIEDE
has top concept: LUONNONTIETEET. MATEMATIIKKA. LÄÄKETIEDE
has top concept: TEKNIIKKA. TEOLLISUUS. KÄSITYÖ. MAA- JA METSÄTALOUS KOTITALOUS. LIIKETALOUS. LIIKENNE
has top concept: TAITEET. LIIKUNTA
has top concept: KAUNOKIRJALLISUUS. KIRJALLISUUSTIEDE. KIELITIEDE
has top concept: HISTORIA
has top concept: Fiktiivisen aineiston lisäluokat
has top concept: Muotoluokat
preferred label: YKL

YLEISTEOKSET. KIRJA-ALA. KIRJASTOTOIMI YLEINEN KULTTUURIPOLITIIKKA. JOUKKOTIEDOTUS
type: Concept
type: YKL-luokka
in scheme: YKL - Yleisten kirjastojen luokitusjärjestelmä
narrower: KIRJA-ALA
narrower: BIBLIOGRAFIA
narrower: KIRJASTOTOIMI. KIRJASTOTIEDE. INFORMATIIKKA
narrower: TIEDONHAKU. YLEISET TIETOTEOKSET
narrower: YLEISET KOKOOMATEOKSET
narrower: YLEISET KAUSIJULKAISUT
narrower: YLEINEN KULTTUURIPOLITIIKKA
narrower: VIESTINTÄ. JOUKKOVIESTINTÄ
notation: 0
preferred label: ALLMÄNNA VERK. BOKBRANSCHEN BIBLIOTEKSVERKSAMHET. ALLMÄN KULTURPOLITIK. MASSKOMMUNIKATION @sv
preferred label: GENERAL WORKS. BOOKS AND PUBLISHING. LIBRARIES. GENERAL CULTURAL POLICY. MASS COMMUNICATION @en
top concept of: YKL - Yleisten kirjastojen luokitusjärjestelmä

KIRJA-ALA
type: Concept
References: BIBLIOGRAFIA
References: KIRJASTOTOIMI. KIRJASTOTIEDE. INFORMATIIKKA
References: Kirjastonhoito. Kirjastotekniikka
References: YLEINEN KULTTUURIPOLITIIKKA
References: Oppimisen psykologia
References: Opiskelutekniikka
References: Erityisopetus. Erityiskasvatus, luku-, kirjoitus- ja puhehäiriöiset
References: Kuvitustaide
References: KIRJALLISUUSTIEDE
type: YKL-luokka
alternative label: Analfabetism (00) @sv
alternative label: Bokbranschen (00+) @sv
alternative label: Böcker, handledning i bokanvändning, allm. (00) @sv
alternative label: Hakuteokset, käyttö, yl. (00)
alternative label: Kirja-ala (00+)
alternative label: Kirjat, käytön oppaat, yl. (00)
alternative label: Lukeminen, lukutaito (00)
alternative label: Lukutaidottomuus (00)
alternative label: Lukutaito, yl. (00)
alternative label: Läsande, läskunnighet (00) @sv
alternative label: Läsfärdighet, allm. (00) @sv
alternative label: Uppslagsverk, användning, allm. (00) @sv
broader: YLEISTEOKSET. KIRJA-ALA. KIRJASTOTOIMI YLEINEN KULTTUURIPOLITIIKKA. JOUKKOTIEDOTUS
in scheme: YKL - Yleisten kirjastojen luokitusjärjestelmä
narrower: Kirjoitus
narrower: Symbolit. Koodit. Merkkijärjestelmät
narrower: Kirjapainotaito. Graafinen teollisuus
narrower: Kirjansidonta
narrower: Kustannustoiminta. Kirjakauppa
narrower: Kirjojen keräily. Bibliofilia
notation: 00
preferred label: BOKBRANSCHEN @sv
preferred label: BOOKS AND PUBLISHING @en
scope note: Tähän teokset, jotka koskevat kirjaa tai kirjoitettua sanaa yleensä Kirjojen käytön yleiset oppaat Lukutaito. Lukutaidottomuus Tähän myös teokset, jotka koskevat sekä luku- että kirjoitustaitoa ja teokset, jotka koskevat sekä kirja- että kirjastoalaa Kirjan ja kirjoitetun sanan yleinen historia sekä harvinaiskirjat 00.09
scope note: Verk som handlar om boken eller det skrivna ordet i allmänhet Allmän vägledning i användning av böcker Läskunnighet. Analfabetism Hit också verk som rör både läs- och skrivkunnighet och verk som behandlar både bokbranschen och biblioteksverksamhet Bokens och det skrivna ordets historia i allmänhet och bokrariteter 00.09 @sv

Kirjoitus
type: Concept
References: KIRJA-ALA
References: Symbolit. Koodit. Merkkijärjestelmät
References: Kirjapainotaito. Graafinen teollisuus
References: Oppimisen psykologia
References: Käsialantutkimus
References: Erityisopetus. Erityiskasvatus, luku-, kirjoitus- ja puhehäiriöiset
References: Erityisopetus. Erityiskasvatus, näkövammaiset
References: Konekirjoitus. Tekstinkäsittely. Pikakirjoitus
References: Tekstaus. Kalligrafia
References: KIELITIEDE
References: SUOMALAIS-UGRILAISET JA URALILAISET KIELET
References: INDOEUROOPPALAISET KIELET. MUUT KIELET
type: YKL-luokka
alternative label: Aakkoset (00.1)
alternative label: Alfabet (00.1) @sv
alternative label: Alfabetet (00.1) @sv
alternative label: Bläck, skrivredskap (00.1) @sv
alternative label: Chifferskrift (00.1) @sv
alternative label: Kaunokirjoitus, kirjoitusmerkit (00.1)
alternative label: Kirjaimistot (00.1)
alternative label: Kirjainmuodot (00.1)
alternative label: Kirjoitustaito (00.1)
alternative label: Kirjoitustyylit (00.1)
alternative label: Kirjoitusvälineet (00.1)
alternative label: Morseaakkoset (00.1)
alternative label: Morsealfabetet (00.1) @sv
alternative label: Musteet, kirjoitusvälineet (00.1)
alternative label: Salakirjoitukset (00.1)
alternative label: Skrivkunnighet (00.1) @sv
alternative label: Skrivredskap (00.1) @sv
alternative label: Skrivstilar (00.1) @sv
alternative label: Skönskrivning, skrivtecken (00.1) @sv
alternative label: Tekstitys, kirjoitus (00.1)
alternative label: Textning, skrift (00.1) @sv
alternative label: Transkriptio (00.1)
alternative label: Transkription (00.1) @sv
alternative label: Translitterering (00.1) @sv
alternative label: Translitterointi (00.1)
alternative label: Typsnitt (00.1) @sv
alternative label: Tyyppikirjaimistot (00.1)
broader: KIRJA-ALA
in scheme: YKL - Yleisten kirjastojen luokitusjärjestelmä
narrower: Kirjoituksen historia. Paleografia. Epigrafia
notation: 00.1
preferred label: Skrift @sv
preferred label: Writing @en
scope note: Kirjoitus ja kirjoitustaito Kirjaimet. Kirjaimistot. Kirjoitusmerkit Kirjoitusjärjestelmät. Aakkoset. Morseaakkoset Translitterointi. Transskriptio Salakirjoitukset ja niiden avaaminen Kirjoitusvälineet, -aineet ja -tyylit Tähän myös käsialat kirjoitustaidon ja kirjoitustyylien kannalta Kirjoitustaidon historia ja kehitys 00.109
scope note: Skrift och skrivkonst Bokstäver. Alfabet. Skrivtecken Skriftsystem. ABC. Morsealfabetet Translitterering. Transkription Chiffer och lösning av chiffer Skrivmaterial, skrivmedel och stilarter Hit också handstilar ur skrivkonstens och stilarternas synvinkel Skrivkonstens historia och utveckling 00.109 @sv

Kirjoituksen historia. Paleografia. Epigrafia
type: Concept
References: URN:NBN:fi:au:ykl:00.09
References: Symbolit. Koodit. Merkkijärjestelmät
References: URN:NBN:fi:au:ykl:00.409
References: Käsialantutkimus
References: KIRJALLISUUSTIEDE
type: YKL-luokka
alternative label: Bomärken (00.109) @sv
alternative label: Epigrafia (00.109)
alternative label: Epigrafik (00.109) @sv
alternative label: Gamla handstilar, paleografi (00.109) @sv
alternative label: Grafologi, paleografi (00.109) @sv
alternative label: Handskrifter (00.109) @sv
alternative label: Hieroglyfer (00.109) @sv
alternative label: Hieroglyfit (00.109)
alternative label: Inristningar (00.109) @sv
alternative label: Kalligrafi, paleografi (00.109) @sv
alternative label: Kalligrafia, paleografia (00.109)
alternative label: Kaunokirjoitus, paleografia (00.109)
alternative label: Kiilakirjoitus (00.109)
alternative label: Kilskrift (00.109) @sv
alternative label: Kirjainmuodot, paleografia (00.109)
alternative label: Kirjoitus, historia (00.109)
alternative label: Kirjoitustaito, historia (00.109)
alternative label: Kirjoitustyylit, paleografia (00.109)
alternative label: Käsialantutkimus, paleografia (00.109)
alternative label: Käsikirjoitukset (00.109)
alternative label: Nuolenpääkirjoitus (00.109)
alternative label: Papyrer, papyrologi (00.109) @sv
alternative label: Papyrologi (00.109) @sv
alternative label: Papyrologia (00.109)
alternative label: Papyrukset, papyrologia (00.109)
alternative label: Piirtokirjoitukset (00.109)
alternative label: Puumerkit (00.109)
alternative label: Riimukirjoitus (00.109)
alternative label: Runskrift (00.109) @sv
alternative label: Skrift, historia (00.109) @sv
alternative label: Skrivkunnighet, historia (00.109) @sv
alternative label: Skrivstilar, paleografi (00.109) @sv
alternative label: Skönskrivning, paleografi (00.109) @sv
alternative label: Typsnitt, paleografi (00.109) @sv
alternative label: Vanhat käsialat, paleografia (00.109)
broader: Kirjoitus
in scheme: YKL - Yleisten kirjastojen luokitusjärjestelmä
notation: 00.109
preferred label: History of writing. Palaeography. Epigraphy @en
preferred label: Skriftens historia. Paleografi. Epigrafi @sv
scope note: Kirjoitustaidon historia ja kehitys Kirjoitusmerkkien ja kirjoitusjärjestelmien historia ja kehitys Kirjoitusvälineiden, -aineiden, -tyylien ja käsialojen historia ja kehitys Muinaiset kirjoitusjärjestelmät. Piirtokirjoitus. Hieroglyfit. Papyrologia. Nuolenpääkirjoitus. Riimukirjoitus Puumerkit
scope note: Skrivkonstens historia och utveckling Skrivtecknens och skrivsystemens historia och utveckling Skrivredskapens, skrivmaterialens, stilarternas och handstilarnas historia och utveckling Forntida skriftsystem. Inristningar. Hieroglyfer. Papyrologi. Kilskrift. Runskrift Bomärken @sv

Symbolit. Koodit. Merkkijärjestelmät
type: Concept
modified: 2026-02-17T15:52:43
References: Kirjoitus
References: YLEINEN USKONTOTIEDE
References: Kirkolliset esineet ja symbolit
References: Erityisopetus. Erityiskasvatus, näkövammaiset
References: Lukuteoria. Aritmetiikka. Algebra
References: Mainonta
References: TAIDE. TAIDEHISTORIA
References: UUDET TAIDEMUODOT
References: ARKKITEHTUURI
References: KUVANVEISTOTAIDE
References: MAALAUSTAIDE. PIIRUSTUSTAIDE
References: GRAFIIKKA. VALOKUVAUS
References: MUOTOILU. TAIDETEOLLISUUS. TAIDEKÄSITYÖ
References: NÄYTTÄMÖTAIDE. ELOKUVATAIDE
References: MUSIIKKI
References: Kielifilosofia
type: YKL-luokka
alternative label: Koder (00.2) @sv
alternative label: Koodit (00.2)
alternative label: Merkkijärjestelmät (00.2)
alternative label: Symboler (00.2) @sv
alternative label: Symbolit (00.2)
alternative label: Teckensystem (00.2) @sv
broader: KIRJA-ALA
in scheme: YKL - Yleisten kirjastojen luokitusjärjestelmä
notation: 00.2
preferred label: Symboler. Koder. Teckensystem @sv
preferred label: Symbols. Codes. Sign systems @en
scope note: Hit allmänna verk om symboler, koder och teckensystem Symboler, koder och teckensystem för specialområden klassificeras enligt område. Semiotik i allmänhet 00.201 @sv
scope note: Tähän symboleja, koodeja ja merkkijärjestelmiä koskevat yleisteokset Erikoisalojen symbolit, koodit ja merkkijärjestelmät luokitetaan alan mukaan Semiotiikka yleensä 00.201

Kirjapainotaito. Graafinen teollisuus
type: Concept
References: URN:NBN:fi:au:ykl:00.09
References: Kirjoitus
References: Kustannustoiminta. Kirjakauppa
References: Toimistotyö. Toimistotekniikka
References: Grafiikan materiaalit ja tekniikka
References: Kuvitustaide
References: Käyttögrafiikka
alternative label: Bildtryck (00.4) @sv
alternative label: Boktryckarens arbete (00.4) @sv
alternative label: Boktryckarkonst (00.4) @sv
alternative label: Desktop publishing (00.4)
alternative label: Desktop-publishing (00.4)
alternative label: Digitaalinen painatus (00.4)
alternative label: Digitaltryck (00.4) @sv
alternative label: Dupliceringsteknik (00.4) @sv
alternative label: Editointi, lehden taittaminen (00.4)
alternative label: Fonter (00.4) @sv
alternative label: Fontit (00.4)
alternative label: Färger, tryckteknik (00.4) @sv
alternative label: Färggrafik, tryckteknik (00.4) @sv
alternative label: Graafinen teollisuus (00.4)
alternative label: Grafisk industri (00.4) @sv
alternative label: Heliografi (00.4) @sv
alternative label: Heliografia (00.4)
alternative label: Illustrationsteknik (00.4) @sv
alternative label: Julkaisujärjestelmät (00.4)
alternative label: Jäljennetekniikka (00.4)
alternative label: Kemigrafi (00.4) @sv
alternative label: Kemigrafia (00.4)
alternative label: Kirjainmuodot, kirjapainotaito (00.4)
alternative label: Kirjaintyylit (00.4)
alternative label: Kirjaintyypit (00.4)
alternative label: Kirjanpainajan työ (00.4)
alternative label: Kirjapainotaito (00.4)
alternative label: Kirjasimet (00.4)
alternative label: Kirjasinlajit (00.4)
alternative label: Kopieringsteknik (00.4) @sv
alternative label: Korrekturläsning (00.4) @sv
alternative label: Kuvapainatus (00.4)
alternative label: Kuvitustekniikka (00.4)
alternative label: Laakapaino (00.4)
alternative label: Ladonta (00.4)
alternative label: Latomotekniikka (00.4)
alternative label: Layoutprogram (00.4) @sv
alternative label: Litografiatekniikka, kirjapainotekniikka (00.4)
alternative label: Litografiteknik, tryckteknik (00.4) @sv
alternative label: Monistustekniikka (00.4)
alternative label: Offset (00.4)
alternative label: Oikoluku (00.4)
alternative label: Ombrytning (00.4) @sv
alternative label: PageMaker, sidomrytningsprogram (00.4) @sv
alternative label: PageMaker, taitto-ohjelma (00.4)
alternative label: Painokoneet (00.4)
alternative label: Painomenetelmät, kirjapainotekniikka (00.4)
alternative label: Painovärit, kirjapainotekniikka (00.4)
alternative label: Paperilaadut, kirjapainotekniikka (00.4)
alternative label: Papperssorter, tryckteknik (00.4) @sv
alternative label: Plantryck (00.4) @sv
alternative label: Redigering, ombrytning av tidningar (00.4) @sv
alternative label: Reproduktionsteknik (00.4) @sv
alternative label: Reproduktiotekniikka (00.4)
alternative label: Serigrafi, tryckteknik (00.4) @sv
alternative label: Serigrafia, kirjapainotekniikka (00.4)
alternative label: Sidombrytningsprogram (00.4) @sv
alternative label: Silk screen, tryckteknik (00.4) @sv
alternative label: Silkkipainanta, kirjapainotekniikka (00.4)
alternative label: Snittvarianter (00.4) @sv
alternative label: Sätteriteknik (00.4) @sv
alternative label: Taitto (00.4)
alternative label: Taitto-ohjelmat (00.4)
alternative label: Tekstinvalmistus, kirjapainotekniikka (00.4)
alternative label: Typografia (00.4)
alternative label: Värigrafiikka, kirjapainotekniikka (00.4)
alternative label: Värit, kirjapainotekniikka (00.4)
broader: KIRJA-ALA
in scheme: YKL - Yleisten kirjastojen luokitusjärjestelmä
notation: 00.4
scope note: Kirjapainotekniikka. Jäljennetekniikka Reproduktiotekniikka. Monistustekniikka Tekstinvalmistus. Ladonta. Kirjasimet Taitto. Typografia. Painaminen. Jälkikäsittely Atk-, datansiirto-, tekstinkäsittely- ja lasertekniikan käyttö kirjapaino- ja jäljennetekniikassa. Näyttötaitto Kirjojen, lehtien, karttojen, nuottien, mainosten, julisteiden, pakkausten ja lomakkeiden painatus Kuvapainatus. Kuvitustekniikka Kirjapainotaidon historia ja inkunaabelit 00.409
scope note: Tryckteknik. Kopieringsteknik Reproduktionsteknik. Dupliceringsteknik Textproduktion. Sättning. Trycktyper Ombrytning. Typografi. Tryckning. Efterbehandling Datateknik, dataöverföring, textbehandling och laserteknik i trycksaksproduktion och kopieringsteknik. Desktop publishing Tryckning av böcker, tidningar, kartor, noter, reklam, affischer, förpackningar och blanketter Bildtryck. Illustrationsteknik Boktryckarkonstens historia och inkunabler 00.409 @sv

Kirjansidonta
type: Concept
References: Kirjapainotaito. Graafinen teollisuus
References: Kuvitustaide
type: YKL-luokka
alternative label: Bokbindarkonst (00.5) @sv
alternative label: Bokbinderi (00.5) @sv
alternative label: Bokkonst, bokbindarkonst (00.5) @sv
alternative label: Böcker, bokbinderi (00.5) @sv
alternative label: Böcker, reparation och konservering (00.5) @sv
alternative label: Kirjansidonta (00.5)
alternative label: Kirjansidontataide (00.5)
alternative label: Kirjat, korjaaminen ja konservointi (00.5)
alternative label: Kirjat, sidonta (00.5)
alternative label: Kirjataide, kirjansidontataide (00.5)
broader: KIRJA-ALA
in scheme: YKL - Yleisten kirjastojen luokitusjärjestelmä
notation: 00.5
preferred label: Bokbindning @sv
preferred label: Bookbinding @en
scope note: Bokbindning och bokbindningsteknik som industri och hantverk Bokband. Bokbindarkonst Underhåll och reparation av böcker Bokkonservering Hit också bindning och reparation av böcker i bibliotek @sv
scope note: Kirjansidonta ja sen tekniikka teollisuuden ja käsityön kannalta Kirjan sidosasu. Kirjansidontataide Kirjojen kunnossapito ja korjaaminen Kirjojen konservointi Tähän myös kirjojen sidonta ja korjaaminen kirjastossa

Kustannustoiminta. Kirjakauppa
type: Concept
References: Kirjapainotaito. Graafinen teollisuus
References: Kirjansidonta
References: Kirjojen keräily. Bibliofilia
References: KIRJASTOTOIMI. KIRJASTOTIEDE. INFORMATIIKKA
References: Immateriaalioikeudet
alternative label: Antikvariaatit (00.6)
alternative label: Antikvariat (00.6) @sv
alternative label: Bildkassetter, förlagsverksamhet (00.6) @sv
alternative label: Bildskivor, förlagsverksamhet (00.6) @sv
alternative label: Bokauktioner (00.6) @sv
alternative label: Bokhandlar (00.6) @sv
alternative label: Bokklubbar (00.6) @sv
alternative label: CD-ROM-levyt, kustantaminen (00.6)
alternative label: CD-levyt, kustantaminen (00.6)
alternative label: DVD-R-levyt, kustantaminen (00.6)
alternative label: DVD-ROM-levyt, kustantaminen (00.6)
alternative label: DVD-levyt, kustantaminen (00.6)
alternative label: Digitaaliset tallenteet, kustantaminen (00.6)
alternative label: E-kirjat, kustantaminen (00.6)
alternative label: Editointi, kirjan toimittaminen (00.6)
alternative label: Elektroniset julkaisut, kustantaminen (00.6)
alternative label: ISBN-järjestelmä (00.6)
alternative label: ISMN-järjestelmä (00.6)
alternative label: ISSN-järjestelmä (00.6)
alternative label: Julkaisutoiminta (00.6)
alternative label: Kartat, kustantaminen (00.6)
alternative label: Kasetit, kustantaminen (00.6)
alternative label: Kirjahuutokaupat (00.6)
alternative label: Kirjakaupat (00.6)
alternative label: Kirjakerhot (00.6)
alternative label: Kirjan markkinointi (00.6)
alternative label: Kirjan toimittaminen (00.6)
alternative label: Kirjankustannus (00.6)
alternative label: Kirjat, kustantaminen (00.6)
alternative label: Kustannusliikkeet (00.6)
alternative label: Kustannuspolitiikka (00.6)
alternative label: Kustannustoiminta (00.6)
alternative label: Kustannustoimittajan työ (00.6)
alternative label: Kustantaminen (00.6)
alternative label: Kuvakasetit, kustantaminen (00.6)
alternative label: Kuvalevyt, kustantaminen (00.6)
alternative label: Kuvatallenteet, kustantaminen (00.6)
alternative label: Laserlevyt, kustantaminen (00.6)
alternative label: Lehdet, jakelu (00.6)
alternative label: Lehdet, kustantaminen (00.6)
alternative label: Levy-yhtiöt (00.6)
alternative label: Levymerkit (00.6)
alternative label: Musiikkiteollisuus, kustannustoiminta (00.6)
alternative label: Nuotit, kustantaminen (00.6)
alternative label: Omakustannus (00.6)
alternative label: Optiset levyt, kustantaminen (00.6)
alternative label: Optiset tallenteet, kustantaminen (00.6)
alternative label: Painetut julkaisut, kustantaminen (00.6)
alternative label: Partituurit, kustantaminen (00.6)
alternative label: SACD-levyt, kustantaminen (00.6)
alternative label: Sanomalehdet, kustantaminen (00.6)
alternative label: Sähköiset julkaisut, kustantaminen (00.6)
alternative label: Sähkökirjat, kustantaminen (00.6)
alternative label: Tallenteet, kustantaminen (00.6)
alternative label: Tekijänoikeudet, kustannustoiminta (00.6)
alternative label: Toimittajan työ, kustannustoimittajan työ (00.6)
alternative label: Toimitustyö, kustannustoimittajan työ (00.6)
alternative label: Verkkojulkaiseminen, kustannustoiminta (00.6)
alternative label: Verkkojulkaisut, kustantaminen (00.6)
alternative label: Verkkokirjat, kustantaminen (00.6)
alternative label: Verkolehdet, kustantaminen (00.6)
alternative label: Videokasetit, kustantaminen (00.6)
alternative label: Videolevyt, kustantaminen (00.6)
alternative label: Videotallenteet, kustantaminen (00.6)
alternative label: Äänikasetit, kustantaminen (00.6)
alternative label: Äänikirjat, kustantaminen (00.6)
alternative label: Äänilevyt, kustantaminen (00.6)
alternative label: Ääninauhat, kustantaminen (00.6)
alternative label: Äänitteet, kustantaminen (00.6)
broader: KIRJA-ALA
in scheme: YKL - Yleisten kirjastojen luokitusjärjestelmä
notation: 00.6
scope note: Förlagspolitik. Förlag. Eget förlag Marknadsföring, reklam och distribution av böcker Bokhandlar. Bokauktioner. Antikvariat. Bokklubbar Att redigera böcker. Förlagsredaktörens arbete. Att göra titelblad. ISBN- och ISSN-systemen Hit också utgivning och distribution av övriga tryckta publikationer, t.ex. tidningar, kartor och noter Hit också utgivning och distribution av publikationer i elektronisk form, såsom bandinspelningar, videoinspelningar, optiska skivor, dataprogram och CD-ROM-publikationer Bokutställningar och -mässor 00.6063 @sv
scope note: Kustannuspolitiikka. Kustannusliikkeet. Omakustannus Kirjan markkinointi, mainonta ja jakelu Kirjakaupat. Kirjahuutokaupat. Antikvariaatit. Kirjakerhot Kirjan toimittaminen. Kustannustoimittajan työ Nimiölehden laatiminen. ISBN- ja ISSN-järjestelmät Tähän myös muiden painettujen julkaisujen, kuten lehtien, karttojen ja nuottien, kustantaminen ja jakelu Tähän myös elektronisten julkaisujen, kuten äänitteiden, videotallenteiden, optisten levyjen, tietokoneohjelmien tai CD-ROM-julkaisujen, kustantaminen ja jakelu Kirjanäyttelyt ja -messut 00.6063

Kirjojen keräily. Bibliofilia
type: Concept
References: Kustannustoiminta. Kirjakauppa
References: BIBLIOGRAFIA
References: Kirjastojen yhteisluettelot
References: Yksittäisten kirjastojen luettelot
References: KIRJASTOTOIMI. KIRJASTOTIEDE. INFORMATIIKKA
References: Yksittäiset kirjastot
References: Käyttögrafiikka
References: KIRJALLISUUSTIEDE
type: YKL-luokka
alternative label: Bibliofili (00.8) @sv
alternative label: Bibliofilia (00.8)
alternative label: Bibliomani (00.8) @sv
alternative label: Bibliomania (00.8)
alternative label: Böcker, samlande (00.8) @sv
alternative label: Keräily, kirjat (00.8)
alternative label: Kirjat, keräily (00.8)
alternative label: Samlarverksamhet, böcker (00.8) @sv
broader: KIRJA-ALA
in scheme: YKL - Yleisten kirjastojen luokitusjärjestelmä
notation: 00.8
preferred label: Boksamlande. Bibliofili @sv
preferred label: Book collecting. Bibliophilism @en

BIBLIOGRAFIA
type: Concept
References: Kustannustoiminta. Kirjakauppa
References: Kirjojen keräily. Bibliofilia
References: KIRJASTOTOIMI. KIRJASTOTIEDE. INFORMATIIKKA
References: Tietopalvelu. Informaatiopalvelu
type: YKL-luokka
alternative label: Abstraktijulkaisut, laatiminen (01)
alternative label: Abstraktpublikationer, utarbetande (01) @sv
alternative label: Aikakauslehti-indeksit, laatiminen (01)
alternative label: Arvostelevat luettelot, laatiminen (01)
alternative label: Bibliografi (01+) @sv
alternative label: Bibliografia (01+)
alternative label: Bibliografiat, laatiminen (01)
alternative label: Bibliografier, utarbetning (01) @sv
alternative label: Bibliografiset tietokannat, laatiminen (01)
alternative label: Bibliografiska databaser, utarbetande (01) @sv
alternative label: Bokkataloger, utarbetande (01) @sv
alternative label: Databanker, bibliografiska, upprättande (01) @sv
alternative label: Databaser, bibliografiska, upprättande (01) @sv
alternative label: Elokuvaluettelot, laatiminen (01)
alternative label: Filmkataloger, utarbetande (01) @sv
alternative label: Filmografiat, laatiminen (01)
alternative label: Filmografier, utarbetande (01) @sv
alternative label: Indeksijulkaisut, laatiminen (01)
alternative label: Indexpublikationer, utarbetande (01) @sv
alternative label: Kansallisbibliografiat, laatiminen (01)
alternative label: Kaunokirjallisuusluettelot, laatiminen (01)
alternative label: Kausijulkaisuluettelot, laatiminen (01)
alternative label: Kirjallisuuskatsaukset, laatiminen (01)
alternative label: Kirjallisuusluettelot, laatiminen (01)
alternative label: Kirjaluettelot, laatiminen (01)
alternative label: Lehtiluettelot, laatiminen (01)
alternative label: Litteraturförteckningar, utarbetande (01) @sv
alternative label: Litteraturöversikter, författande (01) @sv
alternative label: Ljudupptagningskataloger, uppgörande (01) @sv
alternative label: Musiikkibibliografiat, laatiminen (01)
alternative label: Musikbibliografier, utarbetande (01) @sv
alternative label: Nationalbibliografier, upprättande (01) @sv
alternative label: Officiella publikationer, kataloger, utarbetande (01) @sv
alternative label: Periodica, kataloger, utarbetande (01) @sv
alternative label: Recenserande kataloger, utarbetande (01) @sv
alternative label: Referaattijulkaisut, laatiminen (01)
alternative label: Referatpublikationer, utarbetande (01) @sv
alternative label: Register, bibliografiska, utarbetande (01) @sv
alternative label: Rekisterit, bibliografiset, laatiminen (01)
alternative label: Sanomalehtiluettelot, laatiminen (01)
alternative label: Sarjajulkaisuluettelot, laatiminen (01)
alternative label: Seriella publikationer, förteckningar, utarbetande (01) @sv
alternative label: Skönlitteraturkataloger, utarbetande (01) @sv
alternative label: Tidningskataloger, utarbetande (01) @sv
alternative label: Tidskriftsindex, utarbetande (01) @sv
alternative label: Tietokannat, bibliografiset, laatiminen (01)
alternative label: Tietopankit, bibliografiset, laatiminen (01)
alternative label: Tiivistelmäjulkaisut, laatiminen (01)
alternative label: Urvalskataloger, utarbetande (01) @sv
alternative label: Valikoimaluettelot, laatiminen (01)
alternative label: Virallisjulkaisuluettelot, laatiminen (01)
alternative label: Ääniteluettelot, laatiminen (01)
broader: YLEISTEOKSET. KIRJA-ALA. KIRJASTOTOIMI YLEINEN KULTTUURIPOLITIIKKA. JOUKKOTIEDOTUS
in scheme: YKL - Yleisten kirjastojen luokitusjärjestelmä
narrower: Yleisbibliografiat. Kansallisbibliografiat
narrower: Paikallisbibliografiat
narrower: Henkilöbibliografiat
narrower: Erikoisalojen luettelot
narrower: Kirjastojen yhteisluettelot
narrower: Yksittäisten kirjastojen luettelot
notation: 01
preferred label: BIBLIOGRAFI @sv
preferred label: BIBLIOGRAPHY @en
scope note: Hit utarbetande av bibliografiska publikationer oavsett materialtyp Hit utarbetande av bibliografier, litteraturförteckningar, urvalskataloger, index-, referat- och abstraktpublikationer samt litteraturöversikter och sammandrag Hit också sammanställning av bibliografiska register och databaser Hit också utarbetande av förteckningar över seriella publikationer, ljudinspelningar och bildupptagningar Hit och till underklasserna också bibliografier som forskningsobjekt @sv
scope note: Tähän bibliografisten julkaisujen laatiminen julkaisun ja sen kohteiden materiaalityypistä riippumatta Tähän bibliografioiden, kirjallisuusluetteloiden, valikoimaluetteloiden, indeksi-, referaatti- ja abstraktijulkaisujen sekä kirjallisuuskatsausten ja tiivistelmien laatiminen Tähän myös bibliografisten tiedostojen ja tietokantojen laatiminen Tähän myös kausijulkaisu-, äänite- ja kuvatallenneluetteloiden laatiminen Tähän ja alaluokkiin myös bibliografiat tutkimuksen kohteena

Yleisbibliografiat. Kansallisbibliografiat
type: Concept
References: BIBLIOGRAFIA
References: Paikallisbibliografiat
References: Henkilöbibliografiat
References: Erikoisalojen luettelot
References: Kirjastojen yhteisluettelot
References: Yksittäisten kirjastojen luettelot
alternative label: Abstraktijulkaisut (01.2 ... 01.8)
alternative label: Abstraktpublikationer (01.2 ... 01.8) @sv
alternative label: Aikakauslehti-indeksit (01.2 ... 01.8)
alternative label: Allmänna bibliografier (01.2) @sv
alternative label: Arvostelevat luettelot (01.2 ... 01.8)
alternative label: Barnlitteratur, bibliografier (01.2 ... 01.8) @sv
alternative label: Bibliografiat (01.2)
alternative label: Bibliografiset tietokannat (01.2 ... 01.8)
alternative label: CD-ROM-levyt, luettelot (01.2 ... 01.8)
alternative label: CD-levyt, luettelot (01.2 ... 01.8)
alternative label: DVD-R-levyt, luettelot (01.2 ... 01.8)
alternative label: DVD-ROM-levyt, luettelot (01.2 ... 01.8)
alternative label: DVD-levyt, luettelot (01.2 ... 01.8)
alternative label: Diakuvaluettelot (01.2 ... 01.8)
alternative label: E-kirjat, luettelot (01.2 ... 01.8)
alternative label: E-lehdet, luettelot (01.2 ... 01.8)
alternative label: Elektroniset julkaisut, luettelot (01.2 ... 01.8)
alternative label: Indeksijulkaisut (01.2 ... 01.8)
alternative label: Kansallisbibliografiat (01.2)
alternative label: Kasetit, luettelot (01.2 ... 01.8)
alternative label: Kasettiluettelot (01.2 ... 01.8)
alternative label: Kausijulkaisuluettelot (01.2 ... 01.8)
alternative label: Kiellettyjen kirjojen luettelot (01.2)
alternative label: Kirjaharvinaisuuksien luettelot (01.2)
alternative label: Kirjallisuuskatsaukset (01.2 ... 01.8)
alternative label: Kirjallisuusluettelot (01.2 ... 01.8)
alternative label: Kirjaluettelot (01.2 ... 01.8)
alternative label: Kuvakasetit, luettelot (01.2 ... 01.8)
alternative label: Kuvalevyt, luettelot (01.2 ... 01.8)
alternative label: Kuvatallenteet, luettelot (01.2 ... 01.8)
alternative label: Laserlevyt, luettelot (01.2 ... 01.8)
alternative label: Lastenkirjallisuus, bibliografiat (01.2 ... 01.8)
alternative label: Lehdet, luettelot (01.2 ... 01.8)
alternative label: Lehtiluettelot (01.2 ... 01.8)
alternative label: Luettelot, bibliografiset (01.2 ... 01.8)
alternative label: Nuortenkirjallisuus, bibliografiat (01.2 ... 01.8)
alternative label: Optiset levyt, luettelot (01.2 ... 01.8)
alternative label: Optiset tallenteet, luettelot (01.2 ... 01.8)
alternative label: Referaattijulkaisut (01.2 ... 01.8)
alternative label: Rekisterit, bibliografiset (01.2 ... 01.8)
alternative label: SACD-levyt, luettelot (01.2 ... 01.8)
alternative label: Sanomalehtiluettelot (01.2 ... 01.8)
alternative label: Sarjajulkaisuluettelot (01.2 ... 01.8)
alternative label: Sähköiset julkaisut, luettelot (01.2 ... 01.8)
alternative label: Sähkökirjat, luettelot (01.2 ... 01.8)
alternative label: Tallenteet, luettelot (01.2 ... 01.8)
alternative label: Tiedostot, bibliografiset (01.2 ... 01.8)
alternative label: Tietokannat, bibliografiset (01.2 ... 01.8)
alternative label: Tietokirjallisuusluettelot (01.2 ... 01.8)
alternative label: Tietopankit, bibliografiset (01.2 ... 01.8)
alternative label: Tiivistelmäjulkaisut (01.2 ... 01.8)
alternative label: Valikoimaluettelot (01.2 ... 01.8)
alternative label: Verkkojulkaisut, luettelot (01.2 ... 01.8)
alternative label: Verkkokirjat, luettelot (01.2 ... 01.8)
alternative label: Verkkolehdet, luettelot (01.2 ... 01.8)
alternative label: Videokasetit, luettelot (01.2 ... 01.8)
alternative label: Videolevyt, luettelot (01.2 ... 01.8)
alternative label: Videotallenteet, luettelot (01.2 ... 01.8)
alternative label: Virallisjulkaisuluettelot (01.2)
alternative label: Yleisbibliografiat (01.2)
alternative label: Äänikasetit, luettelot (01.2 ... 01.8)
alternative label: Äänikirjat, luettelot (01.2 ... 01.8)
alternative label: Äänilevyluettelot (01.2 ... 01.8)
alternative label: Ääninauhat, luettelot (01.2 ... 01.8)
alternative label: Ääniteluettelot (01.2 ... 01.8)
alternative label: Äänitteet, luettelot (01.2 ... 01.8)
broader: BIBLIOGRAFIA
in scheme: YKL - Yleisten kirjastojen luokitusjärjestelmä
narrower: Kustantajien ja kirjakauppojen luettelot
narrower: Opinnäyte- ja väitöskirjaluettelot
notation: 01.2
scope note: Hit allmänna bibliografiska publikationer oavsett publikationens och dess föremåls medietyp Allmänna bibliografier och nationalbibliografier Allmänna litteraturförteckningar och litteraturöversikter Allmänna urvalskataloger Allmänna bibliografiska register och databaser Allmänna index-, referat- och abstraktpublikationer Allmänna förteckningar över periodiska publikationer Allmänna förteckningar över officiella publikationer Hit också allmänna förteckningar över ljud- och bildupptagningar @sv
scope note: Tähän yleiset bibliografiset julkaisut julkaisun ja sen kohteiden materiaalityypistä riippumatta Yleiset bibliografiat ja kansallisbibliografiat Yleiset kirjallisuusluettelot ja -katsaukset Yleiset valikoimaluettelot Yleiset bibliografiset tiedostot ja tietokannat Yleiset indeksi-, referaatti-, abstrakti- ja tiivistelmäjulkaisut Yleiset kausijulkaisujen luettelot Yleiset virallisjulkaisujen luettelot Tähän myös yleiset äänite- ja kuvatallenneluettelot

Kustantajien ja kirjakauppojen luettelot
type: Concept
References: Kustannustoiminta. Kirjakauppa
References: URN:NBN:fi:au:ykl:00.6063
References: Erikoisalojen luettelot
References: URN:NBN:fi:au:ykl:70.203
type: YKL-luokka
alternative label: Antikvariaatit, kirjaluettelot (01.21)
alternative label: Antikvariat, bokkataloger (01.21) @sv
alternative label: Bokauktioner, bokkataloger (01.21) @sv
alternative label: Bokhandlar, bokkataloger (01.21) @sv
alternative label: Bokmässor, bokkataloger (01.21) @sv
alternative label: Bokutställningar, bokkataloger (01.21) @sv
alternative label: Detaljhandel, bokkataloger (01.21) @sv
alternative label: Detaljhandel, kataloger över ljudupptagningar (01.21) @sv
alternative label: Detaljhandel, videokataloger (01.21) @sv
alternative label: Förlagskataloger (01.21) @sv
alternative label: Julkaisuluettelot (01.21)
alternative label: Julkaisuvarastoluettelot (01.21)
alternative label: Kirjahuutokaupat, kirjaluettelot (01.21)
alternative label: Kirjakaupat, kirjaluettelot (01.21)
alternative label: Kirjamessut, kirjaluettelot (01.21)
alternative label: Kirjanäyttelyt, kirjaluettelot (01.21)
alternative label: Kustantajien luettelot (01.21)
alternative label: Lagerkataloger, bokhandlar (01.21) @sv
alternative label: Lagerkataloger, förläggare (01.21) @sv
alternative label: Publikationskataloger (01.21) @sv
alternative label: Publikationslagerkataloger (01.21) @sv
alternative label: Varastoluettelot, kirjakaupat (01.21)
alternative label: Varastoluettelot, kustantajat (01.21)
alternative label: Vähittäiskauppa, kirjaluettelot (01.21)
alternative label: Vähittäiskauppa, videoluettelot (01.21)
alternative label: Vähittäiskauppa, ääniteluettelot (01.21)
broader: Yleisbibliografiat. Kansallisbibliografiat
in scheme: YKL - Yleisten kirjastojen luokitusjärjestelmä
notation: 01.21
preferred label: Förlags- och bokhandelskataloger @sv
preferred label: Publishers' and retailers' catalogues @en
scope note: Allmänna förlags- och bokhandelskataloger oavsett katalogens och dess föremåls medietyp Förlagens och bokhandlarnas publikations-, lager- och urvalskataloger Bokhandelskataloger, kataloger för bokauktioner, antikvariat, bokutställningar och bokmässor Kataloger över institutioners och sällskaps publikationer och publikationslager Hit också kataloger över förlagens och minuthandelns seriella publikationer och ljud- och bildupptagningar @sv
scope note: Kustantajien ja kirjakauppojen yleisluettelot luettelon ja sen kohteiden materiaalityypistä riippumatta Kustantajien ja kirjakauppojen julkaisu-, varasto- ja valikoimaluettelot Kirjakauppojen, kirjahuutokauppojen, antikvariaattien, kirjanäyttelyiden ja kirjamessujen luettelot Laitosten ja seurojen julkaisu- ja julkaisuvarastoluettelot Tähän myös kustantajien ja vähittäiskaupan kausijulkaisu-, äänite- ja kuvatallenneluettelot

Opinnäyte- ja väitöskirjaluettelot
type: Concept
References: Erikoisalojen luettelot
type: YKL-luokka
alternative label: Doktorsavhandlingar, förteckningar (01.22) @sv
alternative label: Lärdomsprov, kataloger (01.22) @sv
alternative label: Opinnäyteluettelot (01.22)
alternative label: Väitöskirjaluettelot (01.22)
broader: Yleisbibliografiat. Kansallisbibliografiat
in scheme: YKL - Yleisten kirjastojen luokitusjärjestelmä
notation: 01.22
preferred label: Kataloger över lärdomsprov och akademiska avhandlingar @sv
preferred label: Thesis and dissertation catalogues @en
scope note: Hit oavsett medietyp sådana kataloger över lärdomsprov eller akademiska avhandlingar som antingen är allmänna eller behandlar flera olika områden @sv
scope note: Tähän materiaalityypistä riippumatta yleiset tai monia eri aloja koskevat opinnäyte- ja väitöskirjaluettelot

Paikallisbibliografiat
type: Concept
References: Yleisbibliografiat. Kansallisbibliografiat
References: Erikoisalojen luettelot
alternative label: Abstraktijulkaisut (01.2 ... 01.8)
alternative label: Abstraktpublikationer (01.2 ... 01.8) @sv
alternative label: Aikakauslehti-indeksit (01.2 ... 01.8)
alternative label: Aluebibliografiat (01.3)
alternative label: Arvostelevat luettelot (01.2 ... 01.8)
alternative label: Barnlitteratur, bibliografier (01.2 ... 01.8) @sv
alternative label: Bibliografiset tietokannat (01.2 ... 01.8)
alternative label: Bibliografiska databaser (01.2 ... 01.8) @sv
alternative label: Bildkassetter, kataloger (01.2 ... 01.8) @sv
alternative label: Bildskivor, kataloger (01.2 ... 01.8) @sv
alternative label: Bokkataloger (01.2 ... 01.8) @sv
alternative label: CD-ROM, kataloger (01.2 ... 01.8) @sv
alternative label: CD-ROM-levyt, luettelot (01.2 ... 01.8)
alternative label: CD-levyt, luettelot (01.2 ... 01.8)
alternative label: CD-skivor, kataloger (01.2 ... 01.8) @sv
alternative label: DVD-R-levyt, luettelot (01.2 ... 01.8)
alternative label: DVD-R-skivor, kataloger (01.2 ... 01.8) @sv
alternative label: DVD-ROM-levyt, luettelot (01.2 ... 01.8)
alternative label: DVD-ROM-skivor, kataloger (01.2 ... 01.8) @sv
alternative label: DVD-levyt, luettelot (01.2 ... 01.8)
alternative label: DVD-skivor, kataloger (01.2 ... 01.8) @sv
alternative label: Databanker, bibliografiska (01.2 ... 01.8) @sv
alternative label: Databaser, bibliografiska (01.2 ... 01.8) @sv
alternative label: Diakuvaluettelot (01.2 ... 01.8)
alternative label: E-kirjat, luettelot (01.2 ... 01.8)
alternative label: E-lehdet, luettelot (01.2 ... 01.8)
alternative label: Elektroniset julkaisut, luettelot (01.2 ... 01.8)
alternative label: Indeksijulkaisut (01.2 ... 01.8)
alternative label: Kasetit, luettelot (01.2 ... 01.8)
alternative label: Kasettiluettelot (01.2 ... 01.8)
alternative label: Kausijulkaisuluettelot (01.2 ... 01.8)
alternative label: Kirjallisuuskatsaukset (01.2 ... 01.8)
alternative label: Kirjallisuusluettelot (01.2 ... 01.8)
alternative label: Kirjaluettelot (01.2 ... 01.8)
alternative label: Kuvakasetit, luettelot (01.2 ... 01.8)
alternative label: Kuvalevyt, luettelot (01.2 ... 01.8)
alternative label: Kuvatallenteet, luettelot (01.2 ... 01.8)
alternative label: Laserlevyt, luettelot (01.2 ... 01.8)
alternative label: Lastenkirjallisuus, bibliografiat (01.2 ... 01.8)
alternative label: Lehdet, luettelot (01.2 ... 01.8)
alternative label: Lehtiluettelot (01.2 ... 01.8)
alternative label: Luettelot, bibliografiset (01.2 ... 01.8)
alternative label: Nuortenkirjallisuus, bibliografiat (01.2 ... 01.8)
alternative label: Optiset levyt, luettelot (01.2 ... 01.8)
alternative label: Optiset tallenteet, luettelot (01.2 ... 01.8)
alternative label: Paikallisbibliografiat (01.3)
alternative label: Referaattijulkaisut (01.2 ... 01.8)
alternative label: Rekisterit, bibliografiset (01.2 ... 01.8)
alternative label: SACD-levyt, luettelot (01.2 ... 01.8)
alternative label: Sanomalehtiluettelot (01.2 ... 01.8)
alternative label: Sarjajulkaisuluettelot (01.2 ... 01.8)
alternative label: Sähköiset julkaisut, luettelot (01.2 ... 01.8)
alternative label: Sähkökirjat, luettelot (01.2 ... 01.8)
alternative label: Tallenteet, luettelot (01.2 ... 01.8)
alternative label: Tiedostot, bibliografiset (01.2 ... 01.8)
alternative label: Tietokannat, bibliografiset (01.2 ... 01.8)
alternative label: Tietokirjallisuusluettelot (01.2 ... 01.8)
alternative label: Tietopankit, bibliografiset (01.2 ... 01.8)
alternative label: Tiivistelmäjulkaisut (01.2 ... 01.8)
alternative label: Valikoimaluettelot (01.2 ... 01.8)
alternative label: Verkkojulkaisut, luettelot (01.2 ... 01.8)
alternative label: Verkkokirjat, luettelot (01.2 ... 01.8)
alternative label: Verkkolehdet, luettelot (01.2 ... 01.8)
alternative label: Videokasetit, luettelot (01.2 ... 01.8)
alternative label: Videolevyt, luettelot (01.2 ... 01.8)
alternative label: Videotallenteet, luettelot (01.2 ... 01.8)
alternative label: Äänikasetit, luettelot (01.2 ... 01.8)
alternative label: Äänikirjat, luettelot (01.2 ... 01.8)
alternative label: Äänilevyluettelot (01.2 ... 01.8)
alternative label: Ääninauhat, luettelot (01.2 ... 01.8)
alternative label: Ääniteluettelot (01.2 ... 01.8)
alternative label: Äänitteet, luettelot (01.2 ... 01.8)
broader: BIBLIOGRAFIA
in scheme: YKL - Yleisten kirjastojen luokitusjärjestelmä
notation: 01.3
scope note: Hit allmänna lokala och regionala bibliografier oberoende av bibliografins och dess föremåls medietyp Kataloger och urvalskataloger över publikationer om en bestämd ort eller ett bestämt område Hit också lokalbibliografier som innehåller seriella publikationer, ljudinspelningar eller bildupptagningar @sv
scope note: Tähän yleiset paikallis- ja aluebibliografiat bibliografian ja sen kohteiden materiaalityypistä riippumatta Tiettyä paikkakuntaa tai aluetta koskevien julkaisujen luettelot ja valikoimaluettelot Tähän myös kausijulkaisuja, äänitteitä tai kuvatallenteita sisältävät paikallisbibliografiat

Henkilöbibliografiat
type: Concept
References: Opinnäyte- ja väitöskirjaluettelot
References: Taiteet. Liikunta
References: URN:NBN:fi:au:ykl:70.203
References: HENKILÖ- JA SUKUHISTORIA
References: Elämäkerralliset hakuteokset
alternative label: Abstraktijulkaisut (01.2 ... 01.8)
alternative label: Aikakauslehti-indeksit (01.2 ... 01.8)
alternative label: Anonyymiluettelot (01.4)
alternative label: Arvostelevat luettelot (01.2 ... 01.8)
alternative label: Bibliografiat, musiikki, henkilöbibliografiat (01.4)
alternative label: Bibliografiset tietokannat (01.2 ... 01.8)
alternative label: CD-ROM-levyt, luettelot (01.2 ... 01.8)
alternative label: CD-levyt, luettelot (01.2 ... 01.8)
alternative label: DVD-R-levyt, luettelot (01.2 ... 01.8)
alternative label: DVD-ROM-levyt, luettelot (01.2 ... 01.8)
alternative label: DVD-levyt, luettelot (01.2 ... 01.8)
alternative label: Diakuvaluettelot (01.2 ... 01.8)
alternative label: Diskografiat, henkilöbibliografiat (01.4)
alternative label: E-kirjat, luettelot (01.2 ... 01.8)
alternative label: E-lehdet, luettelot (01.2 ... 01.8)
alternative label: Elektroniset julkaisut, luettelot (01.2 ... 01.8)
alternative label: Elokuvaluettelot, henkilöbibliografiat (01.4)
alternative label: Filmografiat, henkilöbibliografiat (01.4)
alternative label: Henkilöbibliografiat (01.4)
alternative label: Indeksijulkaisut (01.2 ... 01.8)
alternative label: Kasetit, luettelot (01.2 ... 01.8)
alternative label: Kasettiluettelot (01.2 ... 01.8)
alternative label: Kausijulkaisuluettelot (01.2 ... 01.8)
alternative label: Kirjailijat, teosluettelot (01.4)
alternative label: Kirjallisuuskatsaukset (01.2 ... 01.8)
alternative label: Kirjallisuusluettelot (01.2 ... 01.8)
alternative label: Kirjaluettelot (01.2 ... 01.8)
alternative label: Kuvakasetit, luettelot (01.2 ... 01.8)
alternative label: Kuvalevyt, luettelot (01.2 ... 01.8)
alternative label: Kuvatallenteet, luettelot (01.2 ... 01.8)
alternative label: Laserlevyt, luettelot (01.2 ... 01.8)
alternative label: Lastenkirjallisuus, bibliografiat (01.2 ... 01.8)
alternative label: Lehdet, luettelot (01.2 ... 01.8)
alternative label: Lehtiluettelot (01.2 ... 01.8)
alternative label: Luettelot, bibliografiset (01.2 ... 01.8)
alternative label: Musiikkibibliografiat, henkilöbibliografiat (01.4)
alternative label: Nimimerkkiluettelot (01.4)
alternative label: Nuortenkirjallisuus, bibliografiat (01.2 ... 01.8)
alternative label: Optiset levyt, luettelot (01.2 ... 01.8)
alternative label: Optiset tallenteet, luettelot (01.2 ... 01.8)
alternative label: Pseudonyymiluettelot (01.4)
alternative label: Referaattijulkaisut (01.2 ... 01.8)
alternative label: Rekisterit, bibliografiset (01.2 ... 01.8)
alternative label: SACD-levyt, luettelot (01.2 ... 01.8)
alternative label: Salanimiluettelot (01.4)
alternative label: Sanomalehtiluettelot (01.2 ... 01.8)
alternative label: Sarjajulkaisuluettelot (01.2 ... 01.8)
alternative label: Sähköiset julkaisut, luettelot (01.2 ... 01.8)
alternative label: Sähkökirjat, luettelot (01.2 ... 01.8)
alternative label: Säveltäjät, teosluettelot (01.4)
alternative label: Taiteilijat, teosluettelot (01.4)
alternative label: Tallenteet, luettelot (01.2 ... 01.8)
alternative label: Teosluettelot (01.4)
alternative label: Teosluettelot, henkilöbibliografiat (01.4)
alternative label: Teosluettelot, kirjailijat (01.4)
alternative label: Teosluettelot, säveltäjät (01.4)
alternative label: Teosluettelot, taiteilijat (01.4)
alternative label: Tiedostot, bibliografiset (01.2 ... 01.8)
alternative label: Tietokannat, bibliografiset (01.2 ... 01.8)
alternative label: Tietokirjallisuusluettelot (01.2 ... 01.8)
alternative label: Tietopankit, bibliografiset (01.2 ... 01.8)
alternative label: Tiivistelmäjulkaisut (01.2 ... 01.8)
alternative label: Valikoimaluettelot (01.2 ... 01.8)
alternative label: Verkkojulkaisut, luettelot (01.2 ... 01.8)
alternative label: Verkkokirjat, luettelot (01.2 ... 01.8)
alternative label: Verkkolehdet, luettelot (01.2 ... 01.8)
alternative label: Videokasetit, luettelot (01.2 ... 01.8)
alternative label: Videolevyt, luettelot (01.2 ... 01.8)
alternative label: Videotallenteet, luettelot (01.2 ... 01.8)
broader: BIBLIOGRAFIA
in scheme: YKL - Yleisten kirjastojen luokitusjärjestelmä
notation: 01.4
scope note: Hit alla personbibliografier oberoende av bibliografins och dess föremåls medietyp Förteckningar och urvalsförteckningar över publikationer om enskilda personer eller persongrupper Förteckningar och urvalsförteckningar över verk eller artiklar av enskilda personer eller persongrupper Hit också kompositörers och konstnärers opusförteckningar, t.ex. kompositionsförteckningar och filmbibliografier Hit också personbibliografier som innehåller ljud- och bildupptagningar Anonym- och pseudonymförteckningar @sv
scope note: Tähän kaikki henkilöbibliografiat bibliografian ja sen kohteiden materiaalityypistä riippumatta Tiettyä henkilöä tai henkilöryhmää koskevien julkaisujen luettelot ja valikoimaluettelot Tietyn henkilön tai henkilöryhmän julkaisemien teosten tai kirjoitusten luettelot ja valikoimaluettelot Tähän myös säveltäjien ja taiteilijoiden teosluettelot, esim. sävellysluettelot ja filmografiat Tähän myös äänitteitä tai kuvatallenteita sisältävät henkilöbibliografiat Anonyymi- ja pseudonyymiluettelot

Erikoisalojen luettelot
type: Concept
References: Henkilöbibliografiat
alternative label: Abstraktijulkaisut (01.2 ... 01.8)
alternative label: Abstraktpublikationer (01.2 ... 01.8) @sv
alternative label: Aikakauslehti-indeksit (01.2 ... 01.8)
alternative label: Arvostelevat luettelot (01.2 ... 01.8)
alternative label: Barnlitteratur, bibliografier (01.2 ... 01.8) @sv
alternative label: Bibliografiat, erikoisalojen (01.5+)
alternative label: Bibliografier över bibliografier (01.5) @sv
alternative label: Bibliografier, specialområden (01.5+) @sv
alternative label: Bibliografioiden bibliografiat (01.5)
alternative label: Bibliografiset tietokannat (01.2 ... 01.8)
alternative label: CD-ROM-levyt, luettelot (01.2 ... 01.8)
alternative label: CD-levyt, luettelot (01.2 ... 01.8)
alternative label: DVD-R-levyt, luettelot (01.2 ... 01.8)
alternative label: DVD-ROM-levyt, luettelot (01.2 ... 01.8)
alternative label: DVD-levyt, luettelot (01.2 ... 01.8)
alternative label: Diakuvaluettelot (01.2 ... 01.8)
alternative label: E-kirjat, luettelot (01.2 ... 01.8)
alternative label: E-lehdet, luettelot (01.2 ... 01.8)
alternative label: Elektroniset julkaisut, luettelot (01.2 ... 01.8)
alternative label: Indeksijulkaisut (01.2 ... 01.8)
alternative label: Kansallisbibliografiat, erikoisalojen (01.5+)
alternative label: Kasetit, luettelot (01.2 ... 01.8)
alternative label: Kasettiluettelot (01.2 ... 01.8)
alternative label: Kausijulkaisuluettelot (01.2 ... 01.8)
alternative label: Kirjallisuuskatsaukset (01.2 ... 01.8)
alternative label: Kirjallisuusluettelot (01.2 ... 01.8)
alternative label: Kirjaluettelot (01.2 ... 01.8)
alternative label: Kuvakasetit, luettelot (01.2 ... 01.8)
alternative label: Kuvalevyt, luettelot (01.2 ... 01.8)
alternative label: Kuvatallenteet, luettelot (01.2 ... 01.8)
alternative label: Laserlevyt, luettelot (01.2 ... 01.8)
alternative label: Lastenkirjallisuus, bibliografiat (01.2 ... 01.8)
alternative label: Lehdet, luettelot (01.2 ... 01.8)
alternative label: Lehtiluettelot (01.2 ... 01.8)
alternative label: Luettelot, bibliografiset (01.2 ... 01.8)
alternative label: Nuortenkirjallisuus, bibliografiat (01.2 ... 01.8)
alternative label: Optiset levyt, luettelot (01.2 ... 01.8)
alternative label: Optiset tallenteet, luettelot (01.2 ... 01.8)
alternative label: Referaattijulkaisut (01.2 ... 01.8)
alternative label: Rekisterit, bibliografiset (01.2 ... 01.8)
alternative label: SACD-levyt, luettelot (01.2 ... 01.8)
alternative label: Sanomalehtiluettelot (01.2 ... 01.8)
alternative label: Sarjajulkaisuluettelot (01.2 ... 01.8)
alternative label: Sähköiset julkaisut, luettelot (01.2 ... 01.8)
alternative label: Sähkökirjat, luettelot (01.2 ... 01.8)
alternative label: Tallenteet, luettelot (01.2 ... 01.8)
alternative label: Tiedostot, bibliografiset (01.2 ... 01.8)
alternative label: Tietokannat, bibliografiset (01.2 ... 01.8)
alternative label: Tietokirjallisuusluettelot (01.2 ... 01.8)
alternative label: Tietopankit, bibliografiset (01.2 ... 01.8)
alternative label: Tiivistelmäjulkaisut (01.2 ... 01.8)
alternative label: Valikoimaluettelot (01.2 ... 01.8)
alternative label: Verkkojulkaisut, luettelot (01.2 ... 01.8)
alternative label: Verkkokirjat, luettelot (01.2 ... 01.8)
alternative label: Verkkolehdet, luettelot (01.2 ... 01.8)
alternative label: Videokasetit, luettelot (01.2 ... 01.8)
alternative label: Videolevyt, luettelot (01.2 ... 01.8)
alternative label: Videotallenteet, luettelot (01.2 ... 01.8)
alternative label: Äänikasetit, luettelot (01.2 ... 01.8)
alternative label: Äänikirjat, luettelot (01.2 ... 01.8)
alternative label: Äänilevyluettelot (01.2 ... 01.8)
alternative label: Ääninauhat, luettelot (01.2 ... 01.8)
alternative label: Ääniteluettelot (01.2 ... 01.8)
alternative label: Äänitteet, luettelot (01.2 ... 01.8)
broader: BIBLIOGRAFIA
in scheme: YKL - Yleisten kirjastojen luokitusjärjestelmä
narrower: Filosofia. Psykologia. Rajatieto
narrower: Uskonto
narrower: Yhteiskunta
narrower: Maantiede. Matkat. Kansatiede
narrower: Luonnontieteet. Matematiikka. Lääketiede
narrower: Tekniikka. Teollisuus. Käsityö. Maa- ja metsätalous Kotitalous. Liiketalous. Liikenne
narrower: Taiteet. Liikunta
narrower: Kaunokirjallisuus. Kirjallisuustiede. Kielitiede
narrower: Historia
notation: 01.5
scope note: Hit och till underklasserna bibliografier inom specialområden oavsett bibliografins och dess föremåls medietyp Hit och till underklasserna bibliografier inom specialområden, litteraturförteckningar, urvalsförteckningar, bibliografiska register och databaser samt index-, referat- och abstraktpublikationer Hit och till underklasserna också t.ex. förteckningar över seriella publikationer, ljud- och bildupptagningar för specialområden Hit och till underklasserna också nationalbibliografier, lokala och regionala bibliografier inom specialområden samt förlagens, bokhandlarnas och bibliotekens kataloger inom specialområden Hit och till underklasserna också kataloger över avhandlingar som gäller specialområden Hit bibliografier inom specialområden som hör till huvudklass 0, såsom bokbranschen och biblioteksverksamheten, allmänna uppslagsverk, allmänna periodiska publikationer, allmän kulturpolitik eller masskommunikation Hit också bibliografier över bibliografier @sv
scope note: Tähän bibliografiset julkaisut, jotka koskevat pääluokkaan 0 kuuluvia erikoisaloja, kuten kirja- ja kirjastoalaa, yleisiä tietoteoksia, yleisiä kausijulkaisuja, yleistä kulttuuripolitiikkaa tai joukkotiedotusta Tähän myös bibliografiain bibliografiat Tähän ja alaluokkiin erikoisalojen bibliografiset julkaisut julkaisun ja sen kohteiden materiaalityypistä riippumatta Tähän ja alaluokkiin erikoisalojen bibliografiat, kirjallisuusluettelot, valikoimaluettelot, bibliografiset tiedostot ja tietokannat sekä indeksi-, referaatti- ja abstraktijulkaisut Tähän ja alaluokkiin myös esim. erikoisalojen kausijulkaisu-, äänite- ja kuvatallenneluettelot Tähän ja alaluokkiin myös erikoisalojen kansallis-, paikallis- ja aluebibliografiat sekä erikoisaloja koskevat kustantajien, kirjakauppojen ja kirjastojen luettelot Tähän ja alaluokkiin myös erikoisalojen opinnäyte- ja väitöskirjaluettelot

Filosofia. Psykologia. Rajatieto
type: Concept
type: YKL-luokka
broader: Erikoisalojen luettelot
in scheme: YKL - Yleisten kirjastojen luokitusjärjestelmä
notation: 01.51
preferred label: Filosofi. Psykologi. Paranormala fenomen @sv
preferred label: Philosophy. Psychology. Paranormal phenomena @en
scope note: Hit bibliografier inom specialområden som hör till huvudklass 1, såsom filosofi, logik, vetenskapsteori, psykologi och paranormala fenomen @sv
scope note: Tähän bibliografiset julkaisut, jotka koskevat pääluokkaan 1 kuuluvia erikoisaloja, kuten filosofiaa, logiikkaa, tiedeoppia, psykologiaa tai rajatietoa

Uskonto
type: Concept
type: YKL-luokka
broader: Erikoisalojen luettelot
in scheme: YKL - Yleisten kirjastojen luokitusjärjestelmä
notation: 01.52
preferred label: Religion @en
scope note: Hit bibliografier inom specialområden som hör till huvudklass 2, såsom religionsvetenskap, religionsfilosofi, teologi, religioner, kyrkor och kyrkosamfund @sv
scope note: Tähän bibliografiset julkaisut, jotka koskevat pääluokkaan 2 kuuluvia erikoisaloja, kuten uskontotiedettä, uskonnonfilosofiaa, teologiaa, uskontoja, kirkkoja tai kirkkokuntia

Yhteiskunta
type: Concept
type: YKL-luokka
broader: Erikoisalojen luettelot
in scheme: YKL - Yleisten kirjastojen luokitusjärjestelmä
notation: 01.53
preferred label: Samhälle @sv
preferred label: Society @en
scope note: Hit bibliografier inom specialområden som hör till huvudklass 3, såsom samhällsvetenskap, sociologi, statistik, politik, rättsvetenskap, regionplanering, administration, nationalekonomi, socialpolitik, pedagogik och försvar @sv
scope note: Tähän bibliografiset julkaisut, jotka koskevat pääluokkaan 3 kuuluvia erikoisaloja, kuten yhteiskuntatieteitä, sosiologiaa, tilastotiedettä, politiikkaa, oikeustiedettä, aluesuunnittelua, hallintoa, taloustiedettä, sosiaalipolitiikkaa, kasvatustiedettä tai maanpuolustusta

Maantiede. Matkat. Kansatiede
type: Concept
type: YKL-luokka
alternative label: Kartat, luettelot (01.54)
alternative label: Kartkataloger (01.54) @sv
alternative label: Kartor, kataloger (01.54) @sv
alternative label: Karttaluettelot (01.54)
broader: Erikoisalojen luettelot
in scheme: YKL - Yleisten kirjastojen luokitusjärjestelmä
notation: 01.54
preferred label: Geografi. Resor. Etnologi @sv
preferred label: Geography. Travel. Ethnology @en
scope note: Hit bibliografier inom specialområden som hör till huvudklass 4, såsom geografi, turism, reseskildringar, kartor, etnologi och kulturantropologi @sv
scope note: Tähän bibliografiset julkaisut, jotka koskevat pääluokkaan 4 kuuluvia erikoisaloja, kuten maantiedettä, matkailua, matkakuvauksia, karttoja, kansatiedettä tai kulttuuriantropologiaa

Luonnontieteet. Matematiikka. Lääketiede
type: Concept
type: YKL-luokka
broader: Erikoisalojen luettelot
in scheme: YKL - Yleisten kirjastojen luokitusjärjestelmä
notation: 01.55
preferred label: Natural sciences. Mathematics. Medicine @en
preferred label: Naturvetenskaper. Matematik. Medicin @sv
scope note: Hit bibliografier inom specialområden som hör till huvudklass 5, såsom matematik, astronomi, fysik, kemi, fysisk geografi, biologi, miljövård och medicin. @sv
scope note: Tähän bibliografiset julkaisut, jotka koskevat pääluokkaan 5 kuuluvia erikoisaloja, kuten matematiikkaa, tähtitiedettä, fysiikkaa, kemiaa, fyysistä maantiedettä, biologiaa, luonnonsuojelua tai lääketiedettä

Tekniikka. Teollisuus. Käsityö. Maa- ja metsätalous Kotitalous. Liiketalous. Liikenne
type: Concept
type: YKL-luokka
broader: Erikoisalojen luettelot
in scheme: YKL - Yleisten kirjastojen luokitusjärjestelmä
notation: 01.56
preferred label: Technology. Industry. Handicrafts. Agriculture and forestry. Domestic science. Business economy. Traffic @en
preferred label: Teknik. Industri. Hantverk och handarbete. Jord- och skogsbruk. Hushåll @sv
scope note: Hit bibliografier inom specialområden som hör till huvudklass 6, såsom teknik, industri, energi, data, trafik, trafikmedel, elektroteknik, elektronik, handarbete, byggnadsteknik, jordbruk, skogsbruk, hushåll, storhushåll, företagsekonomi, handel och marknadsföring @sv
scope note: Tähän bibliografiset julkaisut, jotka koskevat pääluokkaan 6 kuuluvia erikoisaloja, kuten tekniikkaa teollisuutta, energia-alaa, atk-alaa, liikennettä, liikennevälineitä, sähkötekniikkaa, elektroniikkaa, käsityötä, rakennustekniikkaa, maataloutta, metsätaloutta, kotitaloutta, laitostaloutta, liiketaloutta, kauppaa tai markkinointia

Taiteet. Liikunta
type: Concept
References: Henkilöbibliografiat
References: Taidenäyttelyt
type: YKL-luokka
alternative label: Bibliografiat, musiikki (01.57)
alternative label: Bibliografier, musik (01.57) @sv
alternative label: CD-levyt, musiikkibibliografiat (01.57)
alternative label: CD-skivor, musikbibliografier (01.57) @sv
alternative label: Diskografiat (01.57)
alternative label: Diskografier (01.57) @sv
alternative label: Elokuvaluettelot (01.57)
alternative label: Filmkataloger (01.57) @sv
alternative label: Filmografiat (01.57)
alternative label: Filmografier (01.57) @sv
alternative label: Grammofonskivkataloger, musikbibliografier (01.57) @sv
alternative label: Grammofonskivor, musikbibliografier (01.57) @sv
alternative label: Kasetit, musiikkibibliografiat (01.57)
alternative label: Kassetter, musikbibliografier (01.57) @sv
alternative label: Laserlevyt, musiikkibibliografiat (01.57)
alternative label: Laserskivor, musikbibliografier (01.57) @sv
alternative label: Ljudupptagningar, musibibliografier (01.57) @sv
alternative label: Ljudupptagningskataloger, musikbibliografier (01.57) @sv
alternative label: Musiikkibibliografiat (01.57)
alternative label: Musikbibliografier (01.57) @sv
alternative label: Notkataloger (01.57) @sv
alternative label: Nuottiluettelot (01.57)
alternative label: Partiturförteckningar (01.57) @sv
alternative label: Partituuriluettelot (01.57)
alternative label: Äänilevyluettelot, musiikkibibliografiat (01.57)
alternative label: Äänilevyt, musiikkibibliografiat (01.57)
alternative label: Ääniteluettelot, musiikkibibliografiat (01.57)
alternative label: Äänitteet, musiikkibibliografiat (01.57)
broader: Erikoisalojen luettelot
in scheme: YKL - Yleisten kirjastojen luokitusjärjestelmä
notation: 01.57
preferred label: Arts. Athletics @en
preferred label: Konst. Sport @sv
scope note: Hit bibliografier inom specialområden som hör till huvudklass 7, såsom konsthistoria, arkitektur, bildkonst, fotografering, konstindustri, scenkonst, filmkonst, musik, sport, motion, lekar och nöjen Musikbibliografier. Discografier. Filmografier @sv
scope note: Tähän bibliografiset julkaisut, jotka koskevat pääluokkaan 7 kuuluvia erikoisaloja, kuten taidehistoriaa, arkkitehtuuria, kuvataiteita, valokuvausta, taideteollisuutta, näyttämötaidetta, elokuvataidetta, musiikkia, urheilua, liikuntaa, leikkejä tai huveja Musiikkibibliografiat. Diskografiat. Filmografiat

Kaunokirjallisuus. Kirjallisuustiede. Kielitiede
type: Concept
References: Henkilöbibliografiat
type: YKL-luokka
alternative label: Kaunokirjallisuusluettelot (01.58)
alternative label: Skönlitteraturkataloger (01.58) @sv
broader: Erikoisalojen luettelot
in scheme: YKL - Yleisten kirjastojen luokitusjärjestelmä
notation: 01.58
preferred label: Belles-lettres. Literary studies. Linguistics @en
preferred label: Skönlitteratur. Litteraturvetenskap. Språkvetenskap @sv
scope note: Hit bibliografier inom specialområden som hör till huvudklass 8, såsom skönlitteratur, litteraturhistoria, litteraturforskning och språkvetenskap @sv
scope note: Tähän bibliografiset julkaisut, jotka koskevat pääluokkaan 8 kuuluvia erikoisaloja, kuten kaunokirjallisuutta, kirjallisuudenhistoriaa, kirjallisuudentutkimusta tai kielitiedettä

Historia
type: Concept
type: YKL-luokka
broader: Erikoisalojen luettelot
in scheme: YKL - Yleisten kirjastojen luokitusjärjestelmä
notation: 01.59
preferred label: History @en
scope note: Hit bibliografier inom specialområden som hör till huvudklass 9, såsom allmän historia, arkeologi, kulturhistoria, lokalhistoria och personhistoria @sv
scope note: Tähän bibliografiset julkaisut, jotka koskevat pääluokkaan 9 kuuluvia erikoisaloja, kuten yleistä historiaa, arkeologiaa, kulttuurihistoriaa, paikallishistoriaa tai henkilöhistoriaa

Kirjastojen yhteisluettelot
type: Concept
References: Paikallisbibliografiat
References: Henkilöbibliografiat
References: Erikoisalojen luettelot
References: Yksittäisten kirjastojen luettelot
References: KIRJASTOTOIMI. KIRJASTOTIEDE. INFORMATIIKKA
alternative label: Abstraktijulkaisut (01.2 ... 01.8)
alternative label: Abstraktpublikationer (01.2 ... 01.8) @sv
alternative label: Aikakauslehti-indeksit (01.2 ... 01.8)
alternative label: Arvostelevat luettelot (01.2 ... 01.8)
alternative label: Barnlitteratur, bibliografier (01.2 ... 01.8) @sv
alternative label: Bibliografiset tietokannat (01.2 ... 01.8)
alternative label: Bibliografiska databaser (01.2 ... 01.8) @sv
alternative label: Bibliotek, mediekataloger (01.7 ... 01.8) @sv
alternative label: Bibliotek, samkataloger (01.7) @sv
alternative label: Bildkassetter, kataloger (01.2 ... 01.8) @sv
alternative label: Bildskivor, kataloger (01.2 ... 01.8) @sv
alternative label: Bokkataloger (01.2 ... 01.8) @sv
alternative label: CD-ROM, kataloger (01.2 ... 01.8) @sv
alternative label: CD-ROM-levyt, luettelot (01.2 ... 01.8)
alternative label: CD-levyt, luettelot (01.2 ... 01.8)
alternative label: DVD-R-levyt, luettelot (01.2 ... 01.8)
alternative label: DVD-ROM-levyt, luettelot (01.2 ... 01.8)
alternative label: DVD-levyt, luettelot (01.2 ... 01.8)
alternative label: Diakuvaluettelot (01.2 ... 01.8)
alternative label: E-kirjat, luettelot (01.2 ... 01.8)
alternative label: E-lehdet, luettelot (01.2 ... 01.8)
alternative label: Elektroniset julkaisut, luettelot (01.2 ... 01.8)
alternative label: Indeksijulkaisut (01.2 ... 01.8)
alternative label: Kasetit, luettelot (01.2 ... 01.8)
alternative label: Kasettiluettelot (01.2 ... 01.8)
alternative label: Kausijulkaisuluettelot (01.2 ... 01.8)
alternative label: Kirjallisuuskatsaukset (01.2 ... 01.8)
alternative label: Kirjallisuusluettelot (01.2 ... 01.8)
alternative label: Kirjaluettelot (01.2 ... 01.8)
alternative label: Kirjastot, aineistoluettelot (01.7 ... 01.8)
alternative label: Kirjastot, yhteisluettelot (01.7)
alternative label: Kuvakasetit, luettelot (01.2 ... 01.8)
alternative label: Kuvalevyt, luettelot (01.2 ... 01.8)
alternative label: Kuvatallenteet, luettelot (01.2 ... 01.8)
alternative label: Laserlevyt, luettelot (01.2 ... 01.8)
alternative label: Lastenkirjallisuus, bibliografiat (01.2 ... 01.8)
alternative label: Lehdet, luettelot (01.2 ... 01.8)
alternative label: Lehtiluettelot (01.2 ... 01.8)
alternative label: Luettelot, bibliografiset (01.2 ... 01.8)
alternative label: Nuortenkirjallisuus, bibliografiat (01.2 ... 01.8)
alternative label: Optiset levyt, luettelot (01.2 ... 01.8)
alternative label: Optiset tallenteet, luettelot (01.2 ... 01.8)
alternative label: Referaattijulkaisut (01.2 ... 01.8)
alternative label: Rekisterit, bibliografiset (01.2 ... 01.8)
alternative label: SACD-levyt, luettelot (01.2 ... 01.8)
alternative label: Sanomalehtiluettelot (01.2 ... 01.8)
alternative label: Sarjajulkaisuluettelot (01.2 ... 01.8)
alternative label: Sähköiset julkaisut, luettelot (01.2 ... 01.8)
alternative label: Sähkökirjat, luettelot (01.2 ... 01.8)
alternative label: Tallenteet, luettelot (01.2 ... 01.8)
alternative label: Tiedostot, bibliografiset (01.2 ... 01.8)
alternative label: Tietokannat, bibliografiset (01.2 ... 01.8)
alternative label: Tietokirjallisuusluettelot (01.2 ... 01.8)
alternative label: Tietopankit, bibliografiset (01.2 ... 01.8)
alternative label: Tiivistelmäjulkaisut (01.2 ... 01.8)
alternative label: Valikoimaluettelot (01.2 ... 01.8)
alternative label: Verkkojulkaisut, luettelot (01.2 ... 01.8)
alternative label: Verkkokirjat, luettelot (01.2 ... 01.8)
alternative label: Verkkolehdet, luettelot (01.2 ... 01.8)
alternative label: Videokasetit, luettelot (01.2 ... 01.8)
alternative label: Videolevyt, luettelot (01.2 ... 01.8)
alternative label: Videotallenteet, luettelot (01.2 ... 01.8)
alternative label: Yhteisluettelot, kirjastot (01.7)
alternative label: Äänikasetit, luettelot (01.2 ... 01.8)
alternative label: Äänikirjat, luettelot (01.2 ... 01.8)
alternative label: Äänilevyluettelot (01.2 ... 01.8)
alternative label: Ääninauhat, luettelot (01.2 ... 01.8)
alternative label: Ääniteluettelot (01.2 ... 01.8)
alternative label: Äänitteet, luettelot (01.2 ... 01.8)
broader: BIBLIOGRAFIA
in scheme: YKL - Yleisten kirjastojen luokitusjärjestelmä
notation: 01.7
scope note: Hit bibliotekens allmänna samkataloger oavsett katalogens och dess föremåls medietyp Hit också gemensamma urvalskataloger för bibliotek Hit också samkataloger för bibliotek som innehåller periodiska publikationer, ljud- och bildupptagningar @sv
scope note: Tähän kirjastojen yleiset yhteisluettelot luettelon ja sen kohteiden materiaalityypistä riippumatta Tähän myös kirjastojen yhteiset valikoimaluettelot Tähän myös kausijulkaisuja, äänitteitä tai kuvatallenteita sisältävät kirjastojen yhteisluettelot

Yksittäisten kirjastojen luettelot
type: Concept
References: Paikallisbibliografiat
References: Henkilöbibliografiat
References: Erikoisalojen luettelot
References: Kirjastojen yhteisluettelot
References: KIRJASTOTOIMI. KIRJASTOTIEDE. INFORMATIIKKA
References: Yksittäiset kirjastot
alternative label: Abstraktijulkaisut (01.2 ... 01.8)
alternative label: Abstraktpublikationer (01.2 ... 01.8) @sv
alternative label: Aikakauslehti-indeksit (01.2 ... 01.8)
alternative label: Arvostelevat luettelot (01.2 ... 01.8)
alternative label: Barnlitteratur, bibliografier (01.2 ... 01.8) @sv
alternative label: Bibliografiset tietokannat (01.2 ... 01.8)
alternative label: Bibliografiska databaser (01.2 ... 01.8) @sv
alternative label: Bibliotek, mediekataloger (01.7 ... 01.8) @sv
alternative label: Bildkassetter, kataloger (01.2 ... 01.8) @sv
alternative label: Bildskivor, kataloger (01.2 ... 01.8) @sv
alternative label: Bokkataloger (01.2 ... 01.8) @sv
alternative label: CD-ROM, kataloger (01.2 ... 01.8) @sv
alternative label: CD-ROM-levyt, luettelot (01.2 ... 01.8)
alternative label: CD-levyt, luettelot (01.2 ... 01.8)
alternative label: CD-skivor, kataloger (01.2 ... 01.8) @sv
alternative label: DVD-R-levyt, luettelot (01.2 ... 01.8)
alternative label: DVD-R-skivor, kataloger (01.2 ... 01.8) @sv
alternative label: DVD-ROM-levyt, luettelot (01.2 ... 01.8)
alternative label: DVD-levyt, luettelot (01.2 ... 01.8)
alternative label: Diakuvaluettelot (01.2 ... 01.8)
alternative label: E-kirjat, luettelot (01.2 ... 01.8)
alternative label: E-lehdet, luettelot (01.2 ... 01.8)
alternative label: Elektroniset julkaisut, luettelot (01.2 ... 01.8)
alternative label: Indeksijulkaisut (01.2 ... 01.8)
alternative label: Kasetit, luettelot (01.2 ... 01.8)
alternative label: Kasettiluettelot (01.2 ... 01.8)
alternative label: Kausijulkaisuluettelot (01.2 ... 01.8)
alternative label: Kirjallisuuskatsaukset (01.2 ... 01.8)
alternative label: Kirjallisuusluettelot (01.2 ... 01.8)
alternative label: Kirjaluettelot (01.2 ... 01.8)
alternative label: Kirjastot, aineistoluettelot (01.7 ... 01.8)
alternative label: Kuvakasetit, luettelot (01.2 ... 01.8)
alternative label: Kuvalevyt, luettelot (01.2 ... 01.8)
alternative label: Kuvatallenteet, luettelot (01.2 ... 01.8)
alternative label: Laserlevyt, luettelot (01.2 ... 01.8)
alternative label: Lastenkirjallisuus, bibliografiat (01.2 ... 01.8)
alternative label: Lehdet, luettelot (01.2 ... 01.8)
alternative label: Lehtiluettelot (01.2 ... 01.8)
alternative label: Luettelot, bibliografiset (01.2 ... 01.8)
alternative label: Nuortenkirjallisuus, bibliografiat (01.2 ... 01.8)
alternative label: Optiset levyt, luettelot (01.2 ... 01.8)
alternative label: Optiset tallenteet, luettelot (01.2 ... 01.8)
alternative label: Referaattijulkaisut (01.2 ... 01.8)
alternative label: Rekisterit, bibliografiset (01.2 ... 01.8)
alternative label: SACD-levyt, luettelot (01.2 ... 01.8)
alternative label: Sanomalehtiluettelot (01.2 ... 01.8)
alternative label: Sarjajulkaisuluettelot (01.2 ... 01.8)
alternative label: Sähköiset julkaisut, luettelot (01.2 ... 01.8)
alternative label: Sähkökirjat, luettelot (01.2 ... 01.8)
alternative label: Tallenteet, luettelot (01.2 ... 01.8)
alternative label: Tiedostot, bibliografiset (01.2 ... 01.8)
alternative label: Tietokannat, bibliografiset (01.2 ... 01.8)
alternative label: Tietokirjallisuusluettelot (01.2 ... 01.8)
alternative label: Tietopankit, bibliografiset (01.2 ... 01.8)
alternative label: Tiivistelmäjulkaisut (01.2 ... 01.8)
alternative label: Valikoimaluettelot (01.2 ... 01.8)
alternative label: Verkkojulkaisut, luettelot (01.2 ... 01.8)
alternative label: Verkkokirjat, luettelot (01.2 ... 01.8)
alternative label: Verkkolehdet, luettelot (01.2 ... 01.8)
alternative label: Videokasetit, luettelot (01.2 ... 01.8)
alternative label: Videolevyt, luettelot (01.2 ... 01.8)
alternative label: Videotallenteet, luettelot (01.2 ... 01.8)
alternative label: Äänikasetit, luettelot (01.2 ... 01.8)
alternative label: Äänikirjat, luettelot (01.2 ... 01.8)
alternative label: Äänilevyluettelot (01.2 ... 01.8)
alternative label: Ääninauhat, luettelot (01.2 ... 01.8)
alternative label: Ääniteluettelot (01.2 ... 01.8)
alternative label: Äänitteet, luettelot (01.2 ... 01.8)
broader: BIBLIOGRAFIA
in scheme: YKL - Yleisten kirjastojen luokitusjärjestelmä
notation: 01.8
scope note: Hit enskilda biblioteks allmänna kataloger oavsett katalogens och dess föremåls medietyp Hit också enskilda biblioteks urvalskataloger Hit också enskilda biblioteks kataloger över seriella publikationer och ljud- och bildupptagningar @sv
scope note: Tähän yksittäisten kirjastojen yleiset luettelot luettelon ja sen kohteiden materiaalityypistä riippumatta Tähän myös yksittäisten kirjastojen valikoimaluettelot Tähän myös kausijulkaisuja, äänitteitä tai kuvatallenteita sisältävät yksittäisten kirjastojen luettelot

KIRJASTOTOIMI. KIRJASTOTIEDE. INFORMATIIKKA
type: Concept
References: KIRJA-ALA
References: Kirjojen keräily. Bibliofilia
References: BIBLIOGRAFIA
References: Kirjastojen yhteisluettelot
References: Yksittäisten kirjastojen luettelot
References: Kulttuurirakennukset
References: KIRJALLISUUSTIEDE
References: <http://urn.fi/URN:NBN:fi:au:ykl:00.6>
type: YKL-luokka
alternative label: Allmänna bibliotek (02+) @sv
alternative label: Bibliotek (02+) @sv
alternative label: Bibliotek, användarundersökningar (02+) @sv
alternative label: Biblioteksbranschen (02+) @sv
alternative label: Biblioteksbranschen, utbildning (02+) @sv
alternative label: Biblioteksservice (02+) @sv
alternative label: Bibliotekssociologi (02+) @sv
alternative label: Biblioteksverksamhet (02+) @sv
alternative label: Biblioteksvetenskap (02+) @sv
alternative label: Biblioteksväsen (02+) @sv
alternative label: Erikoiskirjastot (02+)
alternative label: Informaatiopalvelulaitokset (02+)
alternative label: Informatiikka (02+)
alternative label: Informatik (02+) @sv
alternative label: Informationstjänst, organisationer (02+) @sv
alternative label: Kirjastoala (02+)
alternative label: Kirjastoala, koulutus (02+)
alternative label: Kirjastolaitos (02+)
alternative label: Kirjastonkäyttötutkimukset (02+)
alternative label: Kirjastopalvelut (02+)
alternative label: Kirjastososiologia (02+)
alternative label: Kirjastot (02+)
alternative label: Kirjastotiede (02+)
alternative label: Kirjastotoimi (02+)
alternative label: Privata bibliotek (02+) @sv
alternative label: Specialbibliotek (02+) @sv
alternative label: Tieteelliset kirjastot (02+)
alternative label: Vetenskapliga bibliotek (02+) @sv
alternative label: Yksityiset kirjastot (02+)
alternative label: Yleiset kirjastot (02+)
broader: YLEISTEOKSET. KIRJA-ALA. KIRJASTOTOIMI YLEINEN KULTTUURIPOLITIIKKA. JOUKKOTIEDOTUS
in scheme: YKL - Yleisten kirjastojen luokitusjärjestelmä
narrower: Kirjastojen hallinto ja suunnittelu
narrower: Kirjastonhoito. Kirjastotekniikka
narrower: Musiikkikirjastotyö
narrower: Lastenkirjastotyö. Nuortenkirjastotyö
narrower: Erityisten väestöryhmien kirjastopalvelut
narrower: Yksittäiset kirjastot
notation: 02
preferred label: BIBLIOTEKSVERKSAMHET. BIBLIOTEKSVETENSKAP. INFORMATIK @sv
preferred label: LIBRARIES. LIBRARY SCIENCE. INFORMATICS @en
scope note: Hit allmänna verk om bibliotek, biblioteksverksamhet och biblioteksväsen i olika länder Bibliotekets ställning och uppgift Hit och till underklasserna allmänna, privata och vetenskapliga bibliotek, specialbibliotek samt informationstjänst Hit och till underklasserna också biblioteksvetenskap och informatik samt utbildning inom biblioteksbranschen Hit och till underklasserna också bibliotekssociologi och forskning i biblioteksanvändning Om verket behandlar både bok- och biblioteksbranschen, ges företräde åt klass 00 @sv
scope note: Tähän kirjastoja, kirjastotointa ja eri maiden kirjastolaitosta koskevat yleisteokset Kirjaston asema ja tehtävä Tähän ja alaluokkiin yleiset, yksityiset, tieteelliset ja erikoiskirjastot sekä informaatiopalvelulaitokset Tähän ja alaluokkiin myös kirjastotiede ja informatiikka sekä kirjastoalan koulutus Tähän ja alaluokkiin myös kirjastososiologia ja kirjaston käytön tutkimus Jos teos koskee sekä kirja- että kirjastoalaa, annetaan etusija luokalle 00

Kirjastojen hallinto ja suunnittelu
type: Concept
References: Kirjastoautomaatio
References: Kulttuurirakennukset
type: YKL-luokka
alternative label: Bibliotek, PR-verksamhet (02.1) @sv
alternative label: Bibliotek, ekonomi (02.1) @sv
alternative label: Bibliotek, informationsverksamhet (02.1) @sv
alternative label: Bibliotek, personaladministration (02.1) @sv
alternative label: Bibliotek, personalpolitik (02.1) @sv
alternative label: Bibliotek, planering på lång sikt (02.1) @sv
alternative label: Bibliotek, planering på medellång sikt (02.1) @sv
alternative label: Biblioteksadministration (02.1) @sv
alternative label: Biblioteksförordningar (02.1) @sv
alternative label: Bibliotekslagstiftning (02.1) @sv
alternative label: Biblioteksnämnder (02.1) @sv
alternative label: Biblioteksnätverk (02.1) @sv
alternative label: Biblioteksplanering (02.1) @sv
alternative label: Biblioteksrationalisering (02.1) @sv
alternative label: Bibliotekssamarbete (02.1) @sv
alternative label: Centralbibliotek och landskapsbibliotek, systemet med (02.1) @sv
alternative label: Centralbiblioteksverksamhet (02.1) @sv
alternative label: Information, bibliotek (02.1) @sv
alternative label: Keskuskirjasto-maakuntakirjastojärjestelmä (02.1)
alternative label: Keskuskirjastotoiminta (02.1)
alternative label: Kirjastoasetukset (02.1)
alternative label: Kirjastohallinto (02.1)
alternative label: Kirjastolainsäädäntö (02.1)
alternative label: Kirjastolautakunnat (02.1)
alternative label: Kirjastorationalisointi (02.1)
alternative label: Kirjastosuunnittelu (02.1)
alternative label: Kirjastot, KTS-suunnitelmat (02.1)
alternative label: Kirjastot, PR-toiminta (02.1)
alternative label: Kirjastot, PTS-suunnitelmat (02.1)
alternative label: Kirjastot, henkilöstöhallinto (02.1)
alternative label: Kirjastot, henkilöstöpolitiikka (02.1)
alternative label: Kirjastot, talous (02.1)
alternative label: Kirjastot, tiedotustoiminta (02.1)
alternative label: Kirjastoverkot (02.1)
alternative label: Kirjastoyhteistyö (02.1)
alternative label: Landskapsbibliotekssystem (02.1) @sv
alternative label: Maakuntakirjastojärjestelmä (02.1)
alternative label: TINFO (02.1)
alternative label: Tiedotus, kirjastot (02.1)
broader: KIRJASTOTOIMI. KIRJASTOTIEDE. INFORMATIIKKA
in scheme: YKL - Yleisten kirjastojen luokitusjärjestelmä
notation: 02.1
preferred label: Administration och planering av bibliotek @sv
preferred label: Library administration and planning. @en
scope note: Hit allmänna verk om biblioteksadministration och -planering Allmän och intern administration och planering av allmänna, privata, och vetenskapliga bibliotek och specialbibliotek samt institutioner för informationstjänst Samarbete mellan bibliotek. Biblioteksnät Systemet med centralbibliotek och landskapsbibliotek Rationalisering. Ekonomi. Planer på medellång och lång sikt Personaladministration och -politik. Administrativa avdelningar Bibliotekslagar och -förordningar. Biblioteksnämnder Information och PR-verksamhet Administration, planering och rationalisering som rör bibliotekets verksamhet inom något specialområde förs efter område till klasserna 02.31-02.7 @sv
scope note: Tähän kirjastohallinnon ja -suunnittelun yleisteokset Yleisten, yksityisten, tieteellisten ja erikois- kirjastojen sekä informaatiopalvelulaitosten yleinen ja sisäinen hallinto ja suunnittelu Kirjastojen välinen yhteistyö. Kirjastoverkot Keskuskirjasto-maakuntakirjastojärjestelmä Rationalisointi. Talous. KTS- ja PTS-suunnitelmat Henkilöstöhallinto ja -politiikka. Hallinto-osastot Kirjastolait ja -asetukset. Kirjastolautakunnat Tiedotus- ja PR-toiminta Tiettyä kirjaston erikoisalan toimintaa koskeva hallinto, suunnittelu ja rationalisointi sijoitetaan alan mukaan luokkiin 02.31-02.7

Kirjastonhoito. Kirjastotekniikka
type: Concept
References: Kirjastojen hallinto ja suunnittelu
References: Musiikkikirjastotyö
References: Lastenkirjastotyö. Nuortenkirjastotyö
References: Erityisten väestöryhmien kirjastopalvelut
alternative label: AV-aineisto, kirjastonhoito (02.3+)
alternative label: AV-material, biblioteksarbete (02.3+) @sv
alternative label: Artoteekit, kirjastonhoito (02.3+)
alternative label: Artotek, biblioteksarbete (02.3+) @sv
alternative label: Audiovisuaalinen aineisto, kirjastonhoito (02.3+)
alternative label: Audiovisuella material, biblioteksarbete (02.3+) @sv
alternative label: Bibliotek, användningsregler (02.3+) @sv
alternative label: Bibliotek, handledning i användning (02.3+) @sv
alternative label: Bibliotek, kundtjänst (02.3+) @sv
alternative label: Bibliotek, rådgivning (02.3+) @sv
alternative label: Bibliotek, undervisning i användning (02.3+) @sv
alternative label: Bibliotekariens arbete (02.3+) @sv
alternative label: Biblioteksarbete (02.3+) @sv
alternative label: Biblioteksfunktionärens arbete (02.3+) @sv
alternative label: Biblioteksteknik (02.3+) @sv
alternative label: Bokbussverksamhet (02.3+) @sv
alternative label: Bokbåtsverksamhet (02.3+) @sv
alternative label: Bruksavgifter, bibliotek (02.3+) @sv
alternative label: Diabilder, biblioteksarbete (02.3+) @sv
alternative label: Diakuvat, kirjastonhoito (02.3+)
alternative label: Digitaaliset tallenteet, kirjastonhoito (02.3+)
alternative label: Digitala dokument, biblioteksarbete (02.3+) @sv
alternative label: Elektroniska dokument, biblioteksarbete (02.3+) @sv
alternative label: Elokuvatallenteet, kirjastonhoito (02.3+)
alternative label: Filminspelningar, biblioteksarbete (02.3+) @sv
alternative label: Fotografier, biblioteksarbete (02.3+) @sv
alternative label: Hembygdssamlingar, biblioteksarbete (02.3+) @sv
alternative label: Informaatikon työ (02.3+)
alternative label: Informatikerns arbete (02.3+) @sv
alternative label: Kartoteekit, kirjastonhoito (02.3+)
alternative label: Kartotek, biblioteksarbete (02.3+) @sv
alternative label: Kirjasto, käyttösäännöt (02.3+)
alternative label: Kirjasto, käytön opastus (02.3+)
alternative label: Kirjastoautotoiminta (02.3+)
alternative label: Kirjaston käytön opetus (02.3+)
alternative label: Kirjastonhoitajan työ (02.3+)
alternative label: Kirjastonhoito (02.3+)
alternative label: Kirjastot, asiakaspalvelu (02.3+)
alternative label: Kirjastot, neuvonta (02.3+)
alternative label: Kirjastotekniikka (02.3+)
alternative label: Kirjastovenetoiminta (02.3+)
alternative label: Kirjastovirkailijan työ (02.3+)
alternative label: Kotiseutukokoelmat, kirjastonhoito (02.3+)
alternative label: Kuvatallenteet, kirjastonhoito (02.3+)
alternative label: Käsikirjoitukset, kirjastonhoito (02.3+)
alternative label: Käyttömaksut, kirjastot (02.3+)
alternative label: Lehdet, kirjastonhoito (02.3+)
alternative label: Lehtikokoelmat, kirjastonhoito (02.3+)
alternative label: Ljudupptagningar, biblioteksmedier (02.3+) @sv
alternative label: Manuskript, biblioteksarbete (02.3+) @sv
alternative label: Mikrofilmer, biblioteksarbete (02.3+) @sv
alternative label: Mikrofilmit, kirjastonhoito (02.3+)
alternative label: Mikrokort, biblioteksarbete (02.3+) @sv
alternative label: Mikrokortit, kirjastonhoito (02.3+)
alternative label: Moniviestimet, kirjastonhoito (02.3+)
alternative label: Multimedier, biblioteksarbete (02.3+) @sv
alternative label: Optiset levyt, kirjastonhoito (02.3+)
alternative label: Optiska skivor, biblioteksarbete (02.3+) @sv
alternative label: Tidningar och tidskrifter, biblioteksarbete (02.3+) @sv
alternative label: Tidningssamlingar, biblioteksarbete (02.3+) @sv
alternative label: Valokuvat, kirjastonhoito (02.3+)
alternative label: Videogram, biblioteksarbete (02.3+) @sv
alternative label: Äänitteet, kirjastoaineisto (02.3+)
broader: KIRJASTOTOIMI. KIRJASTOTIEDE. INFORMATIIKKA
in scheme: YKL - Yleisten kirjastojen luokitusjärjestelmä
narrower: Kirjastoautomaatio
narrower: Kirjastoaineisto. Kokoelmien hoito
narrower: Lainaus
narrower: Tietopalvelu. Informaatiopalvelu
narrower: Laajennettu kirjastotoiminta
notation: 02.3
preferred label: Biblioteksarbete. Biblioteksteknik @sv
preferred label: Library management. Library techniques @en
scope note: Hit allmänna verk om och allmänna vägledningar i biblioteksarbete och biblioteksteknik Hur man använder biblioteket: regler, handböcker och vägledning Kundtjänst och rådgivning Bibliotekariens, informatikers och bibliotekstjänstemannens arbete Hit också bokbussar Hit och till underklasserna också verk om skötsel och användning av bibliotekens specialsamlingar eller verk som gäller annat material än böcker Hit och till underklasserna t.ex. lokala samlingar, artotek, AV-material, kartor, tidningar, bildupptagningar, fotografier, diabilder, video, filmer, manus, mikrofilmer, mikrokort, bandinspelningar och multimedia i biblioteket @sv
scope note: Tähän kirjastonhoidon ja kirjastotekniikan yleisteokset ja yleiset oppaat Kirjaston käytön säännöt, oppaat ja opastus Kirjastonhoitajan, informaatikon ja kirjastovirkailijan työ Tähän myös kirjastoauto- ja kirjastovenetoiminta Tähän ja alaluokkiin myös teokset, jotka koskevat kirjaston erikoiskokoelmien hoitoa ja käyttöä tai muuta kuin kirja-aineistoa kirjastossa Tähän ja alaluokkiin esim. paikalliskokoelmat, artoteekkitoiminta, av-aineisto, kartat, lehdet, kuvatallenteet, valokuvat, diakuvat, videot, elokuvat, käsikirjoitukset, mikrofilmit, mikrokortit, äänitteet ja moniviestimet kirjastossa

Kirjastoautomaatio
type: Concept
References: Kirjastojen hallinto ja suunnittelu
type: YKL-luokka
alternative label: Bibliotek, adb-system (02.31) @sv
alternative label: Biblioteksautomation (02.31) @sv
alternative label: Kirjastoautomaatio (02.31)
alternative label: Kirjastot, atk-järjestelmät (02.31)
broader: Kirjastonhoito. Kirjastotekniikka
in scheme: YKL - Yleisten kirjastojen luokitusjärjestelmä
notation: 02.31
preferred label: Biblioteksautomatisering @sv
preferred label: Library automation @en
scope note: Hit allmänna verk om biblioteksautomatisering eller bibliotekens datasystem Tillämpning av biblioteksautomatisering på specialområden inom biblioteksskötseln förs enligt område till klasserna 02.32-02.7 @sv
scope note: Tähän kirjastoautomaatiota tai kirjastojen atk-järjestelmiä koskevat yleisteokset Kirjastoautomaation sovellukset kirjastonhoidon erikoisaloille sijoitetaan alan mukaan luokkiin 02.32-02.7

Kirjastoaineisto. Kokoelmien hoito
type: Concept
References: Kirjansidonta
References: BIBLIOGRAFIA
References: Kirjastojen yhteisluettelot
References: Yksittäisten kirjastojen luettelot
References: Musiikkikirjastotyö
type: YKL-luokka
alternative label: Aakkostussäännöt, kirjastonhoito (02.32)
alternative label: Alfabetiseringsregler, biblioteksarbete (02.32) @sv
alternative label: Anskaffning, biblioteksmedier (02.32) @sv
alternative label: Avskrivningar, biblioteksmedier (02.32) @sv
alternative label: Barnbibliotek, samlingsarbete (02.32+) @sv
alternative label: Biblioteksmedier, iståndsättning (02.32) @sv
alternative label: Biblioteksmedier, lagring (02.32) @sv
alternative label: Biblioteksmedier, skötsel av samlingar (02.32+) @sv
alternative label: Biblioteksmedier, val och anskaffning (02.32) @sv
alternative label: Bokval, biblioteksarbete (02.32) @sv
alternative label: Byten, biblioteksmedier (02.32) @sv
alternative label: Databaser, datalagring, biblioteksmedier (02.32+) @sv
alternative label: Datalagringssystem, biblioteksmedier (02.32+) @sv
alternative label: Dokumentation, biblioteksmedier (02.32+) @sv
alternative label: Dokumentointi, kirjastoaineisto (02.32+)
alternative label: Friexemplar, biblioteksmedier (02.32) @sv
alternative label: Gåvor, biblioteksmedier (02.32) @sv
alternative label: Hankinta, kirjastoaineisto (02.32)
alternative label: Hyllordning, biblioteksarbete (02.32) @sv
alternative label: Hyllyjärjestys, kirjastonhoito (02.32)
alternative label: Inköpsorganisation, biblioteksmedier (02.32) @sv
alternative label: Inventering, biblioteksmedier (02.32) @sv
alternative label: Inventointi, kirjastoaineisto (02.32)
alternative label: Kirjanvalinta, kirjastonhoito (02.32)
alternative label: Kirjastoaineisto, kokoelmien hoito (02.32+)
alternative label: Kirjastoaineisto, käyttökuntoon käsittely (02.32)
alternative label: Kirjastoaineisto, valinta ja hankinta (02.32)
alternative label: Kirjastoaineisto, varastointi (02.32)
alternative label: Kokoelmatyö, kirjastot (02.32+)
alternative label: Kortistot, kirjastonhoito (02.32+)
alternative label: Kortregister, biblioteksarbete (02.32+) @sv
alternative label: Koulukirjastot, kokoelmatyö (02.32+)
alternative label: Lagring, biblioteksmedier (02.32) @sv
alternative label: Lahjat, kirjastoaineisto (02.32)
alternative label: Lajittelusäännöt, kirjastonhoito (02.32)
alternative label: Lastenkirjastot, kokoelmatyö (02.32+)
alternative label: Metadata, biblioteksmedier (02.32+) @sv
alternative label: Metadata, kirjastoaineisto (02.32+)
alternative label: Osto-organisaatio, kirjastoaineisto (02.32)
alternative label: Poistot, kirjastoaineisto (02.32)
alternative label: Register, informationslagring, biblioteksmedier (02.32+) @sv
alternative label: Rekisterit, tiedontallennus, kirjastoain. (02.32+)
alternative label: Samlingsarbete, bibliotek (02.32+) @sv
alternative label: Siirrot, kirjastoaineisto (02.32)
alternative label: Skolbibliotek, samlingsarbete (02.32+) @sv
alternative label: Sorteringsregler, biblioteksarbete (02.32) @sv
alternative label: Tiedontallennusjärjestelmät, kirjastoaineisto (02.32+)
alternative label: Tiedostot, tiedontallennus, kirjastoain. (02.32+)
alternative label: Tietokannat, tiedontallennus, kirjastoain. (02.32+)
alternative label: Vaihdot, kirjastoaineisto (02.32)
alternative label: Val, biblioteksmedier (02.32) @sv
alternative label: Valinta, kirjastoaineisto (02.32)
alternative label: Vapaakappaleet, kirjastoaineisto (02.32)
alternative label: Varastointi, kirjastoaineisto (02.32)
alternative label: Överföringar, biblioteksmedier (02.32) @sv
broader: Kirjastonhoito. Kirjastotekniikka
in scheme: YKL - Yleisten kirjastojen luokitusjärjestelmä
narrower: Sisällönkuvailu
narrower: Luettelointi
notation: 02.32
preferred label: Biblioteksmedier. Skötsel av samlingarna @sv
preferred label: Library media. Care of collections @en
scope note: Hit oavsett materialtyp urval och förvärv av biblioteksmedier Anskaffningsmetoder. Underhåll av biblioteksmedier Köp. Byten. Gåvor. Friexemplar Inventering. Gallring. Omplacering. Magasinering Iståndsättning av biblioteksmedier Kontroll av samlingarna. Underhåll av samlingarna Lagring av information om samlingarna Utarbetande och underhåll av bibliotekens bibliografiska kartotek, register och databaser Regler för alfabetisering och sortering i biblioteket Hit också urval och förvärv av biblioteksmedier för barnbibliotek, skolbibliotek och biblioteksservice för särskilda folkgrupper Om verket behandlar både lagring och sökning av information, ges företräde åt klass 02.32+ @sv
scope note: Tähän materiaalityypistä riippumatta kirjastoaineiston valinta ja hankinta Hankintatavat. Kirjastoaineiston ylläpito Ostot. Vaihdot. Lahjat. Vapaakappaleet Inventoinnit. Poistot. Siirrot. Varastointi Kirjastoaineiston käyttökuntoon käsittely Kokoelmien hallinta. Kokoelmien huolto Kokoelmia koskevien tietojen tallennus Kirjaston bibliografisten kortistojen, tiedostojen ja tietokantojen rakentaminen ja ylläpito Kirjaston aakkostus- ja lajittelusäännöt Tähän myös lastenkirjastoa, koulukirjastoa tai erityisten väestöryhmien kirjastopalveluja koskeva aineiston valinta ja hankinta Jos teos koskee sekä tiedon tallennusta että hakua, annetaan etusija luokalle 02.32+

Sisällönkuvailu
type: Concept
References: Luettelointi
References: Tietopalvelu. Informaatiopalvelu
type: YKL-luokka
alternative label: Asiasanastot (02.321)
alternative label: Asiasanoitus (02.321)
alternative label: Indeksointi (02.321)
alternative label: Indeksointi, musiikin (02.321)
alternative label: Indexering (02.321) @sv
alternative label: Indexering, av musik (02.321) @sv
alternative label: Innehållsbeskrivning (02.321) @sv
alternative label: Klassificering, musikens (02.321) @sv
alternative label: Klassifikation, biblioteksmedier (02.321) @sv
alternative label: Klassifikationssystem, biblioteksmedier (02.321) @sv
alternative label: Luokitus, kirjastoaineisto (02.321)
alternative label: Luokitus, musiikin (02.321)
alternative label: Luokitusjärjestelmät, kirjastoaineisto (02.321)
alternative label: Musiikin luokitus ja indeksointi (02.321)
alternative label: Musiikkiaineisto, luokitus ja indeksointi (02.321)
alternative label: Musik, klassificering och indexering (02.321) @sv
alternative label: Musikmedier, klassificering och indexering (02.321) @sv
alternative label: Sisällönkuvailu (02.321)
alternative label: Tesaurukset (02.321)
alternative label: Tesaurusar (02.321) @sv
alternative label: Ämnesord (02.321) @sv
alternative label: Ämnesordsregister (02.321) @sv
broader: Kirjastoaineisto. Kokoelmien hoito
in scheme: YKL - Yleisten kirjastojen luokitusjärjestelmä
notation: 02.321
preferred label: Content description @en
preferred label: Innehållsanalys @sv
scope note: Kirjastoaineiston luokitus ja indeksointi Luokitusjärjestelmät. Asiasanastot. Tesaurukset Tähän myös materiaalityypistä riippumatta erikoiskokoelmien ja erikoisalojen luokittaminen, indeksointi ja sisällönkuvailu sekä erikoisalojen luokitusjärjestelmät, asiasanastot ja tesaurukset
scope note: Klassifikation och indexering av biblioteksmedier Klassifikationssystem. Ämnesordlistor. Tesaurusar Hit också oavsett medietyp klassificering, indexering och innehållsanalys av specialsamlingar och specialområden, dessutom klassifikationssystem, ämnesordlistor och tesaurusar inom specialområden @sv

Luettelointi
type: Concept
References: Kirjastojen yhteisluettelot
References: Yksittäisten kirjastojen luettelot
References: Sisällönkuvailu
References: Arkistot
type: YKL-luokka
alternative label: Katalogisering, biblioteksmedier (02.323) @sv
alternative label: Katalogiseringsformat, biblioteksmedier (02.323) @sv
alternative label: Katalogiseringsregler, biblioteksmedier (02.323) @sv
alternative label: Luettelointi, kirjastoaineisto (02.323)
alternative label: Luettelointiformaatit, kirjastoaineisto (02.323)
alternative label: Luettelointisäännöt, kirjastoaineisto (02.323)
alternative label: Marc-formaatit (02.323)
alternative label: Marc-format (02.323) @sv
alternative label: Musiikin luettelointi (02.323)
alternative label: Musiikkiaineisto, luettelointi (02.323)
alternative label: Musik, katalogisering (02.323) @sv
alternative label: Musikmedier, katalogisering (02.323) @sv
broader: Kirjastoaineisto. Kokoelmien hoito
in scheme: YKL - Yleisten kirjastojen luokitusjärjestelmä
notation: 02.323
preferred label: Cataloguing @en
preferred label: Katalogisering @sv
scope note: Luettelointisäännöt. Luettelointiformaatit Tähän myös materiaalityypistä riippumatta erikoiskokoelmien ja erikoisalojen luettelointi sekä niitä koskevat luettelointisäännöt ja -formaatit
scope note: Regler för katalogisering. Katalogiseringsformat Hit också oavsett medietyp katalogisering av specialsamlingar och specialområden, dessutom katalogiseringsregler och -format för specialsamlingar och specialområden @sv

Lainaus
type: Concept
type: YKL-luokka
alternative label: Barnbibliotek, utlåningsverksamhet (02.33) @sv
alternative label: Bibliotek, utlåningssystem (02.33) @sv
alternative label: Bibliotekskort (02.33) @sv
alternative label: Biblioteksmedier, utlåning (02.33) @sv
alternative label: Detroit-lainaus, kirjastonhoito (02.33)
alternative label: Detroitutlåning, biblioteksarbete (02.33) @sv
alternative label: Fjärrtjänster, bibliotek (02.33) @sv
alternative label: Fjärrutlåning, bibliotek (02.33) @sv
alternative label: Förseningsavgifter, bibliotek (02.33) @sv
alternative label: Kameralainaus, kirjastonhoito (02.33)
alternative label: Kamerautlåning, biblioteksarbete (02.33) @sv
alternative label: Kaukolainaus, kirjastot (02.33)
alternative label: Kaukopalvelut, kirjastot (02.33)
alternative label: Kirjastoaineisto, lainaus (02.33)
alternative label: Kirjastokortit (02.33)
alternative label: Kirjastot, lainausjärjestelmät (02.33)
alternative label: Koulukirjastot, lainaustoiminta (02.33)
alternative label: Kuittilainaus, kirjastoaineisto (02.33)
alternative label: Kvittoutlåning, biblioteksmaterial (02.33) @sv
alternative label: Lainaajarekisterit, kirjastot (02.33)
alternative label: Lainaajatiedot, kirjastot (02.33)
alternative label: Lainaajatutkimukset, kirjastot (02.33)
alternative label: Lainaus, kirjastoaineisto (02.33)
alternative label: Lainausjärjestelmät, kirjastot (02.33)
alternative label: Lainausmaksut, kirjastot (02.33)
alternative label: Lainausoikeus, kirjastot (02.33)
alternative label: Lainaustoiminta, kirjastot (02.33)
alternative label: Lastenkirjastot, lainaustoiminta (02.33)
alternative label: Låneavgifter, bibliotek (02.33) @sv
alternative label: Lånerätt, bibliotek (02.33) @sv
alternative label: Lånesystem, bibliotek (02.33) @sv
alternative label: Låntagarregister, bibliotek (02.33) @sv
alternative label: Låntagarundersökningar, bibliotek (02.33) @sv
alternative label: Låntagaruppgifter, bibliotek (02.33) @sv
alternative label: Musiikkiaineisto, lainaaminen (02.33)
alternative label: Musiikkiaineiston lainaaminen (02.33)
alternative label: Musikmedier, utlåning av (02.33) @sv
alternative label: Musikmedier, utlåningsverksamhet (02.33) @sv
alternative label: Myöhästymismaksut, kirjastot (02.33)
alternative label: Skolbibliotek, utlåningsverksamhet (02.33) @sv
alternative label: Utlåning, biblioteksmedier (02.33) @sv
alternative label: Utlåningsverksamhet, bibliotek (02.33) @sv
broader: Kirjastonhoito. Kirjastotekniikka
in scheme: YKL - Yleisten kirjastojen luokitusjärjestelmä
notation: 02.33
preferred label: Lending @en
preferred label: Låneverksamhet @sv
scope note: Bibliotekens lånesystem. Bibliotekskort och låntagarregister. Fjärrlån. Hit också oavsett medietyp låneverksamhet som rör bibliotekens specialsamlingar @sv
scope note: Kirjastojen lainausjärjestelmät. Kirjastokortit ja lainaajarekisterit. Kaukopalvelutoiminta. Tähän myös materiaalityypistä riippumatta kirjastojen erikoiskokoelmia koskeva lainaustoiminta

Tietopalvelu. Informaatiopalvelu
type: Concept
References: BIBLIOGRAFIA
References: Yleisbibliografiat. Kansallisbibliografiat
References: Paikallisbibliografiat
References: Henkilöbibliografiat
References: Erikoisalojen luettelot
References: Kirjastojen yhteisluettelot
References: Yksittäisten kirjastojen luettelot
References: Kirjastoaineisto. Kokoelmien hoito
References: TIEDONHAKU. YLEISET TIETOTEOKSET
type: YKL-luokka
alternative label: Barnbibliotek, informationstjänst (02.36) @sv
alternative label: Databaser, informationssökning, bibliotek (02.36) @sv
alternative label: Dokumentaatio, tietopalvelu (02.36)
alternative label: Dokumentation, informationstjänst (02.36) @sv
alternative label: Hakemistot, tietopalvelu (02.36)
alternative label: Hakuteokset, käyttö, tietopalvelu (02.36)
alternative label: Handbiblioteksverksamhet (02.36) @sv
alternative label: Informaatiopalvelu (02.36)
alternative label: Informationsservice som berör musik (02.36) @sv
alternative label: Informationssökning, bibliotek (02.36) @sv
alternative label: Informationssökningssystem, biblioteksarbete (02.36) @sv
alternative label: Informationssökningssystem, informationstjänst (02.36) @sv
alternative label: Informationstjänst (02.36) @sv
alternative label: Informationstjänst, bibliotek (02.36) @sv
alternative label: Jäljennepalvelu, tietopalvelu (02.36)
alternative label: Kirjallisuuskatsaukset, tietopalvelu (02.36)
alternative label: Kirjallisuuspalvelu, tietopalvelu (02.36)
alternative label: Kopieringstjänst, informationstjänst (02.36) @sv
alternative label: Koulukirjastot, tietopalvelu (02.36)
alternative label: Käsikirjastotoiminta (02.36)
alternative label: Lastenkirjastot, tietopalvelu (02.36)
alternative label: Litteraturöversikter, informationstjänst (02.36) @sv
alternative label: Lukusalitoiminta (02.36)
alternative label: Läsesalsverksamhet (02.36) @sv
alternative label: Musiikkia koskeva tieto-ja informaatiopalvelu (02.36)
alternative label: Musiikkikirjastot, tietopalvelu (02.36)
alternative label: Musikbibliotek, informationstjänst (02.36) @sv
alternative label: Opintosalitoiminta (02.36)
alternative label: Referat, informationstjänst (02.36) @sv
alternative label: Referenssipalvelu, tietopalvelu (02.36)
alternative label: Referenstjänst, datatjänst (02.36) @sv
alternative label: Register, informationssökning (02.36) @sv
alternative label: Register, informationssökning, bibliotek (02.36) @sv
alternative label: Register, informationstjänst (02.36) @sv
alternative label: Rekisterit, tiedonhaku, kirjastot (02.36)
alternative label: Skolbibliotek, informationstjänst (02.36) @sv
alternative label: Studiesalsverksamhet (02.36) @sv
alternative label: Tiedonhaku, kirjastot (02.36)
alternative label: Tiedonhakujärjestelmät, informaatiopalvelu (02.36)
alternative label: Tiedonhakujärjestelmät, kirjastonhoito (02.36)
alternative label: Tiedostot, tiedonhaku, kirjastot (02.36)
alternative label: Tietokannat, tiedonhaku, kirjastot (02.36)
alternative label: Tietopalvelu, kirjastot (02.36)
alternative label: Tiivistelmät, tietopalvelu (02.36)
alternative label: Uppslagsverk, användning, informationstjänst (02.36) @sv
broader: Kirjastonhoito. Kirjastotekniikka
in scheme: YKL - Yleisten kirjastojen luokitusjärjestelmä
notation: 02.36
preferred label: Information service. Information retrieval @en
preferred label: Informationstjänst @sv
scope note: Informationstjänst på bibliotek och institutioner System och metoder för informationssökning Användning av uppslagsverk, index, register och databaser i informationstjänst Litteratur-, referens- och kopieringstjänst Hur man utarbetar litteraturöversikter och referat med avseende på data- och informationstjänst Referensbibliotek och läsesalar Hit också oavsett materialtyp data- och informationstjänst som rör bibliotekens specialsamlingar Om verket behandlar både sökning och registrering av information, ges företräde åt klass 02.32+ @sv
scope note: Tietopalvelu kirjastoissa ja informaatiopalvelulaitoksissa Tiedonhakujärjestelmät ja -menetelmät Hakuteosten, hakemistojen, tiedostojen ja tietokantojen käyttö tietopalvelussa Kirjallisuus-, referenssi- ja jäljennepalvelu Kirjallisuuskatsausten ja tiivistelmien laatiminen tieto- ja informaatiopalvelun kannalta Käsikirjasto- ja lukusalitoiminta Tähän myös materiaalityypistä riippumatta kirjastojen erikoiskokoelmia koskeva tieto- ja informaatiopalvelu Jos teos koskee sekä tiedon hakua että tallennusta, annetaan etusija luokalle 02.32+

Laajennettu kirjastotoiminta
type: Concept
References: Musiikkikirjastotyö
References: Lastenkirjastotyö. Nuortenkirjastotyö
References: Erityisten väestöryhmien kirjastopalvelut
type: YKL-luokka
alternative label: Bibliotek, utställningsverksamhet (02.38) @sv
alternative label: Elokuvaesitykset, kirjastot (02.38)
alternative label: Evenemang för allmänheten, bibliotek (02.38) @sv
alternative label: Filmförevisningar, bibliotek (02.38) @sv
alternative label: Föreläsningsverksamhet, utvidgad biblioteksverksamhet (02.38) @sv
alternative label: Kirjallisuustilaisuudet, kirjastot (02.38)
alternative label: Kirjastot, näyttelytoiminta (02.38)
alternative label: Laajennettu kirjastotoiminta (02.38)
alternative label: Litterära tillställningar, bibliotek (02.38) @sv
alternative label: Luentotoiminta, laajennettu kirjastotoiminta (02.38)
alternative label: Näyttelytoiminta, kirjastot (02.38)
alternative label: Opintokerhot, kirjastot (02.38)
alternative label: Studiecirklar, bibliotek (02.38) @sv
alternative label: Teaterföreställningar, bibliotek (02.38) @sv
alternative label: Teatteriesitykset, kirjastot (02.38)
alternative label: Utställningsverksamheten, bibliotek (02.38) @sv
alternative label: Utvidgad biblioteksverksamhet (02.38) @sv
alternative label: Yleisötilaisuudet, kirjastot (02.38)
broader: Kirjastonhoito. Kirjastotekniikka
in scheme: YKL - Yleisten kirjastojen luokitusjärjestelmä
notation: 02.38
preferred label: Extended library services @en
preferred label: Utvidgad biblioteksverksamhet @sv
scope note: Laajennettu kirjastotoiminta yleensä Yleisötilaisuuksien järjestäminen kirjastossa Opintokerhojen, luentojen, juhlien, näyttelyiden, elokuva- ja teatteriesitysten sekä kirjallisuus- tilaisuuksien järjestäminen kirjastossa
scope note: Utvidgad biblioteksverksamhet i allmänhet Tillställningar för allmänheten i biblioteket Att ordna studiecirklar, föredrag, fester, utställningar, filmförevisningar, teaterföreställningar och bokpresentationer i biblioteket @sv

Musiikkikirjastotyö
type: Concept
References: Henkilöbibliografiat
References: Taiteet. Liikunta
References: Sisällönkuvailu
References: Luettelointi
References: Lainaus
References: Tietopalvelu. Informaatiopalvelu
References: MUSIIKKI
type: YKL-luokka
alternative label: Barnbibliotek, musikverksamhet (02.4) @sv
alternative label: Biblioteksmedier, musikbiblioteksarbete (02.4) @sv
alternative label: CD-levyt, musiikkikirjastotyö (02.4)
alternative label: CD-skivor, musikbiblioteksarbete (02.4) @sv
alternative label: Grammofonskivor, musikbiblioteksarbete (02.4) @sv
alternative label: Kasetit, musiikkikirjastotyö (02.4)
alternative label: Kassetter, musikbiblioteksarbete (02.4) @sv
alternative label: Kirjastoaineisto, musiikkikirjastotyö (02.4)
alternative label: Kokoelmatyö, musiikkikirjastot (02.4)
alternative label: Koulukirjastot, musiikkitoiminta (02.4)
alternative label: Laajennettu kirjastotoiminta, musiikkiesitykset (02.4)
alternative label: Laserlevyt, musiikkikirjastotyö (02.4)
alternative label: Laserskivor, musikbiblioteksarbete (02.4) @sv
alternative label: Lastenkirjastot, musiikkitoiminta (02.4)
alternative label: Ljudupptagningar, musikbiblioteksarbete (02.4) @sv
alternative label: Musiikki, kuuntelu kirjastossa (02.4)
alternative label: Musiikkiaineisto, hoito ja ylläpito (02.4)
alternative label: Musiikkiaineisto, valinta ja hankinta (02.4)
alternative label: Musiikkiesitykset, kirjastotoiminta (02.4)
alternative label: Musiikkikirjakokoelmat, musiikkikirjastotyö (02.4)
alternative label: Musiikkikirjastot (02.4)
alternative label: Musiikkikirjastot, kokoelmatyö (02.4)
alternative label: Musiikkikirjastot, käytön tutkimus (02.4)
alternative label: Musiikkikirjastotyö (02.4)
alternative label: Musiikkikokoelmat, musiikkikirjastotyö (02.4)
alternative label: Musiikkiosastot, kirjastot (02.4)
alternative label: Musik, avlyssning på bibliotek (02.4) @sv
alternative label: Musikavdelningar, bibliotek (02.4) @sv
alternative label: Musikbibliotek (02.4) @sv
alternative label: Musikbibliotek, användarundersökningar (02.4) @sv
alternative label: Musikbibliotek, samlingsarbete (02.4) @sv
alternative label: Musikbiblioteksarbete (02.4) @sv
alternative label: Musikboksamlingar, musikbiblioteksarbete (02.4) @sv
alternative label: Musikmedier, skötsel och underhåll (02.4) @sv
alternative label: Musikmedier, val och anskaffningar (02.4) @sv
alternative label: Musiksamlingar, musikbiblioteksarbete (02.4) @sv
alternative label: Musikuppföranden, biblioteksverksamhet (02.4) @sv
alternative label: Notsamlingar, musikbiblioteksarbete (02.4) @sv
alternative label: Nuottikokoelmat, musiikkikirjastotyö (02.4)
alternative label: Partitursamlingar, musikbiblioteksarbete (02.4) @sv
alternative label: Partituurikokoelmat, musiikkikirjastotyö (02.4)
alternative label: Samlingsarbete, musikbibliotek (02.4) @sv
alternative label: Skolbibliotek, musikverksamhet (02.4) @sv
alternative label: Utvidgad biblioteksverksamhet, musikuppföranden (02.4) @sv
alternative label: Äänilevyt, musiikkikirjastotyö (02.4)
alternative label: Äänitteet, musiikkikirjastotyö (02.4)
broader: KIRJASTOTOIMI. KIRJASTOTIEDE. INFORMATIIKKA
in scheme: YKL - Yleisten kirjastojen luokitusjärjestelmä
notation: 02.4
preferred label: Music libraries @en
preferred label: Musikbibliotek @sv
scope note: Musiikkikirjastotyö yleensä Musiikkikirjastot ja kirjastojen musiikkiosastot Musiikkikirjaston kokoelmatyö Kirjaston nuotti-, partituuri-, musiikkikirja- ja musiikkiäänitekokoelmien valinta, hankinta, hoito ja ylläpito Musiikin kuuntelu kirjastossa Musiikkiesitysten järjestäminen kirjastossa Musiikkikirjaston käytön tutkimukset
scope note: Musikbibliotek i allmänhet Musikbibliotek och musikavdelningarna på biblioteken Arbetet med samlingarna i musikbiblioteken Urval, förvärv, skötsel och underhåll av bibliotekens not-, partitur- och musikboksamlingar och samlingar av musikinspelningar Att lyssna på musik i biblioteket Att ordna konserter i biblioteket Undersökningar om användningen av musikbibliotek @sv

Lastenkirjastotyö. Nuortenkirjastotyö
type: Concept
References: Kirjastoaineisto. Kokoelmien hoito
References: Lainaus
References: Tietopalvelu. Informaatiopalvelu
type: YKL-luokka
alternative label: Barnavdelningar, bibliotek (02.6) @sv
alternative label: Barnbiblioteksarbete (02.6+) @sv
alternative label: Barnkultur, bibliotek (02.6+) @sv
alternative label: Dockteaterföreställningar, barnbiblioteksarbete (02.6) @sv
alternative label: Laajennettu kirjastotoiminta, satutunnit (02.6)
alternative label: Lastenkirjastotyö (02.6+)
alternative label: Lastenkulttuuri, kirjastot (02.6+)
alternative label: Lastenosastot, kirjastot (02.6)
alternative label: Nukketeatteriesitykset, lastenkirjastotyö (02.6)
alternative label: Nuorisokulttuuri, kirjastot (02.6+)
alternative label: Nuortenkirjastotyö (02.6+)
alternative label: Nuortenosastot, kirjastot (02.6)
alternative label: Sagotimmar, barnbiblioteksarbete (02.6) @sv
alternative label: Satutunnit, lastenkirjastotyö (02.6)
alternative label: Ungdomsavdelningar, bibliotek (02.6) @sv
alternative label: Ungdomsbiblioteksarbete (02.6+) @sv
alternative label: Ungdomskultur, bibliotek (02.6+) @sv
alternative label: Utvidgad biblioteksverksamhet, sagostunder (02.6) @sv
broader: KIRJASTOTOIMI. KIRJASTOTIEDE. INFORMATIIKKA
in scheme: YKL - Yleisten kirjastojen luokitusjärjestelmä
narrower: Koulukirjastotyö
notation: 02.6
preferred label: Barnbiblioteksarbete. Ungdomsbiblioteksarbete @sv
preferred label: Children's libraries. Young people's libraries @en
scope note: Barn- och ungdomsbibliotek i allmänhet Bibliotekens barn- och ungdomsavdelningar Sagotimmar, dockteaterföreställningar och annat program för barn i biblioteket Undersökningar om användningen av barnbibliotek @sv
scope note: Lasten- ja nuortenkirjastotyö yleensä Kirjastojen lasten- ja nuortenosastot Satutuntien, nukketeatteriesitysten ja muun lasten oheistoiminnan järjestäminen kirjastossa Lastenkirjaston käytön tutkimukset

Koulukirjastotyö
type: Concept
References: Kirjastoaineisto. Kokoelmien hoito
References: Lainaus
References: Tietopalvelu. Informaatiopalvelu
References: Koululaitos
type: YKL-luokka
alternative label: Koulukirjastotyö (02.64)
alternative label: Skolbiblioteksarbete (02.64) @sv
broader: Lastenkirjastotyö. Nuortenkirjastotyö
in scheme: YKL - Yleisten kirjastojen luokitusjärjestelmä
notation: 02.64
preferred label: School libraries @en
preferred label: Skolbibliotek @sv
scope note: Koulukirjastot ja koulukirjastotyö yleensä Kirjaston ja koulun yhteistyö Koulukirjaston käytön tutkimukset
scope note: Skolbibliotek i allmänhet Samarbete mellan bibliotek och skola Undersökningar om användningen av skolbibliotek @sv

Erityisten väestöryhmien kirjastopalvelut
type: Concept
References: Kirjastoaineisto. Kokoelmien hoito
References: Lainaus
References: Tietopalvelu. Informaatiopalvelu
References: Lastenkirjastotyö. Nuortenkirjastotyö
type: YKL-luokka
alternative label: Anstaltsbibliotek (02.7) @sv
alternative label: Arbetsplatsbibliotek (02.7) @sv
alternative label: Blindbibliotek (02.7) @sv
alternative label: Fängelsebibliotek (02.7) @sv
alternative label: Hemtjänst, biblioteksverksamhet (02.7) @sv
alternative label: Hoitolaitokset, kirjastotoiminta (02.7)
alternative label: Kotipalvelu, kirjastotoiminta (02.7)
alternative label: Laajennettu kirjastotoiminta, erityisväestöryhmät (02.7)
alternative label: Laitoskirjastotoiminta (02.7)
alternative label: Merimieskirjastotoiminta (02.7)
alternative label: Näkövammaiset, kirjastot (02.7)
alternative label: Sairaalakirjastotyö (02.7)
alternative label: Sjukhusbiblioteksarbete (02.7) @sv
alternative label: Sjömansbibliotek (02.7) @sv
alternative label: Social biblioteksservice (02.7) @sv
alternative label: Sociala specialbibliotek (02.7) @sv
alternative label: Sokeainkirjastotoiminta (02.7)
alternative label: Soldatbiblioteksverksamhet (02.7) @sv
alternative label: Sosiaaliset erikoiskirjastot (02.7)
alternative label: Sosiaaliset kirjastopalvelut (02.7)
alternative label: Sotilaskirjastotoiminta (02.7)
alternative label: Synskadade, bibliotek (02.7) @sv
alternative label: Työpaikkakirjastotoiminta (02.7)
alternative label: Utvidgad biblioteksverksamhet, speciella befolkningsgrupper (02.7) @sv
alternative label: Vankilakirjastotoiminta (02.7)
alternative label: Vårdinrättningar, biblioteksverksamhet (02.7) @sv
broader: KIRJASTOTOIMI. KIRJASTOTIEDE. INFORMATIIKKA
in scheme: YKL - Yleisten kirjastojen luokitusjärjestelmä
notation: 02.7
preferred label: Biblioteksservice för särskilda befolkningsgrupper @sv
preferred label: Library services for special population groups @en
scope note: Sociala specialbibliotek i allmänhet Boken kommer -verksamhet. Anstaltsbibliotek Sjukhusbibliotek och bibliotek på vårdanstalter Fängelsebibliotek. Arbetsplatsbibliotek Soldatbibliotek. Sjömansbibliotek Bibliotek för synskadade Undersökningar om användning av biblioteksservice för särskilda befolkningsgrupper @sv
scope note: Sosiaaliset erikoiskirjastot yleensä Kotipalvelu. Laitoskirjastot Sairaaloiden ja hoitolaitosten kirjastot Vankilakirjastot. Työpaikkakirjastot Sotilaskirjastot. Merimieskirjastot Näkövammaisten kirjastot Erityisten väestöryhmien kirjastopalveluiden käytön tutkimukset

Yksittäiset kirjastot
type: Concept
References: Yksittäisten kirjastojen luettelot
References: KIRJASTOTOIMI. KIRJASTOTIEDE. INFORMATIIKKA
References: Kirjastojen hallinto ja suunnittelu
References: Kirjastonhoito. Kirjastotekniikka
References: Musiikkikirjastotyö
References: Lastenkirjastotyö. Nuortenkirjastotyö
References: Erityisten väestöryhmien kirjastopalvelut
type: YKL-luokka
alternative label: Allmänna bibliotek, enskilda (02.8) @sv
alternative label: Bibliotek, enskilda (02.8) @sv
alternative label: Erikoiskirjastot, yksittäiset (02.8)
alternative label: Kirjastot, yksittäiset (02.8)
alternative label: Privata bibliotek, enskilda (02.8) @sv
alternative label: Specialbibliotek, enskilda (02.8) @sv
alternative label: Tieteelliset kirjastot, yksittäiset (02.8)
alternative label: Vetenskapliga bibliotek, enskilda (02.8) @sv
alternative label: Yksityiset kirjastot, yksittäiset (02.8)
alternative label: Yleiset kirjastot, yksittäiset (02.8)
broader: KIRJASTOTOIMI. KIRJASTOTIEDE. INFORMATIIKKA
in scheme: YKL - Yleisten kirjastojen luokitusjärjestelmä
notation: 02.8
preferred label: Enskilda bibliotek @sv
preferred label: Individual libraries @en
scope note: Hit allmänna verk om enskilda allmänna, vetenskapliga och privata bibliotek samt specialbibliotek @sv
scope note: Tähän tiettyä yksittäistä yleistä, tieteellistä, yksityistä tai erikoiskirjastoa koskevat yleisteokset

TIEDONHAKU. YLEISET TIETOTEOKSET
type: Concept
References: BIBLIOGRAFIA
References: Yleisbibliografiat. Kansallisbibliografiat
References: Paikallisbibliografiat
References: Henkilöbibliografiat
References: Erikoisalojen luettelot
References: Kirjastojen yhteisluettelot
References: Yksittäisten kirjastojen luettelot
References: Tietopalvelu. Informaatiopalvelu
References: Internet. Intranet. Ekstranet
References: Liiketalous
type: YKL-luokka
alternative label: Databanker, allm. (03) @sv
alternative label: Databaser, allm. (03) @sv
alternative label: Datalager, allm. (03) @sv
alternative label: Dataregister, allm. (03) @sv
alternative label: Dioraamat, yl. (03)
alternative label: Dioramor, allm. (03) @sv
alternative label: Encyklopedier, allm. (03) @sv
alternative label: Ensyklopediat, yl. (03)
alternative label: Faktaböcker, allm. (03) @sv
alternative label: Faktadatabaser, allmänna uppslagsverk (03) @sv
alternative label: Faktatietokannat, yleiset tietoteokset (03)
alternative label: Hakuteokset, yl. (03)
alternative label: Informationssökning, allm. (03) @sv
alternative label: Informationstjänst, allm. (03) @sv
alternative label: Konversationslexikon (03) @sv
alternative label: Register, allm. (03) @sv
alternative label: Rekisterit, yl. (03)
alternative label: Tiedonhaku, yl. (03)
alternative label: Tiedostot, yl. (03)
alternative label: Tieteet, yleiset tietoteokset (03)
alternative label: Tietokannat, yl. (03)
alternative label: Tietokirjat, yl. (03)
alternative label: Tietopalvelu, yl. (03)
alternative label: Tietopankit, yl. (03)
alternative label: Tietorekisterit, yl. (03)
alternative label: Tietosanakirjat, yl. (03)
alternative label: Tietovarastot, yl. (03)
alternative label: Uppslagsverk, allm. (03) @sv
alternative label: Vetenskaper, allmänna uppslagsverk och encyclopedier (03) @sv
broader: YLEISTEOKSET. KIRJA-ALA. KIRJASTOTOIMI YLEINEN KULTTUURIPOLITIIKKA. JOUKKOTIEDOTUS
in scheme: YKL - Yleisten kirjastojen luokitusjärjestelmä
notation: 03
preferred label: INFORMATION RETRIEVAL. GENERAL REFERENCE WORKS @en
preferred label: INFORMATIONSSÖKNING. ALLMÄNNA UPPSLAGSVERK. ALLMÄNNA ENCYKLOPEDIER @sv
scope note: Informationssökning och dess metoder i allmänhet Oavsett materialtyp allmänna faktaböcker, uppslagsverk, konversationslexikon, encyklopedier, register och databaser samt introduktioner till vetenskap inom flera olika områden Om verket domineras av ett bestämt område, ges företräde åt ifrågavarande områdes klass Fackböcker inom specialområden klassificeras enligt område Formtilläggen 03 och 038 används inte i samband med klassen 03 @sv
scope note: Tiedonhakua ja sen menetelmiä koskevat yleisteokset Materiaalityypistä riippumatta yleiset tietokirjat, hakuteokset, tietosanakirjat, ensyklopediat, tiedostot ja tietokannat sekä useita eri aloja koskevat johdatukset tieteisiin Jos teos kuitenkin painottuu johonkin tiettyyn alaan, annetaan etusija ko. alan luokalle Erikoisalojen tietoteokset luokitetaan alan mukaan Muotoluokkia 03 ja 038 ei käytetä luokan 03 yhteydessä

YLEISET KOKOOMATEOKSET
type: Concept
References: KAUNOKIRJALLISET SEKASISÄLTÖISET TEOKSET
type: YKL-luokka
alternative label: Antologiat, yleiset kokoomateokset (04)
alternative label: Antologier, allmänna samlingsverk (04) @sv
alternative label: Artikelsamlingar, allm. (04) @sv
alternative label: Artikkelikokoelmat, yl. (04)
alternative label: Esitelmäkokoelmat, yl. (04)
alternative label: Esseekokoelmat, yl. (04)
alternative label: Esseet, tutkimus, yl. (04)
alternative label: Esseet, yl. (04)
alternative label: Essäer, allm. (04) @sv
alternative label: Essäer, forskning, allm. (04) @sv
alternative label: Essäsamlingar, allm. (04) @sv
alternative label: Festskrifter (04) @sv
alternative label: Festtal, allm. (04) @sv
alternative label: Föredragssamlingar, allm. (04) @sv
alternative label: Föreläsningar, samlingar, allm. (04) @sv
alternative label: Juhlakirjat, yl. (04)
alternative label: Juhlapuheet (04)
alternative label: Kokoomateokset, yleiset kokoomateokset (04)
alternative label: Kolumner (04) @sv
alternative label: Kolumnit, yl. (04)
alternative label: Kootut teokset, yleiset kokoomateokset (04)
alternative label: Krestomatier, allmänna samlingsverk (04) @sv
alternative label: Kåserier, allm. (04) @sv
alternative label: Luentokokoelmat, yl. (04)
alternative label: Lukemistot, yleiset kokoomateokset (04)
alternative label: Lukukirjat, yleiset kokoomateokset (04)
alternative label: Läseböcker, allmänna samlingsverk (04) @sv
alternative label: Minnesalbum, allm. (04) @sv
alternative label: Muistokirjat, yl. (04)
alternative label: Pakinat, yl. (04)
alternative label: Puheet, yl. (04)
alternative label: Puhekokoelmat, yl. (04)
alternative label: Samlade verk, allmänna samlingsverk (04) @sv
alternative label: Samlingsverk, allmänna samlingsverk (04) @sv
alternative label: Tal, anföranden, allm. (04) @sv
alternative label: Talsamlingar, allm. (04) @sv
alternative label: Valda verk, allmänna samlingsverk (04) @sv
alternative label: Valitut teokset, yleiset kokoomateokset (04)
broader: YLEISTEOKSET. KIRJA-ALA. KIRJASTOTOIMI YLEINEN KULTTUURIPOLITIIKKA. JOUKKOTIEDOTUS
in scheme: YKL - Yleisten kirjastojen luokitusjärjestelmä
notation: 04
preferred label: ALLMÄNNA SAMLINGSVERK @sv
preferred label: GENERAL COMPILATIONS @en
scope note: Hit samlingsverk och festskrifter med allmänt eller blandat innehåll samt essä-, artikel-, föreläsnings- och talsamlingar med allmänt eller blandat innehåll Hit också samlingsverk med blandat innehåll som innehåller både skönlitterära texter och facktexter Om verket domineras av något bestämt område, ges företräde åt ifrågavarande klass Samlingsverk inom specialområden klassificeras enligt område Formtillägget 04 används inte i samband med klassen 04 @sv
scope note: Tähän yleiset tai sekasisältöiset kokoomateokset ja juhlakirjat sekä yleiset ja sekasisältöiset essee-, artikkeli-, luento-, esitelmä- ja puhekokoelmat Tähän myös sekasisältöiset kokoomateokset, joissa on sekä kauno- että tietokirjallisia tekstejä Jos teos kuitenkin painottuu johonkin tiettyyn alaan, annetaan etusija ko. alan luokalle Erikoisalojen kokoomateokset luokitetaan alan mukaan Muotoluokkaa 04 ei käytetä luokan 04 yhteydessä

YLEISET KAUSIJULKAISUT
type: Concept
References: Kustannustoiminta. Kirjakauppa
References: Yleisbibliografiat. Kansallisbibliografiat
References: Paikallisbibliografiat
References: Henkilöbibliografiat
References: Erikoisalojen luettelot
References: Kirjastojen yhteisluettelot
References: Yksittäisten kirjastojen luettelot
References: Lehdistöoppi
References: URN:NBN:fi:au:ykl:07.109
type: YKL-luokka
alternative label: E-lehdet, kausijulkaisut (05+)
alternative label: E-tidskrifter, periodika (05+) @sv
alternative label: Elektroniset lehdet (05+)
alternative label: Elektroniska tidningar (05+) @sv
alternative label: Kausijulkaisut (05+)
alternative label: Lokaltidningar (05+) @sv
alternative label: Nättidskrifter, periodika (05+) @sv
alternative label: Paikallislehdet (05+)
alternative label: Partitidningar (05+) @sv
alternative label: Periodica (05+) @sv
alternative label: Puoluelehdet (05+)
alternative label: Taltidningar (05+) @sv
alternative label: Verkkolehdet, kausijulkaisut (05+)
alternative label: Videolehdet (05+)
alternative label: Videomagasin (05+) @sv
alternative label: Äänilehdet (05+)
broader: YLEISTEOKSET. KIRJA-ALA. KIRJASTOTOIMI YLEINEN KULTTUURIPOLITIIKKA. JOUKKOTIEDOTUS
in scheme: YKL - Yleisten kirjastojen luokitusjärjestelmä
narrower: Aikakauslehdet
narrower: Sarjajulkaisut
narrower: Vuosikirjat. Kalenterit. Almanakat
narrower: Sanomalehdet
notation: 05
preferred label: ALLMÄNNA PERIODISKA PUBLIKATIONER @sv
preferred label: GENERAL PERIODICALS @en
scope note: Hit och till underklasserna oavsett medietyp periodiska publikationer med allmänt eller blandat innehåll och skilda innehållsförteckningar för dessa Hit och till underklasserna också elektroniska tidningar och periodiska publikationer, såsom taltidningar och tele- och videotidningar Periodiska publikationer inom specialområden och deras innehållsförteckningar klassificeras enligt område Formtilläggen 05, 051, 052, 053 och 054 används inte i samband med klasserna 05-05.4 @sv
scope note: Tähän ja alaluokkiin materiaalityypistä riippumatta yleiset tai sekasisältöiset kausijulkaisut ja niiden erilliset sisällysluettelot Tähän ja alaluokkiin myös elektroniset lehdet ja kausijulkaisut, kuten äänilehdet sekä tele- ja videolehdet Erikoisalojen kausijulkaisut ja niiden sisällysluettelot luokitetaan alan mukaan Muotoluokkia 05, 051, 052, 053 ja 054 ei käytetä luokkien 05-05.4 yhteydessä

Aikakauslehdet
type: Concept
References: Kustannustoiminta. Kirjakauppa
References: Lehdistöoppi
References: URN:NBN:fi:au:ykl:07.109
References: SARJAKUVAT
type: YKL-luokka
alternative label: Aikakauslehdet, yl. (05.1)
alternative label: Lehdet, aikakauslehdet (05.1)
alternative label: Tidskrifter, allm. (05.1) @sv
broader: YLEISET KAUSIJULKAISUT
in scheme: YKL - Yleisten kirjastojen luokitusjärjestelmä
notation: 05.1
preferred label: Periodicals @en
preferred label: Tidskrifter @sv
scope note: Hit tidskrifter med allmänt eller blandat innehåll Tidskrifter inom specialområden klassificeras enligt område Formtilläggen 05, 051, 052, 053 och 054 används inte i samband med klasserna 05-05.4 @sv
scope note: Tähän yleiset tai sekasisältöiset aikakauslehdet Erikoisalojen aikakauslehdet luokitetaan alan mukaan Muotoluokkia 05, 051, 052, 053 ja 054 ei käytetä luokkien 05-05.4 yhteydessä

Sarjajulkaisut
type: Concept
type: YKL-luokka
alternative label: Sarjajulkaisut (05.2)
alternative label: Seriella publikationer (05.2) @sv
broader: YLEISET KAUSIJULKAISUT
in scheme: YKL - Yleisten kirjastojen luokitusjärjestelmä
notation: 05.2
preferred label: Serial publications @en
preferred label: Seriella publikationer @sv
scope note: Hit seriella publikationer med allmänt eller blandat innehåll Seriella publikationer inom specialområden klassificeras enligt område Formtilläggen 05, 051, 052, 053 och 054 används inte i samband med klasserna 05-05.4 @sv
scope note: Tähän yleiset tai sekasisältöiset sarjajulkaisut Erikoisalojen sarjajulkaisut luokitetaan alan mukaan Muotoluokkia 05, 051, 052, 053 ja 054 ei käytetä luokkien 05-05.4 yhteydessä

Vuosikirjat. Kalenterit. Almanakat
type: Concept
References: Ajanlasku
type: YKL-luokka
alternative label: Almanackor (05.3) @sv
alternative label: Almanakat (05.3)
alternative label: Kalendrar (05.3) @sv
alternative label: Kalenterit (05.3)
alternative label: Vuosikirjat (05.3)
alternative label: Årsböcker (05.3) @sv
broader: YLEISET KAUSIJULKAISUT
in scheme: YKL - Yleisten kirjastojen luokitusjärjestelmä
notation: 05.3
preferred label: Yearbooks. Calendars. Almanacs @en
preferred label: Årsböcker. Kalendrar. Almanackor @sv
scope note: Hit årsböcker, kalendrar och almanackor med allmänt eller blandat innehåll Årsböcker, kalendrar och almanackor inom specialområden klassificeras enligt område Formtilläggen 05, 051, 052, 053 och 054 används inte i samband med klasserna 05-05.4 @sv
scope note: Tähän yleiset tai sekasisältöiset vuosikirjat, kalenterit ja almanakat Erikoisalojen vuosikirjat, kalenterit ja almanakat luokitetaan alan mukaan Muotoluokkia 05, 051, 052, 053 ja 054 ei käytetä luokkien 05-05.4 yhteydessä

Sanomalehdet
type: Concept
References: Kustannustoiminta. Kirjakauppa
References: Lehdistöoppi
References: URN:NBN:fi:au:ykl:07.109
type: YKL-luokka
alternative label: Lehdet, sanomalehdet (05.4)
alternative label: Sanomalehdet (05.4)
alternative label: Tidningar (05.4) @sv
broader: YLEISET KAUSIJULKAISUT
in scheme: YKL - Yleisten kirjastojen luokitusjärjestelmä
notation: 05.4
preferred label: Newspapers @en
preferred label: Tidningar @sv
scope note: Hit tidningar med allmänt eller blandat innehåll Tidningar inom specialområden klassificeras enligt område Formtilläggen 05, 051, 052, 053 och 054 används inte i samband med klasserna 05-05.4 @sv
scope note: Tähän yleiset tai sekasisältöiset sanomalehdet Erikoisalojen sanomalehdet luokitetaan alan mukaan Muotoluokkia 05, 051, 052, 053 ja 054 ei käytetä luokkien 05-05.4 yhteydessä

YLEINEN KULTTUURIPOLITIIKKA
type: Concept
References: Tiedepolitiikka
References: Elämäntapojen sosiologia. Kulttuurisosiologia
References: Kansainväliset järjestöt
References: Aikuiskoulutus. Vapaa sivistystyö
References: Nuorisotyö. Lapsityö
References: Taidepsykologia. Taidesosiologia. Taidepolitiikka
type: YKL-luokka
alternative label: Akademier (06+) @sv
alternative label: Akatemiat (06+)
alternative label: Andlig kultur, kulturpolitik (06+) @sv
alternative label: Bildningsväsen (06+) @sv
alternative label: Evenemangsproducenter (06+) @sv
alternative label: Finlands akademi (06+) @sv
alternative label: Folktinget (06+) @sv
alternative label: Fonder (06+) @sv
alternative label: Henkinen kulttuuri, kulttuuripolitiikka (06+)
alternative label: Järjestöt, kulttuuripolitiikka (06+)
alternative label: Kommunal kulturpolitik (06+) @sv
alternative label: Kulttuuriala (06+)
alternative label: Kulttuurielämä, kulttuuripolitiikka (06+)
alternative label: Kulttuurijärjestöt (06+)
alternative label: Kulttuurikasvatus (06+)
alternative label: Kulttuurikeskukset (06+)
alternative label: Kulttuurilaitokset (06+)
alternative label: Kulttuuripalvelut (06+)
alternative label: Kulttuuriperintö, kulttuuripolitiikka (06+)
alternative label: Kulttuuripolitiikka (06+)
alternative label: Kulttuurituottajat (06+)
alternative label: Kulturarv, kulturpolitik (06+) @sv
alternative label: Kulturbranschen (06+) @sv
alternative label: Kulturcentra (06+) @sv
alternative label: Kulturfostran (06+) @sv
alternative label: Kulturinstitutioner (06+) @sv
alternative label: Kulturlivet, kulturpolitik (06+) @sv
alternative label: Kulturorganisationer (06+) @sv
alternative label: Kulturpolitik (06+) @sv
alternative label: Kulturproducenter (06+) @sv
alternative label: Kulturtjänster (06+) @sv
alternative label: Kunnallinen kulttuuripolitiikka (06+)
alternative label: Ohjelmatoimistot, yl. (06)
alternative label: Organisationer, kulturpolitik (06+) @sv
alternative label: Palvelut, kulttuuripalvelut (06+)
alternative label: Populaarikulttuuri, kulttuuripolitiikka (06+)
alternative label: Populärkultur, kulturpolitik (06+) @sv
alternative label: Programbyråer, allm. (06) @sv
alternative label: Rahastot (06+)
alternative label: Ruotsalaiset kansankäräjät (06+)
alternative label: SITRA (06+)
alternative label: Saavutettavuus, kulttuuripalvelut (06)
alternative label: Service, kulturtjänster (06+) @sv
alternative label: Sivistystoimi (06+)
alternative label: Sponsorointi, kulttuuripolitiikka (06+)
alternative label: Sponsring, kulturpolitik (06+) @sv
alternative label: Suomen akatemia (06+)
alternative label: Tapahtumatuottajat (06+)
alternative label: Åtkomlighet, kulturtjänster (06) @sv
broader: YLEISTEOKSET. KIRJA-ALA. KIRJASTOTOIMI YLEINEN KULTTUURIPOLITIIKKA. JOUKKOTIEDOTUS
in scheme: YKL - Yleisten kirjastojen luokitusjärjestelmä
narrower: Yhdistykset. Säätiöt. Seurat. Kerhot
narrower: Museot
narrower: Näyttelyt
narrower: Arkistot
narrower: Kokoukset. Kulttuuritapahtumat
narrower: Apurahat
narrower: Lasten ja nuorten kulttuuritoiminta
notation: 06
preferred label: ALLMÄN KULTURPOLITIK @sv
preferred label: GENERAL CULTURAL POLICY @en
scope note: Hit och till underklasserna allmänna verk om kulturpolitik, kulturverksamhet och kulturfostran Hit och till underklasserna statlig, kommunal och privat kulturpolitik och kulturverksamhet Hit och till underklasserna också statliga, kommunala och privata kulturorganisationer och kulturinstitutioner och deras kulturutbud Verksamhet i kulturcentra och akademien Kulturarv från kulturpolitikens synvinkel Kulturtjänsternas åtkomlighet Kulturpolitik och kulturverksamhet inom specialområden klassificeras enligt område Formtillägget 06 används inte i samband med klassen 06 @sv
scope note: Tähän ja alaluokkiin kulttuuripolitiikan, kulttuuritoiminnan ja kulttuurikasvatuksen yleisteokset Tähän ja alaluokkiin valtiollinen, kunnallinen ja yksityinen kulttuuripolitiikka ja kulttuuritoiminta Tähän ja alaluokkiin myös valtiolliset, kunnalliset ja yksityiset kulttuurijärjestöt ja -laitokset sekä niiden tarjoamat kulttuuripalvelut Kulttuurikeskusten ja akatemioiden toiminta Kulttuuriperintö kulttuuripolitiikan kannalta Kulttuuripalvelujen saavutettavuus Erikoisalojen kulttuuripolitiikka ja -toiminta luokitetaan alan mukaan Muotoluokkaa 06 ei käytetä luokan 06 yhteydessä

Yhdistykset. Säätiöt. Seurat. Kerhot
type: Concept
References: Kansalaistoiminta ja –aktivismi. Järjestötoiminta. Kokoustekniikka.
References: Yksityinen avustus- ja huoltotyö
References: Aikuiskoulutus. Vapaa sivistystyö
References: Nuorisotyö. Lapsityö
References: Liiketaloudellinen laskentatoimi
type: YKL-luokka
alternative label: Föreningar (06.1) @sv
alternative label: Kerhot (06.1)
alternative label: Klubbar (06.1) @sv
alternative label: Nobelin säätiö (06.1)
alternative label: Nobelstiftelsen (06.1) @sv
alternative label: Seurat (06.1)
alternative label: Stiftelser (06.1) @sv
alternative label: Sällskap (06.1) @sv
alternative label: Säätiöt (06.1)
alternative label: Tieteelliset seurat (06.1)
alternative label: Vetenskapliga sällskap (06.1) @sv
alternative label: Yhdistykset (06.1)
broader: YLEINEN KULTTUURIPOLITIIKKA
in scheme: YKL - Yleisten kirjastojen luokitusjärjestelmä
notation: 06.1
preferred label: Associations. Foundations. Societies. Clubs @en
preferred label: Föreningar. Stiftelser. Sällskap. Klubbar @sv
scope note: Hit föreningar, stiftelser, sällskap och klubbar med allmän verksamhet eller flera verksamhetsformer samt deras organisation och verksamhet Föreningar, stiftelsen, sällskap och klubbar inom specialområden samt deras verksamhet klassificeras enligt område @sv
scope note: Tähän yleiset tai monilla aloilla toimivat yhdistykset, seurat, säätiöt ja kerhot sekä niiden toiminta ja organisaatio Erikoisalojen yhdistykset, säätiöt, seurat ja kerhot sekä niiden toiminta luokitetaan alan mukaan

Museot
type: Concept
References: KIRJASTOTOIMI. KIRJASTOTIEDE. INFORMATIIKKA
References: Näyttelyt
References: Yleiset matkaoppaat
References: Taidemuseot. Taidekokoelmat
References: Taidenäyttelyt
References: URN:NBN:fi:au:ykl:92.062
type: YKL-luokka
alternative label: Entistäminen, museonhoito (06.2)
alternative label: Entisöinti, museonhoito (06.2)
alternative label: Kansallismuseot (06.2)
alternative label: Konservering (06.2) @sv
alternative label: Konservering, museiskötsel (06.2) @sv
alternative label: Konservointi (06.2)
alternative label: Konservointi, museonhoito (06.2)
alternative label: Museer (06.2) @sv
alternative label: Museiforskning (06.2) @sv
alternative label: Museipedagogik (06.2) @sv
alternative label: Museiskötsel (06.2) @sv
alternative label: Museiutbildning (06.2) @sv
alternative label: Museokasvatus (06.2)
alternative label: Museologi (06.2) @sv
alternative label: Museologia (06.2)
alternative label: Museonhoito (06.2)
alternative label: Museopedagogiikka (06.2)
alternative label: Museot (06.2)
alternative label: Museotiede (06.2)
alternative label: Nationalmuseer (06.2) @sv
alternative label: Restaurering, museiverksamhet (06.2) @sv
alternative label: Restaurointi, museonhoito (06.2)
broader: YLEINEN KULTTUURIPOLITIIKKA
in scheme: YKL - Yleisten kirjastojen luokitusjärjestelmä
notation: 06.2
preferred label: Museer @sv
preferred label: Museums @en
scope note: Hit allmänna museer eller museer som täcker flera olika områden Museiskötsel och museologi i allmänhet Specialmuseer och skötsel av specialmuseer klassificeras enligt område Formtillägget 062 används inte i samband med klassen 06.2 @sv
scope note: Tähän yleiset tai monia eri aloja käsittävät museot Museonhoito ja museologia yleensä Erikoisalojen museot ja museonhoito luokitetaan alan mukaan Muotoluokkaa 062 ei käytetä luokan 06.2 yhteydessä

Näyttelyt
type: Concept
References: Laajennettu kirjastotoiminta
References: Museot
References: Arkistot
References: Taidenäyttelyt
type: YKL-luokka
alternative label: Kuratering (06.3) @sv
alternative label: Kuratointi (06.3)
alternative label: Maailmannäyttelyt (06.3)
alternative label: Näyttelyt (06.3)
alternative label: Näyttelytoiminta (06.3)
alternative label: Utställningar (06.3) @sv
alternative label: Utställningsverksamheten (06.3) @sv
alternative label: Världsutställningar (06.3) @sv
broader: YLEINEN KULTTUURIPOLITIIKKA
in scheme: YKL - Yleisten kirjastojen luokitusjärjestelmä
notation: 06.3
preferred label: Exhibitions @en
preferred label: Utställningar @sv
scope note: Hit allmänna utställningar eller utställningar som täcker många olika områden Ordnandet av utställningar Hit också världsutställningar Specialutställningar och ordnandet av dem klassificeras enligt område Formtillägget 063 används inte i samband med klassen 06.3 @sv
scope note: Tähän yleiset tai monia eri aloja koskevat näyttelyt Näyttelyiden järjestäminen Tähän myös maailmannäyttelyt Erikoisalojen näyttelyt ja niiden järjestäminen luokitetaan alan mukaan Muotoluokkaa 063 ei käytetä luokan 06.3 yhteydessä

Arkistot
type: Concept
References: Museot
References: Toimistotyö. Toimistotekniikka
References: Valokuvauksen tekniikka. Valokuvausoppaat
type: YKL-luokka
alternative label: Arkistonhoito (06.4)
alternative label: Arkistot (06.4)
alternative label: Arkiv (06.4) @sv
alternative label: Arkivskötsel (06.4) @sv
alternative label: Asiakirjat, arkistot (06.4)
alternative label: Dataarkiv, arkiv (06.4) @sv
alternative label: Handlingar, arkiv (06.4) @sv
alternative label: Kommunal arkivering (06.4) @sv
alternative label: Kunnallinen arkistointi (06.4)
alternative label: Landsarkiv (06.4) @sv
alternative label: Maakunta-arkistot (06.4)
alternative label: Riksarkiv (06.4) @sv
alternative label: Tietoarkistot, arkistot (06.4)
alternative label: Valtionarkistot (06.4)
broader: YLEINEN KULTTUURIPOLITIIKKA
in scheme: YKL - Yleisten kirjastojen luokitusjärjestelmä
notation: 06.4
preferred label: Archives @en
preferred label: Arkiv @sv
scope note: Hit oavsett dokumenteringssätt allmänna arkiv eller arkiv för många olika områden Arkivskötsel Riksarkivet. Landsarkiven Kommunal arkivering Arkiv för specialområden och skötseln av dem klassificeras enligt område Formtillägget 064 används inte i samband med klassen 06.4 @sv
scope note: Tähän tallennustavasta riippumatta yleiset tai monia eri aloja koskevat arkistot Arkistonhoito Valtionarkisto. Maakunta-arkistot Kunnallinen arkistointi Erikoisalojen arkistot ja arkistonhoito luokitetaan alan mukaan Muotoluokkaa 064 ei käytetä luokan 06.4 yhteydessä

Kokoukset. Kulttuuritapahtumat
type: Concept
References: Näyttelyt
References: Kansalaistoiminta ja –aktivismi. Järjestötoiminta. Kokoustekniikka.
References: Kansainväliset järjestöt
type: YKL-luokka
alternative label: Festivaalit (06.5)
alternative label: Festivaler (06.5) @sv
alternative label: Festveckor (06.5) @sv
alternative label: Juhlaviikot (06.5)
alternative label: Kokoukset (06.5)
alternative label: Kongresser (06.5) @sv
alternative label: Kongressit (06.5)
alternative label: Kulttuurikokoukset (06.5)
alternative label: Kulttuuripäivät (06.5)
alternative label: Kulttuuritapahtumat (06.5)
alternative label: Kulttuuritapahtumat, tuotanto (06.5)
alternative label: Kulttuuriviikot (06.5)
alternative label: Kulturdagar (06.5) @sv
alternative label: Kulturevenemang, produktion (06.5) @sv
alternative label: Kulturhändelser (06.5) @sv
alternative label: Kulturmöten (06.5) @sv
alternative label: Kulturveckor (06.5) @sv
alternative label: Möten (06.5) @sv
alternative label: Publikundersökning, kulturevenemang (06.5) @sv
alternative label: Seminaarit (06.5)
alternative label: Seminarier (06.5) @sv
alternative label: Symposier (06.5) @sv
alternative label: Symposiumit (06.5)
alternative label: Yleisötutkimus, kulttuuritapahtumat (06.5)
broader: YLEINEN KULTTUURIPOLITIIKKA
in scheme: YKL - Yleisten kirjastojen luokitusjärjestelmä
notation: 06.5
preferred label: Meetings. Cultural events @en
preferred label: Möten. Kulturevenemang @sv
scope note: Hit möten, kongresser, seminarier eller symposier av som är av allmän karaktär eller som behandlar flera olika områden. Hit också allmänna kultursymposier, kulturevenemang, kulturdagar, kulturveckor och festivaler. Möten och kulturevenemang inom specialområden klassificeras enligt område. Formtillägget 065 används inte i samband med klassen 06.5 @sv
scope note: Tähän yleiset tai monia eri aloja koskevat kokoukset, kongressit, seminaarit ja symposiumit. Tähän myös yleiset kulttuurikokoukset, kulttuuritapahtumat, kulttuuripäivät, kulttuuriviikot ja festivaalit. Erikoisalojen kokoukset ja kulttuuritapahtumat luokitetaan alan mukaan Muotoluokkaa 065 ei käytetä luokan 06.5 yhteydessä

Apurahat
type: Concept
References: Tiedepolitiikka
References: KASVATUS. OPETUS. KASVATUSTIEDE
References: Taidepsykologia. Taidesosiologia. Taidepolitiikka
type: YKL-luokka
alternative label: Apurahat (06.6)
alternative label: Kulttuurirahastot (06.6)
alternative label: Kulturfonder (06.6) @sv
alternative label: Nobelin palkinnot (06.6)
alternative label: Nobelpris (06.6) @sv
alternative label: Palkinnot (06.6)
alternative label: Pris (06.6) @sv
alternative label: Stipendier (06.6) @sv
alternative label: Stipendit (06.6)
broader: YLEINEN KULTTUURIPOLITIIKKA
in scheme: YKL - Yleisten kirjastojen luokitusjärjestelmä
notation: 06.6
preferred label: Scholarships @en
preferred label: Stipendier @sv
scope note: Hit privata och offentliga stipendier, pris och understödssystem för kultur Hit t.ex. Nobelpris i allmänhet Stipendier, pris och understödssystem för specialområden klassificeras enligt område @sv
scope note: Tähän yksityiset ja julkiset apurahat, palkinnot ja stipendit sekä kulttuuritoiminnan tukijärjestelmät Tähän esim. Nobelin palkinnot yleensä Erikoisalojen apurahat, palkinnot, stipendit ja tukijärjestelmät luokitetaan alan mukaan

Lasten ja nuorten kulttuuritoiminta
type: Concept
References: Elämäntapojen sosiologia. Kulttuurisosiologia
References: Ikäryhmien asema yhteiskunnassa
References: Nuorisotyö. Lapsityö
References: Partioliike
type: YKL-luokka
alternative label: Barnkultur, kulturpolitik (06.8) @sv
alternative label: Lastenkulttuuri, kulttuuripolitiikka (06.8)
alternative label: Nuorisokulttuuri, kulttuuripolitiikka (06.8)
alternative label: Nuorisotalot, kulttuuripolitiikka (06.8)
alternative label: Ungdomshus, kulturpolitik (06.8) @sv
alternative label: Ungdomskultur, kulturpolitik (06.8) @sv
broader: YLEINEN KULTTUURIPOLITIIKKA
in scheme: YKL - Yleisten kirjastojen luokitusjärjestelmä
notation: 06.8
preferred label: Cultural work for children and young people @en
preferred label: Kultur för barn och unga @sv
scope note: Kultur, kulturutbud och kulturevenemang för barn och unga, barns och ungas kulturella intressen i allmänhet samt kulturfostran Barn- och ungdomskultur ur kulturpolitisk synvinkel Kulturcenter för barn Specialområden inom barn- och ungdomskultur klassificeras enligt område @sv
scope note: Lasten ja nuorten kulttuuritoiminta, kulttuuripalvelut, kulttuuriharrastukset, kulttuuritapahtumat ja kulttuurikasvatus yleensä Lasten- ja nuorisokulttuuri kulttuuripolitiikan kannalta Lasten kulttuurikeskukset Lasten ja nuorten erikoisalojen kulttuuritoiminta luokitetaan alan mukaan

VIESTINTÄ. JOUKKOVIESTINTÄ
type: Concept
References: KIRJA-ALA
References: Kustannustoiminta. Kirjakauppa
References: KIRJASTOTOIMI. KIRJASTOTIEDE. INFORMATIIKKA
References: YLEINEN KULTTUURIPOLITIIKKA
References: Elämäntapojen sosiologia. Kulttuurisosiologia
References: Sosiaalipsykologia
References: Julkis- ja hallinto-oikeus
References: Tietoliikenne. Viestintätekniikka. Multimedia
References: Mainonta
References: Posti
alternative label: Bildjournalistik (07+) @sv
alternative label: Censur, masskommunikation (07+) @sv
alternative label: Cybersäkerhet, masskommunikation (07+) @sv
alternative label: Datasekretess, masskommunikation (07+) @sv
alternative label: Informaatiolukutaito (07+)
alternative label: Informaatiomuotoilu (07+)
alternative label: Informaatiosodankäynti, joukkotiedotus (07+)
alternative label: Information, masskommunikation (07+) @sv
alternative label: Informationsdesign (07+) @sv
alternative label: Informationsförmedling, allm. (07) @sv
alternative label: Informationsförmedling, sociologi, allm. (07) @sv
alternative label: Informationskompetens (07+) @sv
alternative label: Informationskrigföring, masskommunikation (07+) @sv
alternative label: Joukkoviestintä (07+)
alternative label: Journalism (07+) @sv
alternative label: Journalismi (07+)
alternative label: Journalistens arbete, allm. (07) @sv
alternative label: Journalistik (07+) @sv
alternative label: Julkisen sanan neuvosto (07+)
alternative label: Kirjoittaminen, journalismi (07+)
alternative label: Kommunikaatiososiologia, yl. (07)
alternative label: Kommunikation, allm. (07) @sv
alternative label: Kommunikationsfostran, allm. (07) @sv
alternative label: Kommunikationssociologi, allm. (07) @sv
alternative label: Kriisit, viestintä (07+)
alternative label: Kriisiviestintä (07+)
alternative label: Kriser, kommunikation (07+) @sv
alternative label: Kuvajournalismi (07+)
alternative label: Kyberturvallisuus, joukkotiedotus (07+)
alternative label: Manipulaatio, joukkotiedotus (07+)
alternative label: Media (07+)
alternative label: Mediakasvatus (07+)
alternative label: Mediakulttuuri, joukkotiedotus (07+)
alternative label: Medialukutaito (07+)
alternative label: Mediatiede (07+)
alternative label: Sananvapaus, joukkotiedotus (07+)
alternative label: Satelliitit, joukkotiedotus (07+)
alternative label: Sensuuri, joukkotiedotus (07+)
alternative label: Tiedon sosiologia, yl. (07)
alternative label: Tiedonvälitys, sosiologia, yl. (07)
alternative label: Tiedonvälitys, yl. (07)
alternative label: Tiedotus, joukkotiedotus (07+)
alternative label: Tiedotustutkimus, yl. (07)
alternative label: Tiedotusvälineet (07+)
alternative label: Tieto, disinformaatio (07)
alternative label: Tieto, valeuutiset (07)
alternative label: Tietoliikenne, joukkotiedotus (07+)
alternative label: Tietoliikennesatelliitit, joukkotiedotus (07+)
alternative label: Tietoliikenneverkot, joukkotiedotus (07+)
alternative label: Tietosuoja, joukkotiedotus (07+)
alternative label: Tietotoimistot (07+)
alternative label: Toimittajan työ, yl. (07)
alternative label: Toimitustyö, yl. (07)
alternative label: Uusmedia, joukkotiedotus (07+)
alternative label: Uutistoiminta (07+)
alternative label: Uutistoimistot (07+)
alternative label: Uutistoimittajan työ (07+)
alternative label: Uutisvälitys (07+)
alternative label: Viestintä, yl. (07)
alternative label: Viestintäkasvatus, yl. (07)
alternative label: Yleisötutkimus, joukkoviestintä (07+)
broader: YLEISTEOKSET. KIRJA-ALA. KIRJASTOTOIMI YLEINEN KULTTUURIPOLITIIKKA. JOUKKOTIEDOTUS
in scheme: YKL - Yleisten kirjastojen luokitusjärjestelmä
narrower: Kommunikaatioteoria
narrower: Lehdistöoppi
narrower: Radio- ja televisiotoiminta
notation: 07
scope note: Hit allmänna verk om kommunikation och masskommunikation Hit allmänna verk om medievetenskap och journalism Hit och till underklasserna masskommunikationens sociologi, masskommunikationens ställning i samhället och masskommunikationens oavhängighet. Censur av masskommunikation Hit och till underklasserna också mediekunskap och kommunikationsfostran Hit och till underklasserna också nyhetsförmedling och nyhetsbyråer Hit Opinionsnämnden för massmedier Om verket behandlar både masskommunikation och telekommunikation eller telekommunikationsteknik, ges företräde åt klass 07+ Kommunikation inom specialområden klassificeras enligt område. Informationskompetens inom specialområden klassificeras enligt område @sv
scope note: Tähän viestinnän, joukkoviestinnän ja mediatieteen yleisteokset Journalismi yleensä Tähän ja alaluokkiin joukkoviestinnän sosiologia, joukkotiedotuksen asema yhteiskunnassa sekä joukkoviestinnän riippumattomuus ja sensuuri Tähän ja alaluokkiin myös media- ja viestintäkasvatus Tähän ja alaluokkiin myös uutisvälitys ja uutistoimistot Tähän Julkisen sanan neuvosto Jos teos koskee sekä joukkoviestintää että tietoliikennettä tai tietoliikennetekniikkaa, annetaan etusija luokalle 07+ Erikoisalojen viestintä luokitetaan alan mukaan. Erikoisalojen informaatiolukutaito luokitetaan aiheen mukaan.

Kommunikaatioteoria
type: Concept
References: TIETOTEKNIIKKA. TIETOLIIKENNE. VIESTINTÄTEKNIIKKA. TEKOÄLY
References: Tietoliikenne. Viestintätekniikka. Multimedia
type: YKL-luokka
alternative label: Informaatioteoria (07.01)
alternative label: Informationsteori (07.01) @sv
alternative label: Kommunikaatioteoria (07.01)
alternative label: Kommunikationsteori (07.01) @sv
alternative label: Kybernetiikka, yl. (07.01)
alternative label: Kybernetik, allm. (07.01) @sv
broader: VIESTINTÄ. JOUKKOVIESTINTÄ
in scheme: YKL - Yleisten kirjastojen luokitusjärjestelmä
notation: 07.01
preferred label: Communications theory @en
preferred label: Kommunikationsteori @sv
scope note: Hit allmänna verk om kommunikationsteori, informationsteori och kybernetik Hit också masskommunikationens filosofi, teori och forskningsmetoder i allmänhet Tillämpningar av kommunikationsteori, informationsteori och kybernetik på olika områden klassificeras enligt område @sv
scope note: Tähän kommunikaatioteorian, informaatioteorian ja kybernetiikan yleisteokset Tähän myös joukkotiedotuksen filosofia, teoria ja tutkimusmenetelmät yleensä Kommunikaatioteorian, informaatioteorian ja kybernetiikan sovellukset eri aloille luokitetaan alan mukaan

Lehdistöoppi
type: Concept
References: Kustannustoiminta. Kirjakauppa
References: Yleisbibliografiat. Kansallisbibliografiat
References: Paikallisbibliografiat
References: Henkilöbibliografiat
References: Erikoisalojen luettelot
References: Kirjastojen yhteisluettelot
References: Yksittäisten kirjastojen luettelot
References: YLEISET KAUSIJULKAISUT
References: Mainonta
References: Valokuvaus. Valokuvataide
type: YKL-luokka
alternative label: Bildjournalistik, pressen (07.1) @sv
alternative label: E-lehdet, joukkotiedotus (07.1)
alternative label: E-lehdet, journalismi (07.1)
alternative label: E-tidskrifter, journalistik (07.1) @sv
alternative label: E-tidskrifter, masskommunikation (07.1) @sv
alternative label: God journalistisk sed (07.1) @sv
alternative label: Hyvä lehtimiestapa (07.1)
alternative label: Joukkoviestintä, lehdistö (07.1)
alternative label: Journalism, pressen (07.1) @sv
alternative label: Journalismi. lehdistö (07.1)
alternative label: Journalistens arbete, tidningspress (07.1) @sv
alternative label: Journalistik, pressen (07.1) @sv
alternative label: Kuvajournalismi, lehdistö (07.1)
alternative label: Lehdet, toimittaminen (07.1)
alternative label: Lehdistö, joukkotiedotus (07.1)
alternative label: Lehdistö, uutistoiminta (07.1)
alternative label: Lehdistöoppi (07.1)
alternative label: Levikkitutkimukset, lehdistö (07.1)
alternative label: Lokalpress, journalistik (07.1) @sv
alternative label: Lukijatutkimukset, lehdistö (07.1)
alternative label: Läsarundersökningar, pressen (07.1) @sv
alternative label: Masskommunikation, tidningspress (07.1) @sv
alternative label: Nättidskrifter, journalistik (07.1) @sv
alternative label: Nättidskrifter, masskommunikation (07.1) @sv
alternative label: Paikallislehdistö, lehdistöoppi (07.1)
alternative label: Partipress, journalistik (07.1) @sv
alternative label: Pressen, masskommunikation (07.1) @sv
alternative label: Pressen, nyhetsförmedling (07.1) @sv
alternative label: Puoluelehdistö, lehdistöoppi (07.1)
alternative label: Redaktionsarbete, tidningspress (07.1) @sv
alternative label: Sanomalehdet, toimittaminen (07.1)
alternative label: Sanomalehdistö, lehdistöoppi (07.1)
alternative label: Tidningar och tidskrifter, redigering (07.1) @sv
alternative label: Tidningar, redigering (07.1) @sv
alternative label: Tidningspressen, journalistik (07.1) @sv
alternative label: Toimittajan työ, lehdistö (07.1)
alternative label: Toimitustyö, lehdistö (07.1)
alternative label: Upplageundersökningar, pressen (07.1) @sv
alternative label: Verkkolehdet, joukkotiedotus (07.1)
alternative label: Verkkolehdet, journalismi (07.1)
broader: VIESTINTÄ. JOUKKOVIESTINTÄ
in scheme: YKL - Yleisten kirjastojen luokitusjärjestelmä
notation: 07.1
preferred label: Journalism @en
preferred label: Journalistik @sv
scope note: Allmänna verk om tidnings- och tidskriftspress Allmänna verk om lokal- och partipress Tidningspressens nyhetsförmedling Tidnings- och tidskriftspressens redaktioner och hur man redigerar tidningar och tidskrifter Journalism, bildjournalism och redaktörens arbete ur pressens synvinkel God journalistisk sed Läsarundersökningar. Upplageundersökningar Tidningarnas och tidskrifternas samt pressens allmänna historia 07.109 @sv
scope note: Sanoma- ja aikakauslehdistöä koskevat yleisteokset Paikallis- ja puoluelehdistöä koskevat yleisteokset Lehdistön uutistoiminta Sanoma- ja aikakauslehtien toimitukset ja toimittaminen Journalismi ja kuvajournalismi lehdistön kannalta Lehtitoimittajan työ. Hyvä lehtimiestapa Lukijatutkimukset. Levikkitutkimukset Sanoma- ja aikakauslehtien sekä lehdistön yleinen historia 07.109

Radio- ja televisiotoiminta
type: Concept
References: Oppimateriaalit. Opetusvälineet
References: Audiovisuaalinen tekniikka
References: Radio- ja tv-teatteri
References: NÄYTELMÄT
References: KERTOMAKIRJALLISUUS
type: YKL-luokka
alternative label: Elektroniset lehdet, toimittaminen (07.2+)
alternative label: Elektroniska tidningar, redigering (07.2+) @sv
alternative label: Joukkoviestintä, radio ja televisio (07.2+)
alternative label: Masskommunikation, radio och television (07.2+) @sv
alternative label: Puheviestintä, joukkotiedotus (07.2+)
alternative label: Radio- ja televisiotoiminta (07.2)
alternative label: Radio- och televisionsverksamhet (07.2) @sv
alternative label: Rundradion (07.2) @sv
alternative label: Satelliittiviestintä, audiovisuaalinen tekniikka (07.2+)
alternative label: Satelliittiviestintä, joukkotiedotus (07.2+)
alternative label: Satellitkommunikation, AV-teknik (07.2+) @sv
alternative label: Satellitkommunikation, masskommunikation (07.2+) @sv
alternative label: Talkommunikation, masskommunikation (07.2+) @sv
alternative label: Yleisradio (07.2)
broader: VIESTINTÄ. JOUKKOVIESTINTÄ
in scheme: YKL - Yleisten kirjastojen luokitusjärjestelmä
narrower: Radiotoiminta
narrower: Televisiotoiminta
notation: 07.2
preferred label: Radio and television @en
preferred label: Radio och television: programverksamhet @sv
scope note: Hit allmänna verk om programverksamhet i radio och television Hit också allmänna verk om programpolitik i radio och television Elektroniska massmedier i allmänhet Talkommunikation ur masskommunikationens synvinkel Allmänna verk om radio- och TV-journalism Om verket behandlar både programverksamhet i radio och television och radio- och televisionsteknik, ges företräde åt klass 07.2+ Radio- och televisionprogram och inspelningar med radio- och televisionprogram klassificeras engligt område @sv
scope note: Tähän yleisteokset, jotka koskevat sekä radio- että televisiotoimintaa Tähän myös yleisteokset, jotka koskevat sekä radion että television ohjelmapolitiikkaa Sähköiset joukkoviestimet yleensä Tähän ja alaluokkiin myös puheviestintä joukkotiedotuksen kannalta Radio- ja tv-journalismia koskevat yleisteokset Jos teos koskee sekä radio- tai televisiotoimintaa että radio- tai televisiotekniikkaa, annetaan etusija luokalle 07.2+ Radio- ja televisio-ohjelmat ja niiden taltioinnit luokitetaan alan mukaan

Radiotoiminta
type: Concept
References: Oppimateriaalit. Opetusvälineet
References: Äänitekniikka. Radiotekniikka
References: Mainonta
References: Radio- ja tv-teatteri
References: NÄYTELMÄT
type: YKL-luokka
alternative label: Dokumenttiohjelmat, radiotoiminta (07.21)
alternative label: Dokumentärprogram, programverksamhet i radio (07.21) @sv
alternative label: Hörbarhetsområden, radio (07.21) @sv
alternative label: Joukkoviestintä, radio (07.21)
alternative label: Journalistens arbete, radio (07.21) @sv
alternative label: Kaapeliradio, joukkotiedotus (07.21)
alternative label: Kabelradio, masskommunikation (07.21) @sv
alternative label: Kuuluvuusalueet, radio (07.21)
alternative label: Kuuntelijatutkimukset, radio (07.21)
alternative label: Lokalradio (07.21) @sv
alternative label: Lyssnarundersökningar, radio (07.21) @sv
alternative label: Masskommunikation, radio (07.21) @sv
alternative label: Ohjelmistonsuunnittelu, radio (07.21)
alternative label: Paikallisradiotoiminta (07.21)
alternative label: Programplanering, radio (07.21) @sv
alternative label: Radio (07.21)
alternative label: Radio, joukkotiedotus (07.21)
alternative label: Radio, masskommunikation (07.21) @sv
alternative label: Radio, nyhetsverksamhet (07.21) @sv
alternative label: Radio, ohjelmatoiminta (07.21)
alternative label: Radio, programverksamhet (07.21) @sv
alternative label: Radio, uutistoiminta (07.21)
alternative label: Radio-ohjelmat, ohjelmapolitiikan tutkimus (07.21)
alternative label: Radioasemat, joukkotiedotus (07.21)
alternative label: Radiokanaler, masskommunikation (07.21) @sv
alternative label: Radiokanavat, joukkotiedotus (07.21)
alternative label: Radioproducenter (07.21) @sv
alternative label: Radioprogram, forskning i programpolitik (07.21) @sv
alternative label: Radioredaktörens arbete (07.21) @sv
alternative label: Radiosatelliitit, joukkotiedotus (07.21)
alternative label: Radiosatelliter, masskommunikation (07.21) @sv
alternative label: Radiostationer, masskommunikation (07.21) @sv
alternative label: Radiotoiminta (07.21)
alternative label: Radiotoimittajan työ (07.21)
alternative label: Radiotuottajat (07.21)
alternative label: Radioverksamhet (07.21) @sv
alternative label: Redaktionsarbete, radio (07.21) @sv
alternative label: Rundradion, radio (07.21) @sv
alternative label: Satelliitit, radiotoiminta (07.21)
alternative label: Satelliter, radioverksamhet (07.21) @sv
alternative label: Taltidningar, redigering (07.21) @sv
alternative label: Toimittajan työ, radio (07.21)
alternative label: Toimitustyö, radio (07.21)
alternative label: Yleisradio, radiotoiminta (07.21)
alternative label: Äänilehdet, toimittaminen (07.21)
broader: Radio- ja televisiotoiminta
in scheme: YKL - Yleisten kirjastojen luokitusjärjestelmä
notation: 07.21
preferred label: Programverksamhet i radio @sv
preferred label: Radio @en
scope note: Riks- och lokalradiostationer Radions programverksamhet och programpolitik Radions nyhetsförmedling Radiojournalism Att redigera taltidningar Lyssnarundersökningar Om verket behandlar både radions programverksamhet och radioteknik, ges företräde åt klass 07.21 Radioprogram och inspelningar med radioprogram klassificeras enligt område @sv
scope note: Yleis- ja paikallisradioasemien radiotoiminta Radion ohjelmatoiminta ja -politiikka Radion uutistoiminta Radiotoimittajan työ. Radiojournalismi Äänilehden toimittaminen Kuuntelijatutkimukset Jos teos koskee sekä radion ohjelmatoimintaa että radiotekniikkaa, annetaan etusija luokalle 07.21 Radio-ohjelmat ja niiden taltioinnit luokitetaan alan mukaan

Televisiotoiminta
type: Concept
References: Oppimateriaalit. Opetusvälineet
References: Kuvantoistotekniikka. Televisiotekniikka
References: Mainonta
References: Radio- ja tv-teatteri
References: Elokuva. Elokuvataide
References: Elokuvatekniikka
References: KERTOMAKIRJALLISUUS
type: YKL-luokka
alternative label: Dokumenttiohjelmat, televisiotoiminta (07.22)
alternative label: Dokumentärprogram, programverksamhet i television (07.22) @sv
alternative label: Joukkoviestintä, televisio (07.22)
alternative label: Journalistens arbete, television (07.22) @sv
alternative label: Kaapelitelevisio, joukkotiedotus (07.22)
alternative label: Kabeltelevision, masskommunikation (07.22) @sv
alternative label: Katselijatutkimukset, televisio (07.22)
alternative label: Lokal-TV (07.22) @sv
alternative label: Masskommunikation, television (07.22) @sv
alternative label: Näkyvyysalueet, televisio (07.22)
alternative label: Ohjelmistonsuunnittelu, televisio (07.22)
alternative label: Paikallistelevisiotoiminta (07.22)
alternative label: Programplanering, TV (07.22) @sv
alternative label: Redaktionsarbete, television (07.22) @sv
alternative label: Rundradion, television (07.22) @sv
alternative label: Satelliitit, televisiotoiminta (07.22)
alternative label: Satelliittitelevisio, joukkotiedotus (07.22)
alternative label: Satellit-TV, masskommunikation (07.22) @sv
alternative label: Satelliter, televisionsverksamhet (07.22) @sv
alternative label: Sebarhetsområden, TV (07.22) @sv
alternative label: TV (07.22) @sv
alternative label: TV, masskommunikation (07.22) @sv
alternative label: TV, nyhetsförmedling (07.22) @sv
alternative label: TV, programverksamhet (07.22) @sv
alternative label: TV-journalistens arbete (07.22) @sv
alternative label: TV-kanaler, masskommunikation (07.22) @sv
alternative label: TV-producenter (07.22) @sv
alternative label: TV-program, forskning i programpolitik (07.22) @sv
alternative label: TV-satelliter, masskommunikation (07.22) @sv
alternative label: TV-stationer, masskommunikation (07.22) @sv
alternative label: Televisio (07.22)
alternative label: Televisio, joukkotiedotus (07.22)
alternative label: Televisio, ohjelmatoiminta (07.22)
alternative label: Televisio, uutistoiminta (07.22)
alternative label: Televisio-ohjelmat, ohjelmapolitiikan tutkimus (07.22)
alternative label: Televisioasemat, joukkotiedotus (07.22)
alternative label: Televisiokanavat, joukkotiedotus (07.22)
alternative label: Televisiosatelliitit, joukkotiedotus (07.22)
alternative label: Televisiotoiminta (07.22)
alternative label: Televisiotoimittajan työ (07.22)
alternative label: Televisiotuottajat (07.22)
alternative label: Tittarundersökningar, TV (07.22) @sv
alternative label: Toimittajan työ, televisio (07.22)
alternative label: Toimitustyö, televisio (07.22)
alternative label: Video, joukkotiedotus (07.22)
alternative label: Video, masskommunikation (07.22) @sv
alternative label: Video-ohjelmat, joukkotiedotus (07.22)
alternative label: Videolehdet, toimittaminen (07.22)
alternative label: Videomagasin, redigering (07.22) @sv
alternative label: Videoprogram, masskommunikation (07.22) @sv
alternative label: Yleisradio, televisiotoiminta (07.22)
broader: Radio- ja televisiotoiminta
in scheme: YKL - Yleisten kirjastojen luokitusjärjestelmä
notation: 07.22
preferred label: Programverksamhet i television @sv
preferred label: Television @en
scope note: Programverksamhet i riksradiostationerna Programverksamhet i lokal-, kabel- och satellittelevision Programverksamhet och programpolitik i television Televisionens nyhetsverksamhet TV-journalism Redigering av tele- och videotidningar Tittarundersökningar Om verket behandlar både programverksamhet i TV och TV-teknik, ges företräde åt klass 07.22 TV-program och inspelningar med TV-program klassificeras enligt område @sv
scope note: Yleisradioasemien sekä paikallis-, kaapeli- ja satelliittitelevisioasemien televisiotoiminta Television ohjelmatoiminta ja -politiikka Television uutistoiminta Televisiotoimittajan työ Tele- ja videolehtien toimittaminen Katselijatutkimukset Jos teos koskee sekä television ohjelmatoimintaa että televisiotekniikkaa, annetaan etusija luokalle 07.22 Televisio-ohjelmat ja niiden taltioinnit luokitetaan alan mukaan

FILOSOFIA. PSYKOLOGIA. RAJATIETO. TIEDEOPPI
type: Concept
type: YKL-luokka
in scheme: YKL - Yleisten kirjastojen luokitusjärjestelmä
narrower: YLEISTEOKSET
narrower: FILOSOFIA
narrower: LOGIIKKA
narrower: PSYKOLOGIA
narrower: RAJATIETO
narrower: TIETOTEORIA. TIEDEOPPI
narrower: ETIIKKA. ELÄMÄNFILOSOFIA. ESTETIIKKA
notation: 1
preferred label: FILOSOFI. PSYKOLOGI PARANORMALA FENOMEN. VETENSKAPSTEORI @sv
preferred label: PHILOSOPHY. PSYCHOLOGY. PARANORMAL PHENOMENA. THEORY OF SCIENCE @en
top concept of: YKL - Yleisten kirjastojen luokitusjärjestelmä

YLEISTEOKSET
type: Concept
References: FILOSOFIA
References: PSYKOLOGIA
References: RAJATIETO
type: YKL-luokka
broader: FILOSOFIA. PSYKOLOGIA. RAJATIETO. TIEDEOPPI
in scheme: YKL - Yleisten kirjastojen luokitusjärjestelmä
narrower: Mietelausekokoelmat. Sitaattikokoelmat
notation: 10
preferred label: ALLMÄNNA VERK @sv
preferred label: GENERAL WORKS @en
scope note: Hit verk som behandlar både filosofi, psykologi och paranormala fenomen Formtilläggen 01 och 04 används inte i samband med klassen 10 @sv
scope note: Tähän teokset, jotka koskevat sekä filosofiaa, psykologiaa että rajatietoa Muotoluokkia 01 ja 04 ei käytetä luokan 10 yhteydessä

Mietelausekokoelmat. Sitaattikokoelmat
type: Concept
References: Sanakirjat
type: YKL-luokka
alternative label: Aforismer, allm. (10.8) @sv
alternative label: Aforismer, forskning, allm. (10.8) @sv
alternative label: Aforismit, tutkimus , yl.(10.8)
alternative label: Aforismit, yl. (10.8)
alternative label: Ajatelmat (10.8)
alternative label: Citat (10.8) @sv
alternative label: Citatsamlingar (10.8) @sv
alternative label: Maximer (10.8) @sv
alternative label: Mietelauseet (10.8)
alternative label: Sitaatit (10.8)
alternative label: Sitaattikokoelmat (10.8)
alternative label: Tänkespråk (10.8) @sv
broader: YLEISTEOKSET
in scheme: YKL - Yleisten kirjastojen luokitusjärjestelmä
notation: 10.8
preferred label: Aforism- och citatsamlingar @sv
preferred label: Aphorism collections. Quotation collections @en
scope note: Hit allmänna samlingar av tänkespråk, aforismer, sentenser och citat Bevingade ord Hit också samlade tänkespråk och citat ur någon bestämd författares produktion Samlingar av tänkespråk och citat från olika områden klassificeras enligt område. I osäkra fall ges företräde åt klass 10.8 Formtilläggen 01 och 04 används inte i samband med klassen 10.8 @sv
scope note: Tähän yleiset mietelause-, aforismi-, ajatelma-ja sitaattikokoelmat Lentävät lauseet. Siivekkäät sanat Tähän myös tietyn kirjailijan tuotannosta kootut mietelause- ja sitaattikokoelmat Eri alojen mietelause- ja sitaattikokoelmat luokitetaan alan mukaan. Epävarmoissa tapauksissa annetaan etusija luokalle 10.8 Muotoluokkia 01 ja 04 ei käytetä luokan 10.8 yhteydessä

FILOSOFIA
type: Concept
References: URN:NBN:fi:au:ykl:00.201
References: LOGIIKKA
References: RAJATIETO
References: Okkultismi. Spiritismi. Spiritualismi. Henkimaailma
References: TIETOTEORIA. TIEDEOPPI
References: ETIIKKA. ELÄMÄNFILOSOFIA. ESTETIIKKA
References: USKONNONFILOSOFIA
References: Kielifilosofia
References: Historianfilosofia. Kulttuurifilosofia
References: Yleinen kulttuurihistoria
alternative label: Aine, metafysiikka (11+)
alternative label: Ande, metafysik (11+) @sv
alternative label: Antropologi, metafysisk (11+) @sv
alternative label: Antropologia, metafyysinen (11+)
alternative label: Arabialainen filosofia (11+)
alternative label: Arabisk filosofi (11+) @sv
alternative label: Ateism, metafysik (11+) @sv
alternative label: Ateismi, metafysiikka (11+)
alternative label: Deism, metafysik (11+) @sv
alternative label: Deismi, metafysiikka (11+)
alternative label: Dualism, metafysik (11+) @sv
alternative label: Dualismi, metafysiikka (11+)
alternative label: Döden, metafysik (11+) @sv
alternative label: Eksistenssi, metafysiikka (11+)
alternative label: Elämä, metafysiikka (11+)
alternative label: Existens, metafysik (11+) @sv
alternative label: Filosofi (11+) @sv
alternative label: Filosofi, metafysik (11+) @sv
alternative label: Filosofia (11+)
alternative label: Filosofia, metafysiikka (11+)
alternative label: Filosofian historia (11+)
alternative label: Filosofins historia (11+) @sv
alternative label: Fri vilja, metafysik (11+) @sv
alternative label: Gud, metafysik (11+) @sv
alternative label: Henki, metafysiikka (11+)
alternative label: Idealism, metafysik (11+) @sv
alternative label: Idealismi, metafysiikka (11+)
alternative label: Ihminen, metafysiikka (11+)
alternative label: Islamilainen filosofia (11+)
alternative label: Islamisk filosofi (11+) @sv
alternative label: Jumala, metafysiikka (11+)
alternative label: Kohtalo, metafysiikka (11+)
alternative label: Kosmologi, metafysik (11+) @sv
alternative label: Kosmologia, metafysiikka (11+)
alternative label: Kuolema, metafysiikka (11+)
alternative label: Liv, metafysik (11+) @sv
alternative label: Luonnonfilosofia, metafysiikka (11+)
alternative label: Maailmankaikkeus, metafysiikka (11+)
alternative label: Materialism, metafysik (11+) @sv
alternative label: Materialismi, metafysiikka (11+)
alternative label: Materien, metafysik (11+) @sv
alternative label: Metafysiikka, filosofia (11+)
alternative label: Mielenfilosofia (11+)
alternative label: Monismi, metafysiikka (11+)
alternative label: Mystiikka, metafysiikka (11+)
alternative label: Olemassaolo, metafysiikka (11+)
alternative label: Ontologia, metafysiikka (11+)
alternative label: Panteismi, metafysiikka (11+)
alternative label: Pluralismi, metafysiikka (11+)
alternative label: Sielu, metafysiikka (11+)
alternative label: Spiritualismi, metafysiikka (11+)
alternative label: Tahdonvapaus, metafysiikka (11+)
alternative label: Tarkoitus, metafysiikka (11+)
alternative label: Teismi, metafysiikka (11+)
alternative label: Teleologia, metafysiikka (11+)
alternative label: Tietoisuus, metafysiikka (11+)
alternative label: Todellisuus, filosofia (11+)
alternative label: Vapaa tahto, metafysiikka (11+)
broader: FILOSOFIA. PSYKOLOGIA. RAJATIETO. TIEDEOPPI
in scheme: YKL - Yleisten kirjastojen luokitusjärjestelmä
narrower: Vanhan ajan filosofia
narrower: Keskiajan filosofia
narrower: Renessanssin ja uuden ajan filosofia
narrower: Uusimman ajan filosofia
narrower: Nykyajan filosofia
narrower: Itämainen filosofia
notation: 11
scope note: Hit allmänna verk om filosofi och filosofins historia, grundbegrepp i filosofin, fundamentala problem i filosofin samt introduktion till filosofin Hit och till underklasserna också filosofins historia i olika länder och under olika epoker Hit och till underklasserna också arabisk och islamisk filosofi Hit och till underklasserna den metafysiska filosofin och dess specialfrågor, såsom kosmologi och naturfilosofi, ontologi och existentiell metafysik, teleologi, mening och mål som metafysiska frågor, metafysisk antropologi samt människan, anden, själen, den fria viljan, ödet, livet, döden och gudsproblemet som metafysiska frågor Hit och till underklasserna också riktningar inom metafysiken, såsom monism, dualism, pluralism, idealism, spiritualism och materialism Filosofi för speciella områden klassificeras enligt område Formtilläggen 01 och 09 används inte i samband med klasserna 11-11.9 @sv
scope note: Tähän filosofian ja filosofian historian yleisteokset, filosofian peruskäsitteet, filosofian perusongelmat sekä johdatukset filosofiaan Tähän ja alaluokkiin myös eri maiden ja aikakausien filosofian historia Tähän ja alaluokkiin myös arabialainen ja islamilainen filosofia Tähän ja alaluokkiin metafyysinen filosofia ja sen erikoiskysymykset, kuten kosmologia ja luonnonfilosofia, ontologia ja olemassaolon metafysiikka, teleologia ja tarkoituksen metafysiikka, metafyysinen antropologia sekä ihmisen, hengen, sielun, tahdonvapauden, kohtalon, elämän, kuoleman ja Jumala-ongelman metafysiikka Tähän ja alaluokkiin myös metafysiikan suunnat, kuten monismi, dualismi, pluralismi, idealismi, spiritualismi ja materialismi Erikoisalojen filosofia luokitetaan alan mukaan Muotoluokkia 01 ja 09 ei käytetä luokkien 11-11.9 yhteydessä

Vanhan ajan filosofia
type: Concept
References: Antiikin uskonnot ja mytologiat
References: Vanha aika, antiikin historia
type: YKL-luokka
alternative label: Antiikki, filosofia (11.1)
alternative label: Antiken, filosofi (11.1) @sv
alternative label: Atomisterna, antikens filosofi (11.1) @sv
alternative label: Atomistit, antiikin filosofia (11.1)
alternative label: Epikurism (11.1) @sv
alternative label: Epikurolaisuus (11.1)
alternative label: Filosofian historia, antiikki (11.1)
alternative label: Filosofian historia, vanha aika (11.1)
alternative label: Filosofins historia, antiken (11.1) @sv
alternative label: Filosofins historia, gamla tiden (11.1) @sv
alternative label: Nyplatonism, antikens filosofi (11.1) @sv
alternative label: Platonism, antikens filosofi (11.1) @sv
alternative label: Platonismi, antiikin filosofia (11.1)
alternative label: Pytagoreism (11.1) @sv
alternative label: Pythagoralaisuus (11.1)
alternative label: Skeptiker, antikens filosofi (11.1) @sv
alternative label: Skeptikot, antiikin filosofia (11.1)
alternative label: Sofister, antikens filosofi (11.1) @sv
alternative label: Sofistit, antiikin filosofia (11.1)
alternative label: Stoalaisuus (11.1)
alternative label: Stoicism (11.1) @sv
alternative label: Uusplatonismi, antiikin filosofia (11.1)
broader: FILOSOFIA
in scheme: YKL - Yleisten kirjastojen luokitusjärjestelmä
notation: 11.1
preferred label: Ancient philosophy @en
preferred label: Gamla tidens filosofi @sv
scope note: Antiikin Kreikan ja Rooman filosofia Esisokraattisen, klassisen ja hellenistisen kauden kreikkalainen filosofia Pythagoralaiset. Atomistit. Sofistit. Platonistit. Stoalaiset. Epikurolaiset. Skeptikot. Uusplatonistit Muotoluokkia 01 ja 09 ei käytetä luokkien 11-11.9 yhteydessä
scope note: Filosofi i antikens Grekland och Rom Grekisk filosofi under den försokratiska, klassiska och hellenistiska tiden Pythagoréer. Atomister. Sofister. Platoniker. Stoiker. Epikuréer. Skeptiker. Nyplatoniker Formtilläggen 01 och 09 används inte i samband med klasserna 11-11.9 @sv

Keskiajan filosofia
type: Concept
References: Kristinusko. Teologia
References: DOGMATIIKKA. KRISTILLINEN ETIIKKA
References: Keskiaika
type: YKL-luokka
alternative label: Filosofian historia, keskiaika (11.2)
alternative label: Filosofins historia, medeltiden (11.2) @sv
alternative label: Keskiaika, filosofia (11.2)
alternative label: Medeltiden, filosofi (11.2) @sv
alternative label: Skolastiikka (11.2)
alternative label: Skolastik (11.2) @sv
broader: FILOSOFIA
in scheme: YKL - Yleisten kirjastojen luokitusjärjestelmä
notation: 11.2
preferred label: Medeltida filosofi @sv
preferred label: Medieval philosophy @en
scope note: Keskiajan filosofia n. vuoteen 1450. Skolastiikka Tähän myös keskiajan bysanttilainen ja islamilainen filosofia Muotoluokkia 01 ja 09 ei käytetä luokkien 11-11.9 yhteydessä
scope note: Medeltida filosofi till ca år 1450. Skolastik Hit också medeltida bysantinsk och islamisk filosofi Formtilläggen 01 och 09 används inte i samband med klasserna 11-11.9 @sv

Renessanssin ja uuden ajan filosofia
type: Concept
References: Uusi aika
type: YKL-luokka
alternative label: Empirism, filosofi (11.3 ... 11.5) @sv
alternative label: Empirismi, filosofia (11.3 ... 11.5)
alternative label: Encyklopedister, filosofi (11.3) @sv
alternative label: Ensyklopedistit, filosofia (11.3)
alternative label: Filosofian historia, renessanssin aika (11.3)
alternative label: Filosofian historia, uusi aika (11.3)
alternative label: Filosofian historia, valistuksen aika (11.3)
alternative label: Filosofins historia, nya tiden (11.3) @sv
alternative label: Filosofins historia, renässanstiden (11.3) @sv
alternative label: Filosofins historia, upplysningstiden (11.3) @sv
alternative label: Rationalism, filosofi (11.3 ... 11.5) @sv
alternative label: Rationalismi, filosofia (11.3 ... 11.5)
alternative label: Renessanssi, filosofia (11.3)
alternative label: Renässans, filosofi (11.3) @sv
alternative label: Upplysningstiden, filosofi (11.3) @sv
alternative label: Valistuksen aika, filosofia (11.3)
broader: FILOSOFIA
in scheme: YKL - Yleisten kirjastojen luokitusjärjestelmä
notation: 11.3
preferred label: Renaissance and early modern philosophy @en
preferred label: Renässansen och nya tidens filosofi @sv
scope note: Upplysningstidens filosofi. Encyklopedisterna Rationalism och empirism till 1700-talets slut Cusanus, Hobbes, Descartes, Pascal, Voltaire, Diderot, Leibnitz, Locke, Berkeley, Hume, Kant och deras samtidas filosofi Formtilläggen 01 och 09 används inte i samband med klasserna 11-11.9 @sv
scope note: Valistuksen ajan filosofia. Ensyklopedistit Rationalismi ja empirismi 1700-luvun loppuun Cusanus, Hobbes, Descartes, Pascal, Voltaire, Diderot, Leibnitz, Locke, Berkeley, Hume, Kant ja heidän aikalaistensa filosofia Muotoluokkia 01 ja 09 ei käytetä luokkien 11-11.9 yhteydessä

Uusimman ajan filosofia
type: Concept
References: Uusin aika
type: YKL-luokka
alternative label: Empirism, filosofi (11.3 ... 11.5) @sv
alternative label: Empirismi, filosofia (11.3 ... 11.5)
alternative label: Filosofian historia, uusin aika (11.4)
alternative label: Filosofins historia, nyaste tiden (11.4) @sv
alternative label: Historicism, 1800-talets filosofi (11.4) @sv
alternative label: Historismi, 1800-luvun filosofia (11.4)
alternative label: Irrationalism, 1800-talets filosofi (11.4) @sv
alternative label: Irrationalismi, 1800-luvun filosofia (11.4)
alternative label: Marxism, 1800-talets filosofi (11.4) @sv
alternative label: Marxismi, 1800-luvun filosofia (11.4)
alternative label: Nykantianism (11.4) @sv
alternative label: Positivism, 1800-talets filosofi (11.4) @sv
alternative label: Positivismi, 1800-luvun filosofia (11.4)
alternative label: Pragmatism, 1800-talets filosofi (11.4) @sv
alternative label: Pragmatismi, 1800-luvun filosofia (11.4)
alternative label: Rationalism, filosofi (11.3 ... 11.5) @sv
alternative label: Rationalismi, filosofia (11.3 ... 11.5)
alternative label: Uuskantilaisuus (11.4)
broader: FILOSOFIA
in scheme: YKL - Yleisten kirjastojen luokitusjärjestelmä
notation: 11.4
preferred label: Modern philosophy @en
preferred label: Nyare tidens filosofi @sv
scope note: Idealism, positivism, marxism, pragmatism, nykantianism, irrationalism och historism från romantiken till 1800-talets slut Fichte, Schlegel, Schleiermacher, Schelling, Hegel, Feuerbach, Marx, Engels, Schopenhauer, Comte, Saint-Simon, Mill, Spencer, Kierkegaard, Nietzsche och deras samtidas filosofi Formtilläggen 01 och 09 används inte i samband med klasserna 11-11.9 @sv
scope note: Romantiikan ajan idealismi, positivismi, marxismi, pragmatismi, uuskantilaisuus, irrationalismi ja historismi 1800-luvun loppuun Fichte, Schlegel, Schleiermacher, Schelling, Hegel, Feuerbach, Marx, Engels, Schopenhauer, Comte, Saint-Simon, Mill, Spencer, Kierkegaard, Nietzsche ja heidän aikalaistensa filosofia Muotoluokkia 01 ja 09 ei käytetä luokkien 11-11.9 yhteydessä

Nykyajan filosofia
type: Concept
References: Nykyaika
type: YKL-luokka
alternative label: Analytisk filosofi (11.5) @sv
alternative label: Analyyttinen filosofia (11.5)
alternative label: Dialektinen materialismi, filosofia (11.5)
alternative label: Dialektisk materialism, filosofi (11.5) @sv
alternative label: Eksistentialismi, filosofia (11.5)
alternative label: Empirism, filosofi (11.3 ... 11.5) @sv
alternative label: Empirismi, filosofia (11.3 ... 11.5)
alternative label: Existentialism, filosofi (11.5) @sv
alternative label: Fenomenologi, filosofi (11.5) @sv
alternative label: Fenomenologia, filosofia (11.5)
alternative label: Filosofian historia, nykyaika (11.5)
alternative label: Filosofins historia, nutiden (11.5) @sv
alternative label: Frankfurtin koulukunta, filosofia (11.5)
alternative label: Frankfurtin kriittinen koulukunta, filosofia (11.5)
alternative label: Frankfurtskolan, filosofi (11.5) @sv
alternative label: Historiallinen materialismi, filosofia (11.5)
alternative label: Historicism, 1900-talets filosofi (11.5) @sv
alternative label: Historisk materialism, filosofi (11.5) @sv
alternative label: Historismi, 1900-luvun filosofia (11.5)
alternative label: Irrationalism, 1900-talets filosofi (11.5) @sv
alternative label: Irrationalismi, 1900-luvun filosofia (11.5)
alternative label: Logisk empirism, filosofi (11.5) @sv
alternative label: Logisk positivism, filosofi (11.5) @sv
alternative label: Looginen empirismi, filosofia (11.5)
alternative label: Looginen positivismi, filosofia (11.5)
alternative label: Marxism, 1900-talets filosofi (11.5) @sv
alternative label: Marxismi, 1900-luvun filosofia (11.5)
alternative label: Materialism, dialektisk, filosofi (11.5) @sv
alternative label: Materialismi, dialektinen, filosofia (11.5)
alternative label: Mentalism, filosofi (11.5) @sv
alternative label: Mentalismi, filosofia (11.5)
alternative label: Nyrealism, filosofi (11.5) @sv
alternative label: Positivism, 1900-talets filosofi (11.5) @sv
alternative label: Positivismi, 1900-luvun filosofia (11.5)
alternative label: Pragmatism, 1900-talets filosofi (11.5) @sv
alternative label: Pragmatismi, 1900-luvun filosofia (11.5)
alternative label: Rationalism, filosofi (11.3 ... 11.5) @sv
alternative label: Rationalismi, filosofia (11.3 ... 11.5)
alternative label: Uusrealismi, filosofia (11.5)
broader: FILOSOFIA
in scheme: YKL - Yleisten kirjastojen luokitusjärjestelmä
notation: 11.5
preferred label: Contemporary philosophy @en
preferred label: Nutida filosofi @sv
scope note: Logisk positivism, analytisk filosofi, fenomenologi, existentialism, historisk materialism och marxism fr.o.m. 1900 Croce, Brentano, Husserl, Heidegger, Carnap, Habermas, Wittgenstein, Russel, Moore, Popper, Sartre, Ketonen, von Wright och deras samtidas filosofi Formtilläggen 01 och 09 används inte i samband med klasserna 11-11.9 @sv
scope note: Looginen positivismi, analyyttinen filosofia, fenomenologia, eksistentialismi, historiallinen materialismi ja marxismi vuodesta 1900 Croce, Brentano, Husserl, Heidegger, Carnap, Habermas, Wittgenstein, Russell, Moore, Popper, Sartre, Ketonen, von Wright ja heidän aikalaistensa filosofia Muotoluokkia 01 ja 09 ei käytetä luokkien 11-11.9 yhteydessä

Itämainen filosofia
type: Concept
References: Itämaiset uskonnot ja mytologiat
References: Rentoutus. Uni. Unettomuus
References: Itämaisperäiset lajit ja kamppailulajit
type: YKL-luokka
alternative label: Filosofian historia, itämainen (11.9)
alternative label: Filosofins historia, österländsk filosofi (11.9) @sv
alternative label: Indien, filosofi (11.9) @sv
alternative label: Intia, filosofia (11.9)
alternative label: Itämainen filosofia (11.9)
alternative label: Österländsk filosofi (11.9) @sv
broader: FILOSOFIA
in scheme: YKL - Yleisten kirjastojen luokitusjärjestelmä
notation: 11.9
preferred label: Eastern philosophy @en
preferred label: Österländsk filosofi @sv
scope note: Hit oavsett tidsperiod traditionell österländsk filosofi i Indien, Kina och Japan Formtilläggen 01 och 09 används inte i samband med klasserna 11-11.9 @sv
scope note: Tähän aikakaudesta riippumatta Intian, Kiinan ja Japanin perinteinen itämainen filosofia Muotoluokkia 01 ja 09 ei käytetä luokkien 11-11.9 yhteydessä

LOGIIKKA
type: Concept
References: Tietoteoria
References: MATEMATIIKKA
References: TIETOTEKNIIKKA. TIETOLIIKENNE. VIESTINTÄTEKNIIKKA. TEKOÄLY
References: Kielifilosofia
type: YKL-luokka
alternative label: Aksiomaattinen menetelmä, logiikka (12)
alternative label: Alkeislogiikka (12)
alternative label: Antinomiat, logiikka (12)
alternative label: Antinomier, logik (12) @sv
alternative label: Arvostelmat, logiikka (12)
alternative label: Axiomatisk metod, logik (12) @sv
alternative label: Begrepp, logik (12) @sv
alternative label: Deduktio, logiikka (12)
alternative label: Deduktion, logik (12) @sv
alternative label: Dialektiikka, logiikka (12)
alternative label: Dialektik, logik (12) @sv
alternative label: Elementär logik (12) @sv
alternative label: Formell logik (12) @sv
alternative label: Funktiokalkyyli, logiikka (12)
alternative label: Funktionskalkyl, logik (12) @sv
alternative label: Induktio, logiikka (12)
alternative label: Induktion, logik (12) @sv
alternative label: Järjestyslogiikka (12)
alternative label: Kategoriat, logiikka (12)
alternative label: Kategorier, logik (12) @sv
alternative label: Kielellinen logiikka (12)
alternative label: Kielet, logiikka (12)
alternative label: Klasskalkyl, logik (12) @sv
alternative label: Käsite, logiikka (12)
alternative label: Lauselogiikka (12)
alternative label: Logiikka, yl. (12)
alternative label: Logik, allm. (12) @sv
alternative label: Logisk kalkyl (12) @sv
alternative label: Logisk semantik (12) @sv
alternative label: Logisk syntax (12) @sv
alternative label: Logistiikka, filosofia, yl. (12)
alternative label: Logistik, filosofi, allm.(12) @sv
alternative label: Looginen kalkyyli (12)
alternative label: Looginen semantiikka (12)
alternative label: Looginen syntaksi (12)
alternative label: Luokkakalkyyli, logiikka (12)
alternative label: Matemaattinen logiikka (12)
alternative label: Matematisk logik (12) @sv
alternative label: Muodollinen logiikka (12)
alternative label: Ordningslogik (12) @sv
alternative label: Oskarp logik (12) @sv
alternative label: Paradoksit, logiikka (12)
alternative label: Paradoxer, logik (12) @sv
alternative label: Paralogismer, logik (12) @sv
alternative label: Predikaattikalkyyli, logiikka (12)
alternative label: Predikatkalkyl, logik (12) @sv
alternative label: Päätelmät, logiikka (12)
alternative label: Reaalilogiikka (12)
alternative label: Reallogik (12) @sv
alternative label: Sannolikhetslogik (12) @sv
alternative label: Satslogik (12) @sv
alternative label: Slutsatser, logik (12) @sv
alternative label: Språk, logik (12) @sv
alternative label: Språklig logik (12) @sv
alternative label: Sumea logiikka, yl. (12)
alternative label: Syllogistiikka (12)
alternative label: Syllogistik (12) @sv
alternative label: Symbolinen logiikka (12)
alternative label: Symbolisk logik (12) @sv
alternative label: Syntaksi, logiikka (12)
alternative label: Syntax, logik (12) @sv
alternative label: Todennäköisyyslogiikka (12)
alternative label: Typhierarkier, logik (12) @sv
alternative label: Tyyppihierarkiat, logiikka (12)
alternative label: Utsagor, logik (12) @sv
alternative label: Virhepäätelmät, logiikka (12)
broader: FILOSOFIA. PSYKOLOGIA. RAJATIETO. TIEDEOPPI
in scheme: YKL - Yleisten kirjastojen luokitusjärjestelmä
notation: 12
preferred label: LOGIC @en
preferred label: LOGIK @sv
scope note: Hit allmänna verk om logik Logikens grunder. Formell, symbolisk och matematisk logik Oskarp logik Deduktion, induktion och dialektik Logistik. Logisk kalkyl Predikat- och klasslogik Reallogik. Funktionskalkyl Ordningslogik. Typhierarki Logisk syntax och semantik Tillämpningar av logik och logistik på olika områden klassificeras enligt område Formtillägget 01 används inte i samband med klassen 12 @sv
scope note: Tähän logiikan yleisteokset Alkeislogiikka. Muodollinen, symbolinen ja matemaattinen logiikka Sumea logiikka Deduktion, induktion ja dialektiikan logiikka Logistiikka. Looginen kalkyyli Predikaatti- ja luokkakalkyyli Reaalilogiikka. Funktiokalkyyli Järjestyslogiikka. Tyyppihierarkia Looginen syntaksi ja semantiikka Logiikan ja logistiikan sovellukset eri aloille luokitetaan alan mukaan Muotoluokkaa 01 ei käytetä luokan 12 yhteydessä

PSYKOLOGIA
type: Concept
References: Parapsykologia
References: Elämänfilosofia. Elämäntaito
References: YLEINEN USKONTOTIEDE
References: Sosiaalipsykologia
References: Asuinalueiden suunnittelu
References: Työ. Työelämä
References: KASVATUS. OPETUS. KASVATUSTIEDE
References: Koululaitos
References: Ammatinvalinta
References: MAANPUOLUSTUS
References: Biologinen antropologia
References: Eläinten elintavat
References: Hoitotiede. Hoitotyö. Hoitohenkilökunta
References: Hermosto. Neurologia
References: Psykiatria
References: Mielenterveys. Tunne-elämän häiriöt
References: Mainonta
References: Taidepsykologia. Taidesosiologia. Taidepolitiikka
References: Liikunta. Urheilu
References: Voimistelu
References: Palloilu
References: Retkeily. Ulkoilu
References: Lentourheilu. Moottoriurheilu
References: Kuntoliikunta. Kuntourheilu
References: Muut urheilu- ja liikuntamuodot
type: YKL-luokka
alternative label: Behaviorism (14+) @sv
alternative label: Behaviorismi (14+)
alternative label: Beslutsfattning, psykologi (14+) @sv
alternative label: Beteende, psykologi (14+) @sv
alternative label: Beteendepsykologi (14+) @sv
alternative label: Differentiaalipsykologia (14+)
alternative label: Differentialpsykologi (14+) @sv
alternative label: Käyttäytyminen, psykologia (14+)
alternative label: Käyttäytymisen psykologia (14+)
alternative label: Psykologi (14+) @sv
alternative label: Psykologia (14+)
alternative label: Psykologiset koulukunnat (14+)
alternative label: Psykologiska skolor (14+) @sv
alternative label: Psykotekniikka, yl. (14)
alternative label: Psykoteknik, allm. (14) @sv
alternative label: Päätöksenteko, psykologia (14+)
alternative label: Sielunelämä, psykologia (14+)
alternative label: Sielutiede, psykologia (14+)
alternative label: Själsliv, psykologi (14+) @sv
alternative label: Soveltava psykologia, yl. (14)
alternative label: Tillämpad psykologi, allm. (14) @sv
alternative label: Transsexualism, psykologi (14+) @sv
alternative label: Transsukupuolisuus, psykologia (14+)
broader: FILOSOFIA. PSYKOLOGIA. RAJATIETO. TIEDEOPPI
in scheme: YKL - Yleisten kirjastojen luokitusjärjestelmä
narrower: Psykologian teoria, filosofia ja tutkimusmenetelmät
narrower: Psyyken rakenne ja toiminnot
narrower: Persoonallisuuden psykologia
narrower: Kehityspsykologia
narrower: Ihmissuhteiden psykologia
notation: 14
preferred label: PSYCHOLOGY @en
preferred label: PSYKOLOGI @sv
scope note: Hit allmänna verk om psykologi Hit också allmänna verk om differentialpsykologi, tillämpad psykologi och psykoteknik samt verk som handlar om psykologiska skolor i allmänhet Tillämpningar av psykologi på olika områden klassificeras enligt område Om verkt handlar om både psykologi och psykiatri, ges företräde åt klass 14+ Psykologins och de psykologiska skolornas historia i allmänhet 14.09 @sv
scope note: Tähän psykologian yleisteokset Tähän myös differentiaalipsykologian, soveltavan psykologian ja psykotekniikan yleisteokset sekä teokset, jotka koskevat psykologian koulukuntia yleensä Psykologian sovellukset eri aloille luokitetaan alan mukaan Jos teos koskee sekä psykologiaa että psykiatriaa, annetaan etusija luokalle 14+ Psykologian ja psykologisten koulukuntien yleinen historia 14.09

Psykologian teoria, filosofia ja tutkimusmenetelmät
type: Concept
References: URN:NBN:fi:au:ykl:14.1201
References: URN:NBN:fi:au:ykl:14.1301
References: URN:NBN:fi:au:ykl:14.401
References: URN:NBN:fi:au:ykl:38.5201
type: YKL-luokka
alternative label: Experimentell psykologi (14.01) @sv
alternative label: Kokeellinen psykologia (14.01)
alternative label: Lämplighetstest, psykologi (14.01) @sv
alternative label: Psykologiset testit (14.01)
alternative label: Psykologiska test (14.01) @sv
alternative label: Psykometriikka (14.01)
alternative label: Psykometrik (14.01) @sv
alternative label: Soveltuvuuskokeet, psykologia (14.01)
alternative label: Test, psykologi (14.01) @sv
alternative label: Testit, psykologia (14.01)
broader: PSYKOLOGIA
in scheme: YKL - Yleisten kirjastojen luokitusjärjestelmä
notation: 14.01
preferred label: Psykologisk teori och filosofi. Psykologiska forskningsmetoder @sv
preferred label: Theory, philosophy and research methods of psychology @en
scope note: Experimentell psykologi i allmänhet Psykometri och psykologiska test i allmänhet Teori, filosofi, forskningsmetoder, experiment, test och mätmetoder inom psykologins specialområden klassificeras enligt område @sv
scope note: Kokeellinen psykologia yleensä Psykometriikka ja psykologiset testit yleensä Psykologian erikoisalojen teoria, filosofia, tutkimusmenetelmät, kokeet, testit ja mittausmenetelmät luokitetaan alan mukaan

Psyyken rakenne ja toiminnot
type: Concept
References: Persoonallisuuden psykologia
References: Kehityspsykologia
References: Ihmissuhteiden psykologia
References: Hermosto. Neurologia
type: YKL-luokka
alternative label: Aivot, psykologia (14.1+)
alternative label: Biofeedback, psykologi (14.1+) @sv
alternative label: Biofeedback, psykologia (14.1+)
alternative label: Biopsykologi (14.1+) @sv
alternative label: Biopsykologia (14.1+)
alternative label: Evolutionspsykologi (14.1+) @sv
alternative label: Evoluutiopsykologia (14.1+)
alternative label: Fysiologinen psykologia (14.1+)
alternative label: Fysiologisk psykologi (14.1+) @sv
alternative label: Hermosto, psykologia (14.1+)
alternative label: Hjärnan, psykologi (14.1+) @sv
alternative label: Inre sekretion, fysiologisk psykologi (14.1+) @sv
alternative label: Kaksostutkimukset, perinnöllisyyspsykologia (14.1+)
alternative label: Kognitiivinen psykologia (14.1+)
alternative label: Kognitio, psykologia (14.1+)
alternative label: Kognition, psykologi (14.1+) @sv
alternative label: Kognitionsvetenskap, psykologi (14.1+) @sv
alternative label: Kognitiotiede, psykologia (14.1+)
alternative label: Kognitiv psykologi (14.1+) @sv
alternative label: Medvetande, psykologi (14.1+) @sv
alternative label: Medvetandefilosofi, psykets uppbyggnad (14.1) @sv
alternative label: Medvetenhet (14.1) @sv
alternative label: Medvetenhet, psykologi (14.1+) @sv
alternative label: Mentalism, psykologi (14.1+) @sv
alternative label: Mentalismi, psykologia (14.1+)
alternative label: Mielenfilosofia, psyyken rakenne (14.1)
alternative label: Nervsystemet, psykologi (14.1+) @sv
alternative label: Neurofysiologi, psykologi (14.1+) @sv
alternative label: Neurofysiologia, psykologia (14.1+)
alternative label: Neuroplasticitet, psykologi (14.1) @sv
alternative label: Neuroplastisuus, psykologia (14.1)
alternative label: Neuropsykologi (14.1+) @sv
alternative label: Neuropsykologia (14.1+)
alternative label: Perinnöllisyyspsykologia (14.1+)
alternative label: Psyke, struktur och funktion (14.1+) @sv
alternative label: Psyyke, rakenne ja toiminta (14.1+)
alternative label: Sisäeritys, fysiologinen psykologia (14.1+)
alternative label: Tajunta, psykologia (14.1+)
alternative label: Tietoisuus (14.1)
alternative label: Tietoisuus, psykologia (14.1+)
alternative label: Tvillingforskningar, ärftlighetspsykologi (14.1+) @sv
alternative label: Vasenkätisyys, psykologia (14.1+)
alternative label: Vänsterhänthet, psykologi (14.1+) @sv
alternative label: Ärftlighetspsykologi (14.1+) @sv
broader: PSYKOLOGIA
in scheme: YKL - Yleisten kirjastojen luokitusjärjestelmä
narrower: Havaintopsykologia
narrower: Oppimisen psykologia
narrower: Ajattelun, älykkyyden, luovuuden ja lahjakkuuden psykologia
narrower: Kieli-, kommunikaatio- ja ilmaisupsykologia
narrower: Tunne- ja tahtotoiminnot
notation: 14.1
preferred label: Psykets struktur och funktion @sv
preferred label: Structure and functions of the psyche @en
scope note: Hit allmänna verk om psykets struktur och funktion Hit och till undergrupperna också verk om fysiologisk psykologi, psykets biologiska bas, ärftlighetspsykologi och kognitiv psykologi @sv
scope note: Tähän psyyken rakennetta ja toimintoja koskevat yleisteokset Tähän ja alaluokkiin myös fysiologista psykologiaa, psyyken biologista perustaa, perinnöllisyyspsykologiaa ja kognitiivista psykologiaa koskevat teokset

Havaintopsykologia
type: Concept
References: Aistinelimet. Silmätaudit. Kurkku-, nenä- ja korvataudit
type: YKL-luokka
alternative label: Aika, psykologia (14.11)
alternative label: Aistimukset, havaintopsykologia (14.11)
alternative label: Aistit, havaintopsykologia (14.11)
alternative label: Apperception (14.11) @sv
alternative label: Apperseptio (14.11)
alternative label: Doft, psykologi (14.11) @sv
alternative label: Eideettiset ilmiöt (14.11)
alternative label: Eidetiska fenomen (14.11) @sv
alternative label: Gestaltpsykologi (14.11) @sv
alternative label: Hahmopsykologia (14.11)
alternative label: Hajuaisti, psykologia (14.11)
alternative label: Hallucinationer, perceptionspsykologi (14.11) @sv
alternative label: Hallusinaatiot, havaintopsykologia (14.11)
alternative label: Harha-aistimukset, havaintopsykologia (14.11)
alternative label: Havaintopsykologia (14.11)
alternative label: Hörselsinne, psykologi (14.11) @sv
alternative label: Illusioner, perceptionspsykologi (14.11) @sv
alternative label: Illuusiot, havaintopsykologia (14.11)
alternative label: Kipu, fysiologinen psykologia (14.11)
alternative label: Kuuloaisti, psykologia (14.11)
alternative label: Luktsinne, psykologi (14.11) @sv
alternative label: Näköaisti, psykologia (14.11)
alternative label: Optiset harhat (14.11)
alternative label: Optiska villor (14.11) @sv
alternative label: Perceptionspsykologi (14.11) @sv
alternative label: Primaarihavaitseminen (14.11)
alternative label: Primär varseblivning (14.11) @sv
alternative label: Sinnen, perceptionspsykologi (14.11) @sv
alternative label: Sinnesförnimmelser, perceptionspsykologi (14.11) @sv
alternative label: Smärta, fysiologisk psykologi (14.11) @sv
alternative label: Synestesi, psykologi (14.11) @sv
alternative label: Synestesia, psykologia (14.11)
alternative label: Synsinne, psykologi (14.11) @sv
alternative label: Tid, psykologi (14.11) @sv
alternative label: Tuoksu, psykologia (14.11)
broader: Psyyken rakenne ja toiminnot
in scheme: YKL - Yleisten kirjastojen luokitusjärjestelmä
notation: 14.11
preferred label: Perceptionspsykologi @sv
preferred label: Psychology of perception @en
scope note: Havainnot ja aistimukset psykologian kannalta Primaarihavaitseminen. Havaitsemaan oppiminen Havaintojen jäsentäminen ja tiedostaminen Havaintokynnys. Havaintovirheet ja -harhat Illuusiot. Hallusinaatiot. Eideettiset ilmiöt Ympäristön, kokemusten ja oppimisen vaikutukset havaintoihin Tähän myös hahmopsykologia
scope note: Varseblivning och sinnesförnimmelser ur psykologins synvinkel Primär varseblivning. Perceptionsinlärning Perceptionsgestaltning och medvetenhet om perceptioner Perceptionströskel. Perceptionsfel Illusioner. Hallucinationer. Eidetiska fenomen Miljöns, erfarenhetens och inlärningens inverkan på varseblivningen Hit också gestaltpsykologi @sv

Oppimisen psykologia
type: Concept
References: Havaintopsykologia
References: Kehityspsykologia
References: Eri alojen opetusoppi
References: Opiskelutekniikka
References: Erityisopetus. Erityiskasvatus, luku-, kirjoitus- ja puhehäiriöiset
References: Erityisopetus. Erityiskasvatus, kehitysvammaiset
type: YKL-luokka
alternative label: Associationspsykologi (14.12) @sv
alternative label: Assosiaatiopsykologia (14.12)
alternative label: Betingade reflexer, psykologi (14.12) @sv
alternative label: Betingning, psykologi (14.12) @sv
alternative label: E-lärande, inlärningspsykologi (14.12) @sv
alternative label: Ehdolliset refleksit, psykologia (14.12)
alternative label: Ehdollistaminen, psykologia (14.12)
alternative label: Glömmande, psykologi (14.12) @sv
alternative label: Informaatiolukutaito, oppimisen psykologia (14.12)
alternative label: Informationskompetens, inlärningspsykologi (14.12) @sv
alternative label: Inlärning, inlärningspsykologi (14.12) @sv
alternative label: Inlärningspsykologi (14.12) @sv
alternative label: Inlärningssvårigheter, inlärningspsykologi (14.12) @sv
alternative label: Inlärningstester och inlärningsuppgifter (14.1201) @sv
alternative label: Inlärningstester och minnestester (14.1201) @sv
alternative label: Inlärningsuppgifter och minnesuppgifter (14.1201) @sv
alternative label: Keskittymiskyky, oppimisen psykologia (14.12)
alternative label: Kielellinen kehitys (14.12)
alternative label: Kirjoittamaan oppiminen, psykologia (14.12)
alternative label: Koncentrationsförmåga, inlärningspsykologi (14.12) @sv
alternative label: Liikkumaan oppiminen, psykologia (14.12)
alternative label: Lukemaan oppiminen, psykologia (14.12)
alternative label: Lukutaito, lukemaan oppimisen psykologia (14.12)
alternative label: Läsfärdighet, läsandets inlärningspsykologi (14.12) @sv
alternative label: Läsinlärning, psykologi (14.12) @sv
alternative label: Medialukutaito, oppimisen psykologia (14.12)
alternative label: Medieläsfärdighet, inlärningspsykologi (14.12) @sv
alternative label: Medveten inlärning (14.12) @sv
alternative label: Minne, psykologi (14.12) @sv
alternative label: Minnesteknik, psykologi (14.12) @sv
alternative label: Minnestester och minnesuppgifter (14.1201) @sv
alternative label: Mnemotekniikka (14.12)
alternative label: Mnemoteknik (14.12) @sv
alternative label: Motorinen kehitys (14.12)
alternative label: Motorisk utveckling (14.12) @sv
alternative label: Muisti, psykologia (14.12)
alternative label: Muistitekniikka, psykologia (14.12)
alternative label: Muistitestit ja muistitehtävät (14.1201)
alternative label: Opiskelumotivaatio, psykologia (14.12)
alternative label: Oppiminen, oppimisen psykologia (14.12)
alternative label: Oppimisen psykologia (14.12)
alternative label: Oppimistehtävät ja muistitehtävät (14.1201)
alternative label: Oppimistestit ja muistitestit (14.1201)
alternative label: Oppimistestit ja oppimistehtävät (14.1201)
alternative label: Oppimisvaikeudet, oppimisen psykologia (14.12)
alternative label: Puhumaan oppiminen, psykologia (14.12)
alternative label: Rörelseinlärning, psykologi (14.12) @sv
alternative label: Skrivinlärning, psykologi (14.12) @sv
alternative label: Social inlärning (14.12) @sv
alternative label: Sosiaalinen oppiminen (14.12)
alternative label: Språkutveckling (14.12) @sv
alternative label: Studiemotivation, psykologi (14.12) @sv
alternative label: Talinlärning, psykologi (14.12) @sv
alternative label: Tiedostava oppiminen (14.12)
alternative label: Unohtaminen, psykologia (14.12)
alternative label: Verkko-oppiminen, oppimisen psykologia (14.12)
broader: Psyyken rakenne ja toiminnot
in scheme: YKL - Yleisten kirjastojen luokitusjärjestelmä
notation: 14.12
preferred label: Inlärningspsykologi @sv
preferred label: Psychology of learning @en
scope note: Inlärning och minne som psykologiska fenomen Betingning. Medveten, associativ och social inlärning Uppmärksamhet och koncentrationsförmåga ur inlärningssynvinkel Minnesteknik Hur belöning och straff inverkar på inlärningen Språkutveckling. Motorisk utveckling Talandets, läsandets och skrivandets inlärningspsykologi Rörelseinlärningens psykologi Inlärnings- och minnestest och -uppgifter 14.1201 @sv
scope note: Oppiminen ja muisti psykologisina ilmiöinä Ehdollistaminen. Tiedostava, assosiatiivinen ja sosiaalinen oppiminen Tarkkaavaisuus ja keskittymiskyky oppimisen kannalta Muistitekniikka Palkkion ja rangaistuksen vaikutus oppimiseen Kielellinen kehitys. Motorinen kehitys Puhumaan, lukemaan ja kirjoittamaan oppimisen psykologia Liikkumaan oppimisen psykologia Oppimis- ja muistitestit ja -tehtävät 14.1201

Ajattelun, älykkyyden, luovuuden ja lahjakkuuden psykologia
type: Concept
References: Oppimisen psykologia
References: Kieli-, kommunikaatio- ja ilmaisupsykologia
References: Persoonallisuuden psykologia
References: URN:NBN:fi:au:ykl:38.5201
References: Erityislahjakkaiden opetus
References: Musiikin psykologia
type: YKL-luokka
alternative label: Ajattelun psykologia (14.13)
alternative label: Arvostelukyky, psykologia (14.13)
alternative label: Association, psykologi (14.13) @sv
alternative label: Begåvning, psykologi (14.13) @sv
alternative label: Emotionell intelligens (14.13) @sv
alternative label: Erikoislahjakkuudet, psykologia (14.13)
alternative label: Fantasi, psykologi (14.13) @sv
alternative label: Fyysinen älykkyys (14.13)
alternative label: Genialitet, psykologi (14.13) @sv
alternative label: Intelligens, psykologi (14.13) @sv
alternative label: Intuitio, psykologia (14.13)
alternative label: Intuition, psykologi (14.13) @sv
alternative label: Kinestetisk intelligens (14.13) @sv
alternative label: Kreativitet, psykologi (14.13) @sv
alternative label: Kroppslig intelligens (14.13) @sv
alternative label: Lahjakkuus, psykologia (14.13)
alternative label: Luovuus, psykologia (14.13)
alternative label: Mielikuvitus, psykologia (14.13)
alternative label: Mieltäminen, psykologia (14.13)
alternative label: NLP, psykologi (14.13) @sv
alternative label: NLP, psykologia (14.13)
alternative label: Nerous, psykologia (14.13)
alternative label: Neurolingvistinen ohjelmointi, psykologia (14.13)
alternative label: Neurolingvistisk programmering, psykologi (14.13) @sv
alternative label: Omdömesförmåga, psykologi (14.13) @sv
alternative label: Ongelmanratkaisu, psykologia (14.13)
alternative label: Problemlösning, psykologi (14.13) @sv
alternative label: Päättelytehtävät, psykologia (14.13)
alternative label: Slutledningsuppgifter, psykologi (14.13) @sv
alternative label: Specialbegåvningar, psykologi (14.13) @sv
alternative label: Tunneäly (14.13)
alternative label: Tänkandets psykologi (14.13) @sv
alternative label: Älykkyys, psykologia (14.13)
broader: Psyyken rakenne ja toiminnot
in scheme: YKL - Yleisten kirjastojen luokitusjärjestelmä
notation: 14.13
preferred label: Psychology of intelligence, creativity and talent @en
preferred label: Tänkande, intelligens, kreativitet och begåvning ur psykologisk @sv
scope note: Ajattelu, älykkyys, intuitio, mieltäminen, arvostelukyky ja mielikuvitus sekä lahjakkuuden eri lajit, erikoislahjakkuudet, nerokkuus, luovuus ja luova toiminta psykologian kannalta Älykkyys- ja lahjakkuustestit ja -tehtävät 14.1301
scope note: Tänkande, intelligens, kreativitet och begåvning ur psykologisk synvinkel Tänkande, intelligens, intuition, uppfattningsförmåga, omdömesförmåga och fantasi samt olika former av begåvning, specialbegåvningar, genialitet, kreativitet och skapande verksamhet ur psykologisk synvinkel Intelligens- och begåvningstest och -uppgifter 14.1301 @sv

Kieli-, kommunikaatio- ja ilmaisupsykologia
type: Concept
References: Oppimisen psykologia
References: Ajattelun, älykkyyden, luovuuden ja lahjakkuuden psykologia
References: Persoonallisuuden psykologia
References: Ihmissuhteiden psykologia
References: Biologinen antropologia
References: Ilmaisutaito. Puhetaito. Lausuntataide
References: KIELITIEDE
type: YKL-luokka
alternative label: Asennot, psykologia (14.14)
alternative label: Eleet, psykologia (14.14)
alternative label: Fysiognomi (14.14) @sv
alternative label: Fysiognomia (14.14)
alternative label: Fysionomi (14.14) @sv
alternative label: Fysionomia (14.14)
alternative label: Fysionomiikka (14.14)
alternative label: Fysionomik (14.14) @sv
alternative label: Gester, psykologi (14.14) @sv
alternative label: Ilmaisupsykologia (14.14)
alternative label: Ilmeet, psykologia (14.14)
alternative label: Kielipsykologia (14.14)
alternative label: Kommunikaatiopsykologia (14.14)
alternative label: Kommunikationspsykologi (14.14) @sv
alternative label: Mimiikka, psykologia (14.14)
alternative label: Mimik, psykologi (14.14) @sv
alternative label: Miner, psykologi (14.14) @sv
alternative label: Nauru, ilmaisupsykologia (14.14)
alternative label: Pantomimiikka, psykologia (14.14)
alternative label: Pantomimik, psykologi (14.14) @sv
alternative label: Psykolingvistiikka (14.14)
alternative label: Psykolingvistik (14.14) @sv
alternative label: Röster, psykologi (14.14) @sv
alternative label: Skratt, uttryckspsykologi (14.14) @sv
alternative label: Språkpsykologi (14.14) @sv
alternative label: Ställningar, psykologi (14.14) @sv
alternative label: Tonfall, psykologi (14.14) @sv
alternative label: Uttryckspsykologi (14.14) @sv
alternative label: Äänenpainot, psykologia (14.14)
alternative label: Äänet, psykologia (14.14)
broader: Psyyken rakenne ja toiminnot
in scheme: YKL - Yleisten kirjastojen luokitusjärjestelmä
narrower: Käsialantutkimus
notation: 14.14
preferred label: Psychology of language, communication and expression @en
preferred label: Språk-, kommunikations- och uttryckspsykologi @sv
scope note: Psykolingvistiikka Verbaalinen ja ei-verbaalinen kommunikaatio psykologian kannalta Eleet, ilmeet, asennot, äänet, äänenpainot, mimiikka, pantomimiikka ja fysiognomia psykologian kannalta
scope note: Psykolingvistik Verbal och icke-verbal kommunikation ur psykologisk synvinkel Gester, uttryck, kroppsspråk, röst, tonfall, mimik, pantomimik och fysionomik ur psykologisk synvinkel @sv

Käsialantutkimus
type: Concept
References: Kirjoitus
References: Persoonallisuuden psykologia
type: YKL-luokka
alternative label: Grafologi (14.141) @sv
alternative label: Grafologi, psykologi (14.141) @sv
alternative label: Grafologia (14.141)
alternative label: Käsialantutkimus, psykologia (14.141)
alternative label: Namnteckningar, grafologi (14.141) @sv
alternative label: Nimikirjoitukset, käsialantutkimus (14.141)
broader: Kieli-, kommunikaatio- ja ilmaisupsykologia
in scheme: YKL - Yleisten kirjastojen luokitusjärjestelmä
notation: 14.141
preferred label: Grafologi @sv
preferred label: Graphology @en
scope note: Grafologi. Psykologisk undersökning av handstilar @sv
scope note: Grafologia. Käsialojen psykologinen tutkimus

Tunne- ja tahtotoiminnot
type: Concept
References: Persoonallisuuden psykologia
References: Ihmissuhteiden psykologia
References: Biologinen antropologia
References: Mielenterveys. Tunne-elämän häiriöt
type: YKL-luokka
alternative label: Affekter, psykologi (14.16) @sv
alternative label: Affektit, psykologia (14.16)
alternative label: Aggressio, psykologia (14.16)
alternative label: Aggression, psykologi (14.16) @sv
alternative label: Aktivitet, psykologi (14.16) @sv
alternative label: Drifter, psykologi (14.16) @sv
alternative label: Emootiot, psykologia (14.16)
alternative label: Emotioner, psykologi (14.16) @sv
alternative label: Frustraatiot, psykologia (14.16)
alternative label: Frustrationer, psykologi (14.16) @sv
alternative label: Glädje, psykologi (14.16) @sv
alternative label: Ilo, psykologia (14.16)
alternative label: Instinkter, psykologi (14.16) @sv
alternative label: Intentioner, psykologi (14.16) @sv
alternative label: Intentiot, psykologia (14.16)
alternative label: Känslofunktioner, psykologi (14.16) @sv
alternative label: Känslor, psykets struktur (14.16) @sv
alternative label: Mielihyvä, psykologia (14.16)
alternative label: Motivaatiopsykologia (14.16)
alternative label: Motivationspsykologi (14.16) @sv
alternative label: Pelko, psykologia (14.16)
alternative label: Pelot, psykologia (14.16)
alternative label: Psykodynamiikka (14.16)
alternative label: Psykodynamik (14.16) @sv
alternative label: Psykomotoriikka (14.16)
alternative label: Psykomotorik (14.16) @sv
alternative label: Rädsla, psykologi (14.16) @sv
alternative label: Rädslor, psykologi (14.16) @sv
alternative label: Sorg, psykologi (14.16) @sv
alternative label: Suru, psykologia (14.16)
alternative label: Tahtotoiminnot, psykologia (14.16)
alternative label: Toiminta, psykologia (14.16)
alternative label: Tunnetoiminnot, psykologia (14.16)
alternative label: Tunteet, psyyken rakenne (14.16)
alternative label: Vaistot, psykologia (14.16)
alternative label: Vietit, psykologia (14.16)
alternative label: Viljefunktioner, psykologi (14.16) @sv
alternative label: Välbehag, psykologi (14.16) @sv
broader: Psyyken rakenne ja toiminnot
in scheme: YKL - Yleisten kirjastojen luokitusjärjestelmä
notation: 14.16
preferred label: Emotional and voluntary functions @en
preferred label: Känsla och vilja @sv
scope note: Hit de själsliga grundfunktionernas psykologi och utforskningen av dem Emotioner. Affekter. Intentioner. Verksamhet. Drifter. Instinkter Motivation. Frustrationer. Aggressioner @sv
scope note: Tähän henkisten perustoimintojen psykologia ja tutkimus Emootiot. Affektit. Intentiot. Toiminta. Vietit. Vaistot Motivaatio. Frustraatio. Aggressio

Persoonallisuuden psykologia
type: Concept
References: Ajattelun, älykkyyden, luovuuden ja lahjakkuuden psykologia
References: Kieli-, kommunikaatio- ja ilmaisupsykologia
References: Tunne- ja tahtotoiminnot
References: Kehityspsykologia
References: Lapsuuden ja nuoruuden psykologia
References: Ihmissuhteiden psykologia
References: Elämänfilosofia. Elämäntaito
References: Seksologia
References: Mielenterveys. Tunne-elämän häiriöt
alternative label: Abnormipsykologia (14.4+)
alternative label: Abnormpsykologi (14.4+) @sv
alternative label: Basal kroppskännedom, psykologi (14.4+) @sv
alternative label: Brottslighet, psykologi (14.4+) @sv
alternative label: Egenmakt, psykologi (14.4) @sv
alternative label: Enneagram (14.4) @sv
alternative label: Enneagrammit (14.4)
alternative label: Erotiikka, seksuaalipsykologia (14.4+)
alternative label: Erotik, sexualpsykologi (14.4+) @sv
alternative label: Frigiditeetti, seksuaalipsykologia (14.4+)
alternative label: Frigiditet, sexualpsykologi (14.4+) @sv
alternative label: Godhet, psykologi (14.4)
alternative label: Homoseksuaalisuus, seksuaalipsykologia (14.4+)
alternative label: Homosexualitet, sexualpsykologi (14.4+) @sv
alternative label: Hyvyys, psykologia (14.4)
alternative label: Identiteetti, psykologia (14.4)
alternative label: Identitet, psykologi (14.4) @sv
alternative label: Impotens, sexualpsykologi (14.4+) @sv
alternative label: Impotenssi, seksuaalipsykologia (14.4+)
alternative label: Individualpsykologi (14.4+) @sv
alternative label: Itsetuntemus, psykologia (14.4)
alternative label: Itsetunto, psykologia (14.4+)
alternative label: Jagföreställning, psykologi (14.4+) @sv
alternative label: Karakterologi (14.4) @sv
alternative label: Karakterologia (14.4)
alternative label: Karisma, personlighetspsykologi (14.4) @sv
alternative label: Karisma, persoonallisuuden psykologia (14.4)
alternative label: Karismaattisuus, persoonallisuuden psykologia (14.4)
alternative label: Kehonhallinta, psykologia (14.4+)
alternative label: Kehontuntemus, psykologia (14.4+)
alternative label: Kriminaalipsykologia (14.4+)
alternative label: Kriminalpsykologi (14.4+) @sv
alternative label: Kroppskontroll, psykologi (14.4+) @sv
alternative label: Kroppsuppfattning, psykologi (14.4+) @sv
alternative label: Könens psykologi (14.4+) @sv
alternative label: Könsidentitet, sexualpsykologi (14.4+) @sv
alternative label: Lesbous, seksuaalipsykologia (14.4+)
alternative label: Luonnetyypit (14.4)
alternative label: Minäkuva, psykologia (14.4+)
alternative label: Narsismi, persoonallisuuden psykologia (14.4+)
alternative label: Ondska, psykologi (14.4)
alternative label: Pahuus, psykologia (14.4)
alternative label: Perfektionismi, persoonallisuuspsykologia (14.4+)
alternative label: Persoonallisuuden psykologia (14.4+)
alternative label: Persoonallisuustestit (14.4+)
alternative label: Persoonallisuustyypit (14.4)
alternative label: Poikkeavuuden psykologia (14.4+)
alternative label: Rikollisuus, psykologia (14.4+)
alternative label: Ruumiinkuva, psykologia (14.4+)
alternative label: Seksuaalinen identiteetti, seksuaalipsykologia (14.4+)
alternative label: Seksuaalipsykologia (14.4+)
alternative label: Seksuaalivähemmistöt, seksuaalipsykologia (14.4+)
alternative label: Sukupuoli-identiteetti, seksuaalipsykologia (14.4+)
alternative label: Sukupuolielämä, seksuaalipsykologia (14.4+)
alternative label: Sukupuoliset vähemmistöt, seksuaalipsykologia (14.4+)
alternative label: Sukupuolivähemmistöt, seksuaalipsykologia (14.4+)
alternative label: Sukupuolten psykologia (14.4+)
alternative label: Temperamenttityypit (14.4)
alternative label: Traumateoriat, persoonallisuuspsykologia (14.4)
alternative label: Typologia, psykologia (14.4)
alternative label: Tyyppipsykologia (14.4)
alternative label: Voimaantuminen, psykologia (14.4)
alternative label: Väkivalta, poikkeavuuden psykologia (14.4+)
alternative label: Yksilöpsykologia (14.4+)
broader: PSYKOLOGIA
in scheme: YKL - Yleisten kirjastojen luokitusjärjestelmä
narrower: Syvyyspsykologia. Tiedostamaton sielunelämä
notation: 14.4
scope note: Personlighetsteorier. Individualpsykologi. Typlära. Karakterologi. Personlighetstyper. Karaktärstyper. Temperamentstyper. Personlighetens struktur. Jagföreställning. Kroppsuppfattning. Självkänsla. Hur arv och miljö påverkar personligheten. Sexualpsykologi. Könspsykologi. Hit också abnormpsykologi. Personlighets- och karaktärstest 14.401 @sv
scope note: Persoonallisuusteoriat. Yksilöpsykologia. Tyyppipsykologia. Karakterologia. Persoonallisuus-, luonne- ja temperamenttityypit. Persoonallisuuden rakenne. Minäkuva. Ruumiinkuva. Itsetunto. Ympäristön ja perintötekijöiden vaikutus persoonallisuuteen. Seksuaalipsykologia. Sukupuolten psykologia. Tähän myös poikkeavuuden psykologia. Persoonallisuus- ja luonnetestit 14.401

Syvyyspsykologia. Tiedostamaton sielunelämä
type: Concept
References: Tunne- ja tahtotoiminnot
References: Parapsykologia
References: Okkultismi. Spiritismi. Spiritualismi. Henkimaailma
References: Psykoanalyysi
type: YKL-luokka
alternative label: Alitajunta, syvyyspsykologia (14.45+)
alternative label: Bipersoner, multipel personlighet, djuppsykologi (14.45+) @sv
alternative label: Djuppsykologi (14.45+) @sv
alternative label: Ekstaasi, syvyyspsykologia (14.45)
alternative label: Extas, djuppsykologi (14.45) @sv
alternative label: Freudianism, djuppsykologi (14.45+) @sv
alternative label: Freudilaisuus, syvyyspsykologia (14.45+)
alternative label: Hurmostila, syvyyspsykologia (14.45)
alternative label: Jungianism, djuppsykologi (14.45+) @sv
alternative label: Jungilaisuus, syvyyspsykologia (14.45+)
alternative label: Omedvetna själslivet, djuppsykologi (14.45+) @sv
alternative label: Piilotajunta, syvyyspsykologia (14.45+)
alternative label: Psykoanalys, djuppsykologi (14.45+) @sv
alternative label: Psykoanalyysi, syvyyspsykologia (14.45+)
alternative label: Sivupersoonat, syvyyspsykologia (14.45+)
alternative label: Symboler, djuppsykologi (14.45+) @sv
alternative label: Symbolit, syvyyspsykologia (14.45+)
alternative label: Syvyyspsykologia (14.45+)
alternative label: Tiedostamaton sielunelämä,syvyyspsykologia (14.45+)
alternative label: Undermedvetna, djuppsykologi (14.45+) @sv
broader: Persoonallisuuden psykologia
in scheme: YKL - Yleisten kirjastojen luokitusjärjestelmä
narrower: Uni
narrower: Hypnoosi
notation: 14.45
preferred label: Depth psychology The unconscious mind @en
preferred label: Djuppsykologi. Det omedvetna själslivet @sv
scope note: Omedvetna själstillstånd. Det undermedvetna Alter ego, extas och trans som psykologiska fenomen Hit och till underklasserna också psykoanalytisk undersökning av det omedvetna själslivet Om verket behandlar psykoanalys både ur psykologisk och psykiatrisk synvinkel, ges företräde åt klass 14.45+ @sv
scope note: Tiedostamattomat sieluntilat. Alitajunta Sivupersoonat, ekstaasi, transsi ja hurmostila psykologisina ilmiöinä Tähän ja alaluokkiin myös tiedostamattoman sielunelämän psykoanalyyttinen tutkimus Jos teos koskee psykoanalyysia sekä psykologian että psykiatrian kannalta, annetaan etusija luokalle 14.45+

Uni
type: Concept
References: Unikirjat
References: Rentoutus. Uni. Unettomuus
References: Psykoanalyysi
type: YKL-luokka
alternative label: Drömanalys, djuppsykologi (14.451) @sv
alternative label: Drömmar, djuppsykologi (14.451) @sv
alternative label: Sömn (14.451) @sv
alternative label: Sömn, djuppsykologi (14.451) @sv
alternative label: Sömnforskning (14.451) @sv
alternative label: Sömngång (14.451) @sv
alternative label: Sömnprat (14.451) @sv
alternative label: Sömnrörelser (14.451) @sv
alternative label: Sömnstadier (14.451) @sv
alternative label: Unen vaiheet (14.451)
alternative label: Unet, syvyyspsykologia (14.451)
alternative label: Uni (14.451)
alternative label: Uni, syvyyspsykologia (14.451)
alternative label: Unianalyysi, syvyyspsykologia (14.451)
alternative label: Uniliikkeet (14.451)
alternative label: Unissakäveleminen (14.451)
alternative label: Unissapuhuminen (14.451)
alternative label: Unitutkimus (14.451)
alternative label: Vaket tillstånd, djuppsykologi (14.451) @sv
alternative label: Valvetila, syvyyspsykologia (14.451)
broader: Syvyyspsykologia. Tiedostamaton sielunelämä
in scheme: YKL - Yleisten kirjastojen luokitusjärjestelmä
notation: 14.451
preferred label: Sleep and dreams @en
preferred label: Sömn och drömmar @sv
scope note: Hit sömn- och drömforskning i allmänhet Sömn som psykologiskt eller psykofysiskt fenomen Jämförelser mellan sömn- och vakentillstånd Olika faser i sömnen. Sömnrörelser Att gå i sömnen. Att tala i sömnen Drömanalys ur djuppsykologisk synvinkel @sv
scope note: Tähän unen tutkimus yleensä Uni psykologisena tai psykofyysisenä ilmiönä Uni- ja valvetila ja niiden vertailu Unen vaiheet. Uniliikkeet Unissakäveleminen. Unissapuhuminen Unianalyysi syvyyspsykologian kannalta

Hypnoosi
type: Concept
References: Opetusoppi
References: Psykoterapia. Mielenterveystyö
type: YKL-luokka
alternative label: Hypnoosi, psykologia (14.459)
alternative label: Hypnos, psykologi (14.459) @sv
alternative label: Itsesuggestio, psykologia (14.459)
alternative label: Självsuggestion, psykologi (14.459) @sv
alternative label: Suggestio, psykologia (14.459)
alternative label: Suggestion, psykologi (14.459) @sv
broader: Syvyyspsykologia. Tiedostamaton sielunelämä
in scheme: YKL - Yleisten kirjastojen luokitusjärjestelmä
notation: 14.459
preferred label: Hypnos @sv
preferred label: Hypnosis @en
scope note: Hypnoosi ja suggestio psykologian kannalta Hypnoosin ja suggestion sovellukset eri aloille luokitetaan alan mukaan
scope note: Hypnos och suggestion ur psykologisk synvinkel Tillämpningar av hypnos och suggestion på olika områden klassificeras enligt område @sv

Kehityspsykologia
type: Concept
References: Havaintopsykologia
References: Oppimisen psykologia
References: Ajattelun, älykkyyden, luovuuden ja lahjakkuuden psykologia
References: Kieli-, kommunikaatio- ja ilmaisupsykologia
References: Persoonallisuuden psykologia
References: Syvyyspsykologia. Tiedostamaton sielunelämä
References: Lääketieteellinen biologia
type: YKL-luokka
alternative label: Ikäkausien psykologia (14.6+)
alternative label: Kehityspsykologia (14.6+)
alternative label: Utvecklingspsykologi (14.6+) @sv
alternative label: Åldersstadiernas psykologi (14.6+) @sv
broader: PSYKOLOGIA
in scheme: YKL - Yleisten kirjastojen luokitusjärjestelmä
narrower: Lapsuuden ja nuoruuden psykologia
narrower: Aikuisiän ja vanhuuden psykologia
notation: 14.6
preferred label: Developmental psychology @en
preferred label: Utvecklingspsykologi @sv
scope note: Hit och till underklasserna individens psykologiska utveckling och de faktorer som påverkar den i allmänhet De olika åldrarnas psykologi i allmänhet Om ett utvecklingspsykologiskt verk behandlar ett speciellt område inom psykologin, ges företräde åt klassen för vederbörande specialområde @sv
scope note: Tähän ja alaluokkiin yksilön psykologinen kehitys ja siihen vaikuttavat tekijät yleensä Eri ikäkausien psykologia yleensä Jos kehityspsykologinen teos koskee jotakin tiettyä psykologian erikoisalaa, annetaan etusija ko. erikoisalan luokalle

Lapsuuden ja nuoruuden psykologia
type: Concept
References: Perhe- ja kotikasvatus
References: Koululaitos
References: URN:NBN:fi:au:ykl:38.5201
References: Seksologia
References: Psykiatria
References: Lasten terveydenhoito. Lastentaudit
References: Leikit
type: YKL-luokka
alternative label: Aikuistuminen, psykologia, yl. (14.61)
alternative label: Barn, utveckling, psykologi (14.61) @sv
alternative label: Barndomens psykologi (14.61) @sv
alternative label: Barnpsykologi (14.61) @sv
alternative label: Barns utveckling, psykologi (14.61) @sv
alternative label: Barnuppfostran, psykologi (14.61) @sv
alternative label: Itsenäistyminen, psykologia (14.61)
alternative label: Jagföreställning, barnpsykologi (14.61) @sv
alternative label: Jagföreställning, ungdomspsykologi (14.61) @sv
alternative label: Lapsen kehitys, psykologia (14.61)
alternative label: Lapset, kehitys, psykologia (14.61)
alternative label: Lapsipsykologia (14.61)
alternative label: Lapsuuden psykologia (14.61)
alternative label: Lastenkasvatus, psykologia (14.61)
alternative label: Leikit, lapsipsykologia (14.61)
alternative label: Leikkikalut, lapsipsykologia (14.61)
alternative label: Lekar, barnpsykologi (14.61) @sv
alternative label: Leksaker, barnpsykologi (14.61) @sv
alternative label: Lelut, lapsipsykologia (14.61)
alternative label: Minäkuva, lapsipsykologia (14.61)
alternative label: Minäkuva, nuorisopsykologia (14.61)
alternative label: Murrosikä, psykologia (14.61)
alternative label: Nuorisopsykologia (14.61)
alternative label: Nuoruuden psykologia (14.61)
alternative label: Personlighet, barnpsykologi (14.61) @sv
alternative label: Personlighet, ungdomspsykologi (14.61) @sv
alternative label: Persoonallisuus, lapsipsykologia (14.61)
alternative label: Persoonallisuus, nuorisopsykologia (14.61)
alternative label: Puberteetti, psykologia (14.61)
alternative label: Pubertet, psykologi (14.61) @sv
alternative label: Självständigblivande, psykologi (14.61) @sv
alternative label: Ungdomens psykologi (14.61) @sv
alternative label: Ungdomspsykologi (14.61) @sv
alternative label: Vuxenblivande, psykologi, allm. (14.61) @sv
broader: Kehityspsykologia
in scheme: YKL - Yleisten kirjastojen luokitusjärjestelmä
notation: 14.61
preferred label: Barn- och ungdomspsykologi @sv
preferred label: Psychology of childhood and adolescence @en
scope note: De psykiska utvecklingsfaserna hos barn och unga Den tidiga barndomens psykologi och pubertetens psykologi Att bli vuxen. Att bli självständig Hit också hur jagföreställning och personlighet utformas Lekar ur barnpsykologisk synvinkel Om ett barn- eller ungdomspsykologiskt verk rör ett specialområde inom psykologin, ges företräde åt det berörda specialområdets klass Om verket innehåller både barn- och ungdomspsykologi och praktiska råd om uppfostran, ges företräde åt klass 38.1 eller 38.5+ Barn- och ungdomspsykologiska test 14.6101 @sv
scope note: Lapsen ja nuoren psyykkiset kehitysvaiheet Varhaislapsuuden ja murrosiän psykologia Aikuistumisen ja itsenäistymisen psykologia Tähän myös minäkuvan ja persoonallisuuden muodostuminen Leikit lapsipsykologian kannalta Jos lapsi- tai nuorisopsykologinen teos koskee jotakin psykologian erikoisalaa, annetaan etusija ko. erikoisalan luokalle Jos teoksessa on sekä lapsi- tai nuorisopsykologiaa että käytännön kasvatusohjeita, annetaan etusija luokalle 38.1 tai 38.5+ Lapsi- ja nuorisopsykologiset testit 14.6101

Aikuisiän ja vanhuuden psykologia
type: Concept
References: Vanhuspalvelut
References: Psykiatria
References: Vanhusten terveydenhoito. Vanhusten taudit
type: YKL-luokka
alternative label: Aikuisiän psykologia, yl. (14.62)
alternative label: Eläkkeelle siirtymisen psykologia (14.62)
alternative label: Ikääntyminen, psykologia (14.62)
alternative label: Keski-iän psykologia (14.62)
alternative label: Medelålderns psykologi (14.62) @sv
alternative label: Pensioneringspsykologi (14.62) @sv
alternative label: Vanheneminen, psykologia (14.62)
alternative label: Vanhukset, psykologia (14.62)
alternative label: Vuxenpsykologi, allm. (14.62) @sv
alternative label: Åldrande, psykologi (14.62) @sv
alternative label: Åldringar, psykologi (14.62) @sv
broader: Kehityspsykologia
in scheme: YKL - Yleisten kirjastojen luokitusjärjestelmä
notation: 14.62
preferred label: Psychology of adulthood and old age @en
preferred label: Vuxenpsykologi och åldrandets psykologi @sv
scope note: Aikuisiän, keski-iän ja vanhuuden psyykkiset kehitysvaiheet Tähän myös eläkkeelle siirtymisen psykologia Jos aikuisiän tai vanhuuden psykologiaa koskeva teos käsittelee jotakin psykologian erikoisalaa, annetaan etusija ko. erikoisalan luokalle
scope note: Psykiska utvecklingsskeden under vuxen ålder, medelålder och ålderdom Hit också pensioneringstidens psykologi Om verket om vuxenpsykologi eller åldrandets psykologi behandlar ett specialområde inom psykologin, ges företräde åt specialområdets klass @sv

Ihmissuhteiden psykologia
type: Concept
References: Tunne- ja tahtotoiminnot
References: Persoonallisuuden psykologia
References: Elämänfilosofia. Elämäntaito
References: Sielunhoito
References: Sosiaalipsykologia
References: Työ. Työelämä
References: Perhepolitiikka
References: Perhe-, ryhmä- ja ympäristöterapiat
References: Mielenterveys. Tunne-elämän häiriöt
type: YKL-luokka
alternative label: Alemmuuskompleksit, ihmissuhteiden psykologia (14.8)
alternative label: Avioero, ihmissuhteiden psykologia (14.8)
alternative label: Avioliitto, ihmissuhteiden psykologia (14.8)
alternative label: Avoliitto, ihmissuhteiden psykologia (14.8)
alternative label: Beroende, medberoende, de mänskliga relationernas psykologi (14.8) @sv
alternative label: Blyghet, de mänskliga relationernas psykologi (14.8) @sv
alternative label: Elämänohjeet, ihmissuhteiden psykologia (14.8)
alternative label: Familjepsykologi (14.8) @sv
alternative label: Föräldraskap, familjepsykologi (14.8) @sv
alternative label: Henkinen väkivalta, ihmissuhteiden psykologia (14.8)
alternative label: Ihmissuhteet, psykologia (14.8)
alternative label: Kriisit, ihmissuhteet, parisuhde (14.8)
alternative label: Kriser, mänskliga relationer, parföhållande (14.8) @sv
alternative label: Känsloliv, de mänskliga relationernas psykologi (14.8) @sv
alternative label: Känslor, de mänskliga relationernas psykologi (14.8) @sv
alternative label: Kärlek, de mänskliga relationernas psykologi (14.8) @sv
alternative label: Levnadsregler, mänskliga relationers psykologi (14.8) @sv
alternative label: Läheisriippuvuus, ihmissuhteiden psykologia (14.8)
alternative label: Medberoende, de mänskliga relationernas psykologi (14.8) @sv
alternative label: Mindervärdeskomplex, de mänskliga relationernas psykologi (14.8) @sv
alternative label: Mustasukkaisuus, ihmissuhteiden psykologia (14.8)
alternative label: Mänskliga relationer, psykologi (14.8) @sv
alternative label: Parförhållande, de mänskliga relationernas psykologi (14.8) @sv
alternative label: Parisuhde, ihmissuhteiden psykologia (14.8)
alternative label: Perhepsykologia (14.8)
alternative label: Psykiskt våld, de mänskliga relationernas psykologi (14.8) @sv
alternative label: Rakkaus, ihmissuhteiden psykologia (14.8)
alternative label: Riippuvuus, läheisriippuvuus, ihmissuhteiden psykologia (14.8)
alternative label: Sammanboende, de mänskliga relationernas psykologi (14.8) @sv
alternative label: Skilsmässa, de mänskliga relationernas psykologi (14.8) @sv
alternative label: Svartsjuka, de mänskliga relationernas psykologi (14.8) @sv
alternative label: Transaktioanalyysi (14.8)
alternative label: Transaktionsanalys (14.8) @sv
alternative label: Tunne-elämä, ihmissuhteiden psykologia (14.8)
alternative label: Tunteet, ihmissuhteiden psykologia (14.8)
alternative label: Ujous, ihmissuhteiden psykologia (14.8)
alternative label: Vanhemmuus, perhepsykologia (14.8)
alternative label: Äktenskap, de mänskliga relationernas psykologi (14.8) @sv
broader: PSYKOLOGIA
in scheme: YKL - Yleisten kirjastojen luokitusjärjestelmä
notation: 14.8
preferred label: De mänskliga relationernas psykologi @sv
preferred label: Psychology of human relations @en
scope note: Familjepsykologi. Parförhållanden Äktenskaps- och skilsmässopsykologi Transaktionsanalys Hit också populärpsykologiska verk om mänskliga relationer och känslor @sv
scope note: Perhepsykologia. Parisuhteen psykologia Avioliiton ja avioeron psykologia Transaktioanalyysi Tähän myös ihmissuhteita ja tunteita koskevat populaaripsykologiset teokset

RAJATIETO
type: Concept
References: FILOSOFIA
References: YLEINEN USKONTOTIEDE
References: USKONNONFILOSOFIA
type: YKL-luokka
alternative label: Atlantis (15)
alternative label: Ihmeet, rajatieto (15+)
alternative label: Kielilläpuhuminen, rajatieto (15+)
alternative label: Oförklarliga fenomen (15+) @sv
alternative label: Omstridda fenomen (15+) @sv
alternative label: Paranormaalit ilmiöt (15+)
alternative label: Paranormala fenomen (15+) @sv
alternative label: Rajatieto (15+)
alternative label: Selittämättömät ilmiöt (15+)
alternative label: Tungomålstalande, paranormala fenomen (15+) @sv
alternative label: Under, paranormala fenomen (15+) @sv
alternative label: Yliluonnolliset ilmiöt, rajatieto (15+)
alternative label: Övernaturliga fenomen, paranormala fenomen (15+) @sv
broader: FILOSOFIA. PSYKOLOGIA. RAJATIETO. TIEDEOPPI
in scheme: YKL - Yleisten kirjastojen luokitusjärjestelmä
narrower: Parapsykologia
narrower: Ufot
narrower: Okkultismi. Spiritismi. Spiritualismi. Henkimaailma
notation: 15
preferred label: PARANORMAL PHENOMENA @en
preferred label: PARANORMALA FENOMEN @sv
scope note: Hit och till underklasserna verk om paranormala fenomen och vetenskapligt oförklarliga händelser @sv
scope note: Tähän ja alaluokkiin teokset, jotka koskevat tieteelle selittämättömiä yliluonnollisia ilmiöitä tai tapahtumia

Parapsykologia
type: Concept
References: Havaintopsykologia
References: Syvyyspsykologia. Tiedostamaton sielunelämä
References: Uni
References: Hypnoosi
References: Okkultismi. Spiritismi. Spiritualismi. Henkimaailma
type: YKL-luokka
alternative label: Ajatuksensiirto (15.1)
alternative label: Ajatusten lukeminen (15.1)
alternative label: Clairaudience (15.1)
alternative label: Clairvoyance (15.1)
alternative label: Döden, parapsykologi (15.1) @sv
alternative label: Dödsupplevelser, parapsykologi (15.1) @sv
alternative label: ESP-fenomen (15.1) @sv
alternative label: ESP-ilmiöt (15.1)
alternative label: Kläraudians (15.1) @sv
alternative label: Klärvoajans (15.1) @sv
alternative label: Kuolema, parapsykologia (15.1)
alternative label: Kuolemakokemukset, parapsykologia (15.1)
alternative label: Kuoleman lähikokemukset (15.1)
alternative label: Kuolemanrajakokemukset (15.1)
alternative label: Kuolemarajakokemukset (15.1)
alternative label: Känsloöverföring, parapsykologi (15.1) @sv
alternative label: Lähellä kuolemaa -kokemukset (15.1)
alternative label: Nära döden-upplevelser (15.1) @sv
alternative label: Nära-döden-upplevelser (15.1) @sv
alternative label: Näradödenupplevelser (15.1) @sv
alternative label: Parakinesi (15.1) @sv
alternative label: Parakinesia (15.1)
alternative label: Parapsykologi (15.1) @sv
alternative label: Parapsykologia (15.1)
alternative label: Rajakokemukset (15.1)
alternative label: Selväkuuloisuus (15.1)
alternative label: Selvänäkö (15.1)
alternative label: Tankeläsning (15.1) @sv
alternative label: Tankeöverföring (15.1) @sv
alternative label: Telekinesi (15.1) @sv
alternative label: Telekinesia (15.1)
alternative label: Telepati (15.1) @sv
alternative label: Telepatia (15.1)
alternative label: Tunteensiirto, parapsykologia (15.1)
broader: RAJATIETO
in scheme: YKL - Yleisten kirjastojen luokitusjärjestelmä
notation: 15.1
preferred label: Parapsychology @en
preferred label: Parapsykologi @sv
scope note: Hit paranormala psykiska och psykofysiska fenomen som inte kan förklaras vetenskapligt Utomsinnlig varseblivning (ESP). Clairvoyance. Clairaudiance Telepati. Parakinesi. Telekinesi Parapsykologiska erfarenheter av döden. Nära-döden-upplevelser Vetenskapliga undersökningar av parapsykologiska fenomen @sv
scope note: Tähän paranormaalit psyykkiset ja psykofyysiset ilmiöt, joille ei ole tieteellisesti hyväksyttävää selitystä Ilman aisteja tapahtuva havaitseminen (ESP) Selvänäkö eli clairvoyance Selväkuuloisuus eli clairaudience Ajatuksensiirto eli telepatia Parakinesia. Telekinesia Parapsykologiset kokemukset kuolemasta. Kuolemanrajakokemukset Parapsykologisten ilmiöiden tieteellinen tutkimus

Ufot
type: Concept
References: Avaruustutkimus. Avaruustoiminta
References: Avaruusalukset. Avaruusteknologia
type: YKL-luokka
alternative label: Flygande tefat (15.7) @sv
alternative label: Humanoider (15.7) @sv
alternative label: Humanoidit (15.7)
alternative label: Lentävät lautaset (15.7)
alternative label: Maapallon ulkopuoliset kulttuurit (15.7)
alternative label: Ufon (15.7) @sv
alternative label: Ufot (15.7)
alternative label: Utomjordiska kulturer (15.7) @sv
broader: RAJATIETO
in scheme: YKL - Yleisten kirjastojen luokitusjärjestelmä
notation: 15.7
preferred label: Ufon @sv
preferred label: Ufos @en
scope note: Ilmakehän tunnistamattomat ilmiöt ja niiden tutkimus Lentävät lautaset. Vieraat avaruudesta. Humanoidit Tähän myös maapallon ulkopuolisten kulttuurien ja olentojen vaikutukset muinais- tai maailmanhistoriaan ja maailmantapahtumiin
scope note: Oidentifierade fenomen i atmosfären och forskning kring dem Flygande tefat. Besökare från rymden. Humanoider Hit också utomjordiska kulturens och varelsers inflytande på forntidens historia eller på världshistorien och världshändelserna @sv

Okkultismi. Spiritismi. Spiritualismi. Henkimaailma
type: Concept
modified: 2026-05-06T13:15:17
References: FILOSOFIA
References: Syvyyspsykologia. Tiedostamaton sielunelämä
References: Parapsykologia
References: YLEINEN USKONTOTIEDE
References: USKONNONFILOSOFIA
References: Jumala-käsite. Jumalan toiminta
References: MUUT USKONNOT JA MYTOLOGIAT
alternative label: Aaveet (15.9)
alternative label: Alkemi (15.9) @sv
alternative label: Alkemia (15.9)
alternative label: Amuletit, okkultismi (15.9)
alternative label: Amuletter, ockultism (15.9) @sv
alternative label: Andebesvärjelse (15.9) @sv
alternative label: Andevärldens fenomen (15.9) @sv
alternative label: Aura, ockultism (15.9) @sv
alternative label: Aura, okkultismi (15.9)
alternative label: Automaattikirjoitus (15.9)
alternative label: Automatisk skrift (15.9) @sv
alternative label: Bioenergi, ockultism (15.9) @sv
alternative label: Bioenergia, okkultismi (15.9)
alternative label: Chakrat, rajatieto (15.9)
alternative label: Chakror, omstridda fenomen (15.9) @sv
alternative label: Demoner, ockultism (15.9) @sv
alternative label: Demonit, okkultismi (15.9)
alternative label: Enkelit, okkultismi (15.9)
alternative label: Esoterism (15.9) @sv
alternative label: Esoterism, ockultism (15.9+) @sv
alternative label: Esoterismi (15.9)
alternative label: Esoterismi, okkultismi (15.9+)
alternative label: Helbrägdagörelse på avstånd, ockultism (15.9) @sv
alternative label: Helbrägdagörelse, ockultism (15.9) @sv
alternative label: Henkien manaaminen (15.9)
alternative label: Henkimaailman ilmiöt (15.9)
alternative label: Henkiparantaminen, okkultismi (15.9)
alternative label: Häxeri (15.9) @sv
alternative label: Häxeri, ockultism (15.9) @sv
alternative label: I ching (15.9)
alternative label: Ihmeparannus, okkultismi (15.9)
alternative label: Kabbala (15.9)
alternative label: Kanalisering (paranormala fenomen) (15.9) @sv
alternative label: Kanavointi (paranormaalit ilmiöt) (15.9)
alternative label: Kaukoparannus, okkultismi (15.9)
alternative label: Kirlianfotografi (15.9) @sv
alternative label: Kirliankuvaus (15.9)
alternative label: Kummitukset (15.9)
alternative label: Kuolemanjälkeinen elämä, okkultismi (15.9)
alternative label: Livet efter döden, ockultism (15.9) @sv
alternative label: Maasäteily (15.9)
alternative label: Magi, ockultism (15.9) @sv
alternative label: Magia, okkultismi (15.9)
alternative label: Markstrålning (15.9) @sv
alternative label: Medier, parapsykologi (15.9) @sv
alternative label: Meediot (15.9)
alternative label: Mentalismi (15.9)
alternative label: Mesmerismi (15.9)
alternative label: Noituus (15.9)
alternative label: Noituus, okkultismi (15.9)
alternative label: Okkultismi (15.9+)
alternative label: Poltergeist (15.9)
alternative label: Salatieteet, okkultismi (15.9+)
alternative label: Samanismi, henkiparannus (15.9)
alternative label: Shamanismi, henkiparannus (15.9)
alternative label: Sielunvaellus, okkultismi (15.9)
alternative label: Spiritismi (15.9)
alternative label: Spiritualismi, okkultismi (15.9)
alternative label: Taikausko, okkultismi (15.9)
alternative label: Taikavarvut (15.9)
alternative label: Taikuus, okkultismi (15.9)
alternative label: Vampyyrit (15.9)
alternative label: Voodoo (15.9)
broader: RAJATIETO
in scheme: YKL - Yleisten kirjastojen luokitusjärjestelmä
narrower: Astrologia
narrower: Unikirjat
narrower: Ennustaminen
notation: 15.9
scope note: Hit ockultism och fenomen i andevärlden och vetenskaplig undersökning av dem Spiritism. Medier. Aura. Kirlianfotografering. Automatisk skrift Kontakt med de dödas andar Andebesvärjelser. Förutsägelser Livet efter döden och själavandring ur spiritistisk och ockult synvinkel Spöken. Vålnader. Poltergeist Vidskepelse. Trolldom. Häxeri. Magi. Voodoo Healing, helbrägdagörelse och telepatiskt botande ur ockult och spiritistisk synvinkel Alkemi. Jordstrålning. Slagrutor. Bioenergi Kabbala. I ching. Häxeriets och häxförföljelsernas historia allmänt 15.909 @sv
scope note: Tähän okkultiset eli salatieteet sekä henkimaailman ilmiöt ja niiden tieteellinen tutkimus Spiritismi. Meediot. Aura. Kirliankuvaus. Automaattikirjoitus Yhteydenpito vainajien henkien kanssa Henkien manaaminen. Ennaltanäkö Kuolemanjälkeinen elämä ja sielunvaellus okkultismin ja spiritismin kannalta Aaveet. Kummitukset. Poltergeist Taikausko. Taikuus. Noituus. Magia. Voodoo Henki-, ihme- ja kaukoparannus okkultismin kannalta Alkemia. Maasäteily. Taikavarvut. Bioenergia Kabbala. I ching. Noituuden ja noitavainojen historia yleensä 15.909

Astrologia
type: Concept
References: Ennustaminen
References: TÄHTITIEDE. GEODESIA
type: YKL-luokka
alternative label: Astrologi (15.91) @sv
alternative label: Astrologia (15.91)
alternative label: Ennustaminen, astrologia (15.91)
alternative label: Ennustukset, astrologia (15.91)
alternative label: Förutsägelser, astrologi (15.91) @sv
alternative label: Horoskoopit (15.91)
alternative label: Horoskop (15.91) @sv
alternative label: Spådomar, astrologi (15.91) @sv
alternative label: Stjärntecken (15.91) @sv
alternative label: Stjärntydning (15.91) @sv
alternative label: Tähdistä ennustaminen (15.91)
alternative label: Tähtimerkit (15.91)
broader: Okkultismi. Spiritismi. Spiritualismi. Henkimaailma
in scheme: YKL - Yleisten kirjastojen luokitusjärjestelmä
notation: 15.91
preferred label: Astrologi @sv
preferred label: Astrology @en
scope note: Stjärntecken. Att spå i stjärnorna Horoskop @sv
scope note: Tähtimerkit. Tähdistä ennustaminen Horoskoopit

Unikirjat
type: Concept
References: Uni
References: Rentoutus. Uni. Unettomuus
References: Psykoanalyysi
type: YKL-luokka
alternative label: Drömböcker, ockultism (15.92) @sv
alternative label: Drömmar, sanndrömmar (15.92) @sv
alternative label: Ennustaminen, unet (15.92)
alternative label: Ennusunet (15.92)
alternative label: Sanndrömmar (15.92) @sv
alternative label: Spådomar, drömmar (15.92) @sv
alternative label: Sömn, ockultism (15.92) @sv
alternative label: Unet, ennusunet (15.92)
alternative label: Uni, okkultismi (15.92)
alternative label: Unikirjat, okkultismi (15.92)
broader: Okkultismi. Spiritismi. Spiritualismi. Henkimaailma
in scheme: YKL - Yleisten kirjastojen luokitusjärjestelmä
notation: 15.92
preferred label: Dream books @en
preferred label: Drömböcker @sv
scope note: Ennusunet Unien tulkinta okkultismin kannalta
scope note: Sanndrömmar Tolkning av drömmar ur ockult synvinkel @sv

Ennustaminen
type: Concept
References: Astrologia
References: Unikirjat
type: YKL-luokka
alternative label: Ennaltanäkö (15.93)
alternative label: Ennustaminen (15.93)
alternative label: Ennustukset, (15.93)
alternative label: Kiromanti (15.93) @sv
alternative label: Kiromantia (15.93)
alternative label: Korteista ennustaminen (15.93)
alternative label: Kädestä ennustaminen (15.93)
alternative label: Numerologi, ockultism (15.93) @sv
alternative label: Numerologia, okkultismi (15.93)
alternative label: Oraakkelikortit (15.93)
alternative label: Orakelkort (15.93) @sv
alternative label: Spå i hand (15.93) @sv
alternative label: Spå i kort (15.93) @sv
alternative label: Spådomar (15.93) @sv
alternative label: Spådomskonst (15.93) @sv
alternative label: Synskhet (15.93) @sv
alternative label: Tarok (15.93) @sv
alternative label: Tarokki (15.93)
alternative label: Tarot (15.93)
broader: Okkultismi. Spiritismi. Spiritualismi. Henkimaailma
in scheme: YKL - Yleisten kirjastojen luokitusjärjestelmä
notation: 15.93
preferred label: Divination @en
preferred label: Spådomskonst @sv
scope note: Hit spådomar i allmänhet Att spå i kort. Tarok. Att spå i hand. Kiromanti. Numerologi @sv
scope note: Tähän ennustaminen yleensä Korteista ennustaminen. Tarokki. Kädestä ennustaminen. Kiromantia. Numerologia

TIETOTEORIA. TIEDEOPPI
type: Concept
type: YKL-luokka
alternative label: Nanotieteet (16+)
alternative label: Nanovetenskaper (16+) @sv
alternative label: Tieteet, tiedeoppi (16+)
alternative label: Vetenskaper, vetenskapsteori (16+) @sv
broader: FILOSOFIA. PSYKOLOGIA. RAJATIETO. TIEDEOPPI
in scheme: YKL - Yleisten kirjastojen luokitusjärjestelmä
narrower: Tietoteoria
narrower: Tiedeoppi. Tieteenfilosofia
narrower: Tiedepolitiikka
notation: 16
preferred label: KUNSKAPSTEORI. VETENSKAPSTEORI @sv
preferred label: THEORY OF KNOWLEDGE. THEORY OF SCIENCE @en
scope note: Hit verk som omfattar både kunskapsteori och vetenskapsteori Hit också verk som omfattar både vetenskapsteori och vetenskapspolitik Vetenskapens historia och lärdomshistoria i allmänhet 16.09 Formtillägget 01 används inte i samband med klasserna 16-16.7 @sv
scope note: Tähän teokset, joissa on sekä tietoteoriaa että tiedeoppia Tähän myös teokset, joissa on sekä tiedeoppia että tiedepolitiikkaa Tieteen historia ja oppihistoria yleensä 16.09 Muotoluokkaa 01 ei käytetä luokkien 16-16.7 yhteydessä

Tietoteoria
type: Concept
References: FILOSOFIA
References: LOGIIKKA
References: Tiedeoppi. Tieteenfilosofia
type: YKL-luokka
alternative label: Agnosticism, kunskapsteori, allm. (16.1) @sv
alternative label: Agnostisismi, tietoteoria, yl, (16.1)
alternative label: Aika, tietoteoria, yl. (16.1)
alternative label: Deduktio, tietoteoria (16.1)
alternative label: Deduktion, kunskapsteori (16.1) @sv
alternative label: Dogmatism, kunskapsteori (16.1) @sv
alternative label: Dogmatismi, tietoteoria (16.1)
alternative label: Eksistenssi, tietoteoria (16.1)
alternative label: Empirism, kunskapsteori (16.1) @sv
alternative label: Empirismi, tietoteoria (16.1)
alternative label: Epistemologi (16.1) @sv
alternative label: Epistemologia (16.1)
alternative label: Existens, kunskapsteori (16.1) @sv
alternative label: Fenomenologi, kunskapsteori (16.1) @sv
alternative label: Fenomenologia, tietoteoria (16.1)
alternative label: Filosofi, kunskapsteori (16.1) @sv
alternative label: Filosofia, tietoteoria (16.1)
alternative label: Indeterminism, kunskapsteori (16.1) @sv
alternative label: Indeterminismi, tietoteoria (16.1)
alternative label: Induktio, tietoteoria (16.1)
alternative label: Induktion, kunskapsteori (16.1) @sv
alternative label: Irrationalism, kunskapsteori (16.1) @sv
alternative label: Irrationalismi, tietoteoria (16.1)
alternative label: Konventionalism, kunskapsteori (16.1) @sv
alternative label: Konventionalismi, tietoteoria (16.1)
alternative label: Kriticism, kunskapsteori (16.1) @sv
alternative label: Kritisismi, tietoteoria (16.1)
alternative label: Kunskapskritik, kunskapsteori (16.1) @sv
alternative label: Kunskapsteori (16.1) @sv
alternative label: Logisk empirism, kunskapsteori (16.1) @sv
alternative label: Logisk positivism, kunskapsteori (16.1) @sv
alternative label: Looginen empirismi, tietoteoria (16.1)
alternative label: Looginen positivismi, tietoteoria (16.1)
alternative label: Nihilism, kunskapsteori (16.1) @sv
alternative label: Nihilismi, tietoteoria (16.1)
alternative label: Positivism, vetenskapsteori (16.1) @sv
alternative label: Positivismi, tietoteoria (16.1)
alternative label: Pragmatism, kunskapsteori (16.1) @sv
alternative label: Pragmatismi, tietoteoria (16.1)
alternative label: Rationalism, kunskapsteori (16.1) @sv
alternative label: Rationalismi, tietoteoria (16.1)
alternative label: Realism, kunskapsteori (16.1) @sv
alternative label: Realismi, tietoteoria (16.1)
alternative label: Sanning, kunskapsteori (16.1) @sv
alternative label: Sannolikhet, kunskapsteori (16.1) @sv
alternative label: Skepticism, kunskapsteori (16.1) @sv
alternative label: Skeptismi, tietoteoria (16.1)
alternative label: Strukturalism, kunskapsteori (16.1) @sv
alternative label: Strukturalismi, tietoteoria (16.1)
alternative label: Subjektivism, kunskapsteori (16.1) @sv
alternative label: Subjektivismi, tietoteoria (16.1)
alternative label: Tid, kunskapsteori, allm. (16.1) @sv
alternative label: Tietokritiikki, tietoteoria (16.1)
alternative label: Tietoteoria (16.1)
alternative label: Todennäköisyys, tietoteoria (16.1)
alternative label: Totuus, tietoteoria (16.1)
broader: TIETOTEORIA. TIEDEOPPI
in scheme: YKL - Yleisten kirjastojen luokitusjärjestelmä
notation: 16.1
preferred label: Kunskapsteori @sv
preferred label: Theory of knowledge @en
scope note: Hit allmän kunskapsteori Vetandets förutsättningar, ursprung, källor, väsen, arter, gränser, objekt, säkerhet, uppgifter, kritik och värde ur kunskapsteoretisk synvinkel Kunskapsteoretiska riktningar, såsom agnosticism, irrationalism, fenomenologi, rationalism, empirism, kriticism, dogmatism, skepticism, positivism, pragmatism, strukturalism, realism och subjektivism Kunskapsteori inom specialområden klassificeras enligt område Formtillägget 01 används inte i samband med klasserna 16-16.7 @sv
scope note: Tähän yleinen tietoteoria ja tieto-oppi Tiedon edellytykset, alkuperä, lähteet, olemus, lajit, rajat, kohteet, varmuus, tehtävät, kritiikki ja arvo tietoteorian kannalta Tietoteoreettiset suunnat, kuten agnostisismi, irrationalismi, fenomenologia, rationalismi, empirismi, kritisismi, dogmatismi, skeptisismi, positivismi, pragmatismi, strukturalismi, realismi ja subjektivismi Erikoisalojen tietoteoria luokitetaan alan mukaan Muotoluokkaa 01 ei käytetä luokkien 16-16.7 yhteydessä

Tiedeoppi. Tieteenfilosofia
type: Concept
References: LOGIIKKA
References: URN:NBN:fi:au:ykl:16.09
References: Tietoteoria
References: Tiedepolitiikka
References: URN:NBN:fi:au:ykl:30.01
References: Opiskelutekniikka
References: URN:NBN:fi:au:ykl:50.01
alternative label: Aksiomaattinen menetelmä, tiedeoppi (16.7)
alternative label: Atomism, vetenskapslära (16.7) @sv
alternative label: Atomismi, tiedeoppi (16.7)
alternative label: Avhandlingsteknik, vetenskapens metoder (16.7) @sv
alternative label: Axiomatisk metod, vetenskapslära (16.7) @sv
alternative label: Barnforskning, forskningsmetoder (16.7) @sv
alternative label: Beteendevetenskaper, vetenskapsfilosofi (16.7) @sv
alternative label: Beteendevetenskaper, vetenskapslära (16.7) @sv
alternative label: Bibliometriikka (16.7)
alternative label: Bibliometrik (16.7) @sv
alternative label: Debatt, vetenskap (16.7) @sv
alternative label: Deduktio, tiedeoppi (16.7)
alternative label: Deduktion, vetenskapsteori (16.7) @sv
alternative label: Diskursanalys (16.7) @sv
alternative label: Diskurssianalyysi (16.7)
alternative label: Doktorsavhandlingar, utarbetning (16.7) @sv
alternative label: Etiikka, tiede (16.7)
alternative label: Etnografia, tutkimusmenetelmät (16.7)
alternative label: Filosofia, tieteenfilosofia (16.7)
alternative label: Gender-tutkimus, tutkimusmenetelmät (16.7)
alternative label: Holismi, tiedeoppi (16.7)
alternative label: Humanistiset tieteet, tiedeoppi (16.7)
alternative label: Humanistiset tieteet, tieteenfilosofia (16.7)
alternative label: Hypoteesit, tiedeoppi (16.7)
alternative label: Ihmistieteet, tiedeoppi (16.7)
alternative label: Ihmistieteet, tieteenfilosofia (16.7)
alternative label: Induktio, tiedeoppi (16.7)
alternative label: Käyttäytymistieteet, tiedeoppi (16.7)
alternative label: Käyttäytymistieteet, tieteenfilosofia (16.7)
alternative label: Lapsitutkimus, tutkimusmenetelmät (16.7)
alternative label: Lisensiaatintyöt, valmistelu (16.7)
alternative label: Lähdekritiikki (16.7)
alternative label: Metatiede (16.7)
alternative label: Metodologia, tiedeoppi (16.7)
alternative label: Miestutkimus, tutkimusmenetelmät (16.7)
alternative label: Naistutkimus, tutkimusmenetelmät (16.7)
alternative label: Ongelmanasettelu, tiedeoppi (16.7)
alternative label: Opinnäytteet, väitöskirjat, laadintaohjeet (16.7)
alternative label: Paradigmat, tiedeoppi (16.7)
alternative label: Plagiaatit, tiede (16.7)
alternative label: Plagiointi, tiede (16.7)
alternative label: Poikatutkimus, tutkimusmenetelmät (16.7)
alternative label: Sukupuolentutkimus, tutkimusmenetelmät (16.7)
alternative label: Sukupuolitutkimus, tutkimusmenetelmät (16.7)
alternative label: Systeemiteoria, tieteenfilosofia (16.7)
alternative label: Systeemitiede, tieteenfilosofia (16.7)
alternative label: Tiede, etiikka (16.7)
alternative label: Tiedeoppi (16.7)
alternative label: Tiedonhaku, tutkielman laadinta (16.7)
alternative label: Tieteellinen ajattelu, tieteenfilosofia (16.7)
alternative label: Tieteellinen kirjoittaminen, tieteellisen tutkimuksen laadinta ja tekniikka (16.7)
alternative label: Tieteen filosofia (16.7)
alternative label: Tieteen järjestelmät (16.7)
alternative label: Tieteen metodologia (16.7)
alternative label: Tieteen paradigmat (16.7)
alternative label: Tieteenfilosofia (16.7)
alternative label: Tohtorinväitöskirjat, laadinta (16.7)
alternative label: Tutkielman laadinta, tieteen metodit (16.7)
alternative label: Tutkijan työ (16.7)
alternative label: Tutkimusetiikka (16.7)
alternative label: Tutkimusmenetelmät (16.7)
alternative label: Tyttötutkimus, tutkimusmenetelmät (16.7)
alternative label: Viiteanalyysi (16.7)
alternative label: Väittely, tiede (16.7)
alternative label: Väitöskirjat, laadinta (16.7)
alternative label: Yleisötutkimus, tieteen metodit (16.7)
alternative label: systeemiajattelu (16.7)
broader: TIETOTEORIA. TIEDEOPPI
in scheme: YKL - Yleisten kirjastojen luokitusjärjestelmä
notation: 16.7
scope note: Hit allmän vetenskapsteori och vetenskapsfilosofi Metoder inom vetenskaplig forskning. Metodologi Författande av vetenskapliga avhandlingar De olika vetenskapernas system och inbördes förhållanden Indelning av vetenskaperna i olika områden Problemställning, axiom, hypoteser, modeller, lagar, regler och bevisföring inom vetenskapen Vetenskapens paradigmer Vetenskapens betydelse och värde som filosofisk fråga Systemstänkande i allmänhet. Systemstänkande inom specialområden klassificeras enligt område. Vetenskapsteori, forskningsmetoder och vetenskapsfilosofi inom specialområden klassificeras enligt område Om verket behandlar både vetenskapsteori och studieteknik, ges företräde åt klass 38.3 Formtillägget 01 används inte i samband med klasserna 16-16.7 @sv
scope note: Tähän yleinen tiedeoppi ja tieteenfilosofia Tieteellisen tutkimuksen menetelmät. Metodologia Tieteellisen tutkimuksen laadinta ja tekniikka Tieteiden järjestelmät, jaottelut ja keskinäiset suhteet Ongelmanasettelu, aksioomat, hypoteesit, mallit, lait, säännöt ja todistelu tieteessä Tieteen paradigmat Tieteen merkitys ja arvo filosofisena kysymyksenä Systeemiajattelu yleensä. Erikoisalojen systeemiajattelu luokitetaan alan mukaan. Erikoisalojen tiedeoppi, tutkimusmenetelmät ja tieteenfilosofia luokitetaan alan mukaan Jos teoksessa on sekä tiedeoppia että opiskelutekniikkaa, annetaan etusija luokalle 38.3 Muotoluokkaa 01 ei käytetä luokkien 16-16.7 yhteydessä

Tiedepolitiikka
type: Concept
References: YLEINEN KULTTUURIPOLITIIKKA
References: URN:NBN:fi:au:ykl:16.09
References: Tiedeoppi. Tieteenfilosofia
References: Tietokirjallisuuden historia ja tutkimus
type: YKL-luokka
alternative label: Beteendevetenskaper, vetenskapspolitik (16.8) @sv
alternative label: Censur, vetenskap (16.8) @sv
alternative label: Facklitteratur, popularisering av vetenskap (16.8) @sv
alternative label: Forskarutbildning (16.8) @sv
alternative label: Forskningsarbete, sociologi (16.8) @sv
alternative label: Forskningscentra (16.8) @sv
alternative label: Forskningspolitik (16.8) @sv
alternative label: Forskningsverksamhet (16.8) @sv
alternative label: Gender-tutkimus, tiedepolitiikka (16.8)
alternative label: Genderforskning, vetenskapspolitik (16.8) @sv
alternative label: Genusforskning, vetenskapspolitik (16.8) @sv
alternative label: Humanistiset tieteet, tiedepolitiikka (16.8)
alternative label: Humanistiska vetenskaper, vetenskapspolitik (16.8) @sv
alternative label: Humanvetenskaper, vetenskapspolitik (16.8) @sv
alternative label: Ihmistieteet, tiedepolitiikka (16.8)
alternative label: Kompetenscentra, vetenskapspolitik (16.8) @sv
alternative label: Kvinnoforskning, vetenskapspolitik (16.8) @sv
alternative label: Käyttäytymistieteet, tiedepolitiikka (16.8)
alternative label: Mansforskning, vetenskapspolitik (16.8) @sv
alternative label: Miestutkimus, tiedepolitiikka (16.8)
alternative label: Naistutkimus, tiedepolitiikka (16.8)
alternative label: Osaamiskeskukset, tiedepolitiikka (16.8)
alternative label: Popularisering av vetenskap (16.8) @sv
alternative label: Sananvapaus, tiede (16.8)
alternative label: Sensuuri, tiede (16.8)
alternative label: Sukupuolentutkimus, tiedepolitiikka (16.8)
alternative label: Sukupuolitutkimus, tiedepolitiikka (16.8)
alternative label: Tiedepolitiikka (16.8)
alternative label: Tiedeyhteisö (16.8)
alternative label: Tieteelliset tutkimuslaitokset (16.8)
alternative label: Tieteen popularisointi (16.8)
alternative label: Tieteen riippumattomuus (16.8)
alternative label: Tieteen sensuuri (16.8)
alternative label: Tieteen sosiologia (16.8)
alternative label: Tietokirjallisuus, tieteen popularisointi (16.8)
alternative label: Tutkijakoulutus (16.8)
alternative label: Tutkimuslaitokset (16.8)
alternative label: Tutkimuspolitiikka (16.8)
alternative label: Tutkimustoiminta (16.8)
alternative label: Tutkimustyö, sosiologia (16.8)
alternative label: Vetenskapens oavhängighet (16.8) @sv
alternative label: Vetenskapliga forskningsinstitutioner (16.8) @sv
alternative label: Vetenskapscensur (16.8) @sv
alternative label: Vetenskapspolitik (16.8) @sv
alternative label: Vetenskapssamfund (16.8) @sv
alternative label: Vetenskapssociologi (16.8) @sv
alternative label: Yttrandefrihet, vetenskap (16.8) @sv
broader: TIETOTEORIA. TIEDEOPPI
in scheme: YKL - Yleisten kirjastojen luokitusjärjestelmä
notation: 16.8
preferred label: Science policy @en
preferred label: Vetenskapspolitik @sv
scope note: Tiede- ja tutkimuspolitiikka yleensä Tieteellisen tutkimuksen organisaatio, rahoitus ja suuntaaminen Tieteen, tiedeyhteisön ja tutkimustyön sosiologia Tutkijakoulutus tiedepoliittisena kysymyksenä Sukupuolentutkimus. Naistutkimus. Miestutkimus Tieteen popularisointi Tieteen yhteiskunnallinen kontrolli Tieteen suhteet tuotantoon ja talouselämään Tieteen riippumattomuus. Tieteen sensurointi Monialaiset tiedekeskukset Erikoisalojen tiedepolitiikka luokitetaan alan mukaan
scope note: Vetenskaps- och forskningspolitik i allmänhet Organisation, finansiering och inriktning av vetenskaplig forskning Vetenskapens, det vetenskapliga samfundets och forskningsarbetets sociologi Forskarutbildning som vetenskapspolitisk fråga Genusforskning. Kvinnoforskning. Mansforskning Popularisering av vetenskap Samhällets kontroll av vetenskapen Vetenskapens förhållande till produktion och näringsliv Vetenskapens oavhängighet. Censur av vetenskap Vetenskapliga centra för många områden Vetenskapspolitik inom specialområden klassificeras enligt område @sv

ETIIKKA. ELÄMÄNFILOSOFIA. ESTETIIKKA
type: Concept
References: Historianfilosofia. Kulttuurifilosofia
type: YKL-luokka
alternative label: Elämänkatsomustieto (17+)
alternative label: Humanism, etik och livsfilosofi (17+) @sv
alternative label: Humanismi, etiikka ja elämänfilosofia (17+)
alternative label: Livsåskådningskunskap (17+) @sv
alternative label: Prometheus-leirit (17)
alternative label: Prometheus-läger (17) @sv
broader: FILOSOFIA. PSYKOLOGIA. RAJATIETO. TIEDEOPPI
in scheme: YKL - Yleisten kirjastojen luokitusjärjestelmä
narrower: Etiikka. Moraalifilosofia
narrower: Elämänfilosofia. Elämäntaito
narrower: Yleinen estetiikka
notation: 17
preferred label: ETHICS. PHILOSOPHY OF LIFE. AESTHETICS @en
preferred label: ETIK. LEVNADSFILOSOFI. ESTETIK @sv
scope note: Hit verk som innehåller både etik, estetik och levnadsfilosofi Verk som oavsett kulturkrets elller land innehåller etik, estetik och levnadsfilofi 17+ Läroböcker i livsåskådningskunskap 17.07 Formtillägget 01 används inte i samband med klasserna 17-17.5 @sv
scope note: Tähän teokset, joissa on sekä etiikkaa, estetiikkaa että elämänfilosofiaa Kulttuuripiiristä ja maasta riippumatta teokset, joissa on sekä etiikkaa, estetiikkaa että elämänfilosofiaa 17+ Elämänkatsomustiedon oppikirjat 17.07 Muotoluokkaa 01 ei käytetä luokien 17-17.5 yhteydessä

Etiikka. Moraalifilosofia
type: Concept
References: Mietelausekokoelmat. Sitaattikokoelmat
References: Elämänfilosofia. Elämäntaito
References: USKONNONFILOSOFIA
References: Kristillinen etiikka
References: Elämäntapojen sosiologia. Kulttuurisosiologia
References: Valtiofilosofia. Poliittiset ideologiat
References: Ihmisoikeudet. Kansalaisen asema yhteiskunnassa
References: Eläinsuojelu
References: URN:NBN:fi:au:ykl:59.01
References: Itsemurhat ja niiden ehkäisy
alternative label: Abort, etik, allm. (17.1) @sv
alternative label: Abortti, etiikka, yl. (17.1)
alternative label: Aksiologia, etiikka (17.1)
alternative label: Altruism, etik (17.1) @sv
alternative label: Altruismi, etiikka (17.1)
alternative label: Arvot, etiikka (17.1)
alternative label: Arvoteoria, etiikka (17.1)
alternative label: Avioero, etiikka (17.1)
alternative label: Avioliitto, etiikka (17.1)
alternative label: Avoliitto, etiikka (17.1)
alternative label: Axiologi, etik (17.1) @sv
alternative label: Eettiset arvot (17.1)
alternative label: Eettiset normit (17.1)
alternative label: Egoism, etik (17.1) @sv
alternative label: Egoismi, etiikka (17.1)
alternative label: Etiikka (17.1)
alternative label: Etik (17.1) @sv
alternative label: Etiska normer (17.1) @sv
alternative label: Etiska värden (17.1) @sv
alternative label: Eudaimonism, etik (17.1) @sv
alternative label: Eudaimonismi, etiikka (17.1)
alternative label: Familjeetik (17.1) @sv
alternative label: Filosofi, etik (17.1) @sv
alternative label: Filosofia, etiikka (17.1)
alternative label: Fri vilja, etik (17.1) @sv
alternative label: Förlovning, etik (17.1) @sv
alternative label: Geenitekniikka, etiikka (17.1)
alternative label: Genteknik, etik (17.1) @sv
alternative label: Godhet, moralfilosofi (17.1) @sv
alternative label: Gott och ont, etik (17.1) @sv
alternative label: Gruppäktenskap, etik (17.1) @sv
alternative label: Hedonism, etik (17.1) @sv
alternative label: Hedonismi, etiikka (17.1)
alternative label: Hyvyys, moraalifilosofia (17.1)
alternative label: Hyvä ja paha, etiikka (17.1)
alternative label: Hyötyetiikka (17.1)
alternative label: Ihmissuhteet, etiikka (17.1)
alternative label: Individualetik (17.1) @sv
alternative label: Kategorinen imperatiivi, etiikka (17.1)
alternative label: Kategoriskt imperativ, etik (17.1) @sv
alternative label: Kihlaus, etiikka (17.1)
alternative label: Mielialaetiikka (17.1)
alternative label: Moraali (17.1)
alternative label: Moraalifilosofia (17.1)
alternative label: Normit, etiikka (17.1)
alternative label: Oikeudenmukaisuusteoriat, etiikka (17.1)
alternative label: Oikeusteoriat, etiikka (17.1)
alternative label: Omatunto, moraalifilosofia (17.1)
alternative label: Pahuus, moraalifilosofia (17.1)
alternative label: Perhe-etiikka (17.1)
alternative label: Ryhmäavioliitto, etiikka (17.1)
alternative label: Seksuaalietiikka (17.1)
alternative label: Seurausetiikka (17.1)
alternative label: Siveysoppi (17.1)
alternative label: Sosiaalietiikka (17.1)
alternative label: Taipumusetiikka (17.1)
alternative label: Transhumanismi, etiikka (17.1)
alternative label: Utilitarismi, etiikka (17.1)
alternative label: Vapaa tahto, etiikka (17.1)
alternative label: Velvollisuusetiikka (17.1)
alternative label: Väkivalta, etiikka (17.1)
alternative label: Yhteiskuntaetiikka (17.1)
alternative label: Yhteiskuntavastuu (17.1)
alternative label: Yksilöetiikka (17.1)
broader: ETIIKKA. ELÄMÄNFILOSOFIA. ESTETIIKKA
in scheme: YKL - Yleisten kirjastojen luokitusjärjestelmä
notation: 17.1
scope note: Etiikka ja moraalifilosofia yleensä Moraali. Eettiset arvot ja normit Eettinen ja moraalinen kasvatus Eettinen arvoteoria. Oikeudenmukaisuusteoria Yksilö-, sosiaali-, perhe- ja seksuaalietiikka Ihmissuhteiden etiikka Elämän kunnioitus ja väkivalta eettisinä kysymyksinä Egoismi. Altruismi Tähän myös etiikan teoriat ja suuntaukset, kuten velvollisuus-, taipumus-, mieliala-, seuraus- ja hyötyetiikka Eri alojen eettiset kysymykset luokitetaan alan mukaan Muotoluokkaa 01 ei käytetä luokkien 17-17.5 yhteydessä
scope note: Etik och moralfilosofi i allmänhet Moral. Etiska värden och normer Etisk och moralisk fostran Etisk värdeteori. Rättviseteorier Individual-, social-, familje- och sexualetik De mänskliga relationernas etik Våld och respekten för livet som etiska frågor Egoism. Altruism Hit också etiska teorier och etiska inriktningar såsom plikt-, benägenhets-, sinnelags-, konsekvens- och nyttoetik Etiska frågor inom olika områden klassificeras enligt område Formtillägget 01 används inte i samband med klasserna 17-17.5 @sv

Elämänfilosofia. Elämäntaito
type: Concept
References: Mietelausekokoelmat. Sitaattikokoelmat
References: Persoonallisuuden psykologia
References: Ihmissuhteiden psykologia
References: Etiikka. Moraalifilosofia
References: Henkilökohtainen terveydenhoito
References: Mielenterveys. Tunne-elämän häiriöt
References: Kriisipsykologia. Katastrofipsykologia. Surutyö
alternative label: Beslutsfattning, levnadskonst (17.3) @sv
alternative label: Downshiftaus (17.3)
alternative label: Downshifting (17.3) @sv
alternative label: Egenmakt, levnadskonst (17.3) @sv
alternative label: Elämänfilosofia (17.3)
alternative label: Elämänhallinta (17.3)
alternative label: Elämänkatsomukset, filosofia (17.3)
alternative label: Elämänohjeet (17.3)
alternative label: Elämäntaito (17.3)
alternative label: Elämänviisaus (17.3)
alternative label: Empati, levnadsregler (17.3) @sv
alternative label: Empatia, elämänohjeet (17.3)
alternative label: Fatalism, livsfilosofi (17.3) @sv
alternative label: Fatalismi, elämänfilosofia (17.3)
alternative label: Filosofi, livsfilosofi (17.3) @sv
alternative label: Filosofia, elämänfilosofia (17.3)
alternative label: Fri vilja, livsfilosofi (17.3) @sv
alternative label: Henkinen hyvinvointi, elämäntaito (17.3)
alternative label: Ikääntyminen, elämänfilosofia (17.3)
alternative label: Irreligiositet, Världsåskådningsfilosofi (17.3) @sv
alternative label: Itsekasvatus (17.3)
alternative label: Itsensä kehittäminen (17.3)
alternative label: Itsetuntemus, elämäntaito (17.3)
alternative label: Kirjoittaminen, itsekasvatus 17.3
alternative label: Levnadskonst (17.3) @sv
alternative label: Levnadsregler (17.3) @sv
alternative label: Levnadsvisdom (17.3) @sv
alternative label: Livsfilosofi (17.3) @sv
alternative label: Livskompetens (17.3) @sv
alternative label: Livsåskådningar, filosofi (17.3) @sv
alternative label: Luonteenkasvatus, elämänohjeet (17.3)
alternative label: Lycka, livsfilosofi (17.3) @sv
alternative label: Maailmankatsomusfilosofia (17.3)
alternative label: Medveten närvaro, levnadskonst (17.3) @sv
alternative label: Mindfulness, elämäntaito (17.3)
alternative label: Mindfulness, levnadskonst (17.3) @sv
alternative label: Mindfulnessmeditation, levnadskonst (17.3) @sv
alternative label: Mindfulnessträning, levnadskonst (17.3) @sv
alternative label: NLP, elämäntaito (17.3)
alternative label: NLP, levnadskonst (17.3) @sv
alternative label: Neurolingvistinen ohjelmointi, elämäntaito (17.3)
alternative label: Neurolingvistisk programmering, levnadskonst (17.3) @sv
alternative label: Nudism, livsfilosofi (17.3) @sv
alternative label: Nudismi, elämänfilosofia (17.3)
alternative label: Onnellisuus, elämänfilosofia (17.3)
alternative label: Optimism, livsfilosofi (17.3) @sv
alternative label: Optimismi, elämänfilosofia (17.3)
alternative label: Personlighetsfostran, levnadsregler (17.3) @sv
alternative label: Pessimism, livsfilosofi (17.3) @sv
alternative label: Pessimismi, elämänfilosofia (17.3)
alternative label: Psykiskt välbefinnande, levnadskonst (17.3) @sv
alternative label: Päätöksenteko, elämäntaito (17.3)
alternative label: Retreater, levnadskonst (17.3) @sv
alternative label: Retriitit, elämäntaito (17.3)
alternative label: Sinnesnärvaro, levnadskonst (17.3) @sv
alternative label: Självfostran (17.3) @sv
alternative label: Självkännedom, levnadskonst (17.3) @sv
alternative label: Slow life (17.3)
alternative label: Slow living (17.3)
alternative label: Tiedostava läsnäolo, elämäntaito (17.3)
alternative label: Tietoinen läsnäolo, elämäntaito (17.3)
alternative label: Tietoisuustaidot, elämäntaito (17.3)
alternative label: Tietoisuustaito, elämäntaito (17.3)
alternative label: Uskonnottomuus, maailmankatsomusfilosofia (17.3)
alternative label: Vanheneminen, elämänfilosofia (17.3)
alternative label: Vapaa tahto, elämänfilosofia (17.3)
alternative label: Voimaantuminen, elämäntaito (17.3)
broader: ETIIKKA. ELÄMÄNFILOSOFIA. ESTETIIKKA
in scheme: YKL - Yleisten kirjastojen luokitusjärjestelmä
notation: 17.3
scope note: Elämänkatsomusfilosofia Elämänviisaus. Elämänohjeet Optimismi ja pessimismi elämänfilosofian kannalta Itsekasvatus. Itsensä kehittäminen Muotoluokkaa 01 ei käytetä luokkien 17-17.5 yhteydessä
scope note: Livsåskådningsfilosofi Levnadsvisdom. Levnadsråd Optimism och pessimism ur levnadsfilosofisk synvinkel Självuppfostran. Att utveckla sig själv Formtillägget 01 används inte i samband med klasserna 17-17.5 @sv

Yleinen estetiikka
type: Concept
References: Taiteen estetiikka
References: Kirjallisuuden estetiikka. Runousoppi
type: YKL-luokka
alternative label: Estetiikka (17.5)
alternative label: Estetik (17.5) @sv
alternative label: Fulhet, estetik (17.5) @sv
alternative label: Kauneus, estetiikka (17.5)
alternative label: Rumuus, estetiikka (17.5)
alternative label: Skönhet, estetik (17.5) @sv
broader: ETIIKKA. ELÄMÄNFILOSOFIA. ESTETIIKKA
in scheme: YKL - Yleisten kirjastojen luokitusjärjestelmä
notation: 17.5
preferred label: Allmän estetik @sv
preferred label: General aesthetics @en
scope note: Hit allmän estetisk teori om det skönas och det fulas problem både i konsten, i naturen och i kulturmiljön Estetik för speciella områden klassificeras enligt område Formtillägget 01 används inte i samband med klasserna 17-17.5 @sv
scope note: Tähän estetiikan yleinen teoria, joka koskee kauneuden ja rumuuden ongelmaa sekä taiteessa, luonnossa että kulttuuriympäristössä Erikoisalojen estetiikka luokitetaan alan mukaan Muotoluokkaa 01 ei käytetä luokkien 17-17.5 yhteydessä

USKONTO
type: Concept
type: YKL-luokka
in scheme: YKL - Yleisten kirjastojen luokitusjärjestelmä
narrower: YLEINEN USKONTOTIEDE
narrower: USKONNONFILOSOFIA
narrower: RAAMATTU. RAAMATUNTUTKIMUS
narrower: DOGMATIIKKA. KRISTILLINEN ETIIKKA
narrower: KRISTILLINEN HARTAUSKIRJALLISUUS
narrower: KÄYTÄNNÖLLINEN TEOLOGIA. KRISTINUSKO
narrower: KRISTILLINEN LÄHETYSTYÖ
narrower: KRISTILLISET KIRKOT JA YHTEISÖT. KIRKKOHISTORIA
narrower: MUUT USKONNOT JA MYTOLOGIAT
notation: 2
preferred label: RELIGION @en
top concept of: YKL - Yleisten kirjastojen luokitusjärjestelmä

YLEINEN USKONTOTIEDE
type: Concept
References: Symbolit. Koodit. Merkkijärjestelmät
References: RAJATIETO
References: Okkultismi. Spiritismi. Spiritualismi. Henkimaailma
References: USKONNONFILOSOFIA
References: RAAMATTU. RAAMATUNTUTKIMUS
References: DOGMATIIKKA. KRISTILLINEN ETIIKKA
References: KRISTILLINEN HARTAUSKIRJALLISUUS
References: KÄYTÄNNÖLLINEN TEOLOGIA. KRISTINUSKO
References: Kirkolliset esineet ja symbolit
References: KRISTILLINEN LÄHETYSTYÖ
References: KRISTILLISET KIRKOT JA YHTEISÖT. KIRKKOHISTORIA
References: MUUT USKONNOT JA MYTOLOGIAT
References: KANSATIEDE. KULTTUURIANTROPOLOGIA
References: Yleinen kulttuurihistoria
alternative label: Animism, religionsvetenskap, allm. (20) @sv
alternative label: Animismi, uskontotiede, yl. (20)
alternative label: Ceremonier, religionsvetenskap, allm. (20) @sv
alternative label: Demoner, religionsvetenskap, allm. (20) @sv
alternative label: Demonit, uskontotiede, yl. (20)
alternative label: Djävulen, religionsvetenskap, allm. (20) @sv
alternative label: Enkelit, uskontotiede, yl. (20)
alternative label: Esoterism, religionsvetenskap, allm. (20) @sv
alternative label: Esoterismi, uskontotiede, yl. (20)
alternative label: Fetischism, religionsvetenskap, allm. (20) @sv
alternative label: Fetisismi, uskontotiede, yl. (20)
alternative label: Fundamentalismi, uskonnot, yl. (20)
alternative label: Jumalaistarut, uskontotiede, yl. (20)
alternative label: Jumalat, uskontotiede, yl. (20)
alternative label: Jälleensyntyminen, uskontotiede, yl. (20)
alternative label: Kultit, uskontotiede, yl. (20)
alternative label: Kuolemanjälkeinen elämä, uskontotiede, yl. (20)
alternative label: Maailmanuskonnot, yl. (20)
alternative label: Magia, uskontotiede, yl. (20)
alternative label: Meditaatio, uskontopsykologia, yl. (20)
alternative label: Mietiskely, uskontopsykologia, yl. (20)
alternative label: Monoteismi, uskontotiede, yl. (20)
alternative label: Muinaisuskonnot, uskontotiede, yl. (20)
alternative label: Mytologiat, uskontotiede, yl. (20)
alternative label: Myytit, uskontotiede, yl. (20)
alternative label: Paholainen, uskontotiede, yl. (20)
alternative label: Panteismi, uskontotiede, yl. (20)
alternative label: Polyteismi, uskontotiede, yl. (20)
alternative label: Profetiat, uskontotiede, yl. (20)
alternative label: Pyhäinjäännökset, uskontotiede, yl. (20)
alternative label: Pyhät ajat, uskontotiede, yl. (20)
alternative label: Pyhät henkilöt, uskontotiede, yl. (20)
alternative label: Pyhät kirjat, uskontotiede, yl. (20)
alternative label: Pyhät paikat, uskontotiede, yl. (20)
alternative label: Reinkarnaatio, uskontotiede, yl. (20)
alternative label: Riitit, uskontotiede, yl. (20)
alternative label: Samanismi, uskontotiede, yl. (20)
alternative label: Seremoniat, uskontotiede, yl. (20)
alternative label: Shamanismi, uskontotiede, yl. (20)
alternative label: Sielu, uskontotiede, yl. (20)
alternative label: Sielunvaellus, uskontotiede, yl. (20)
alternative label: Symbolit, uskontotiede, yl. (20)
alternative label: Synkretismi (20)
alternative label: Tabut, uskontotiede, yl. (20)
alternative label: Taikuus, uskontotiede, yl. (20)
alternative label: Taruolennot, uskontotiede, yl. (20)
alternative label: Totemismi, uskontotiede, yl. (20)
alternative label: Uskonnollinen identiteetti, uskontososiologia, yl. (20)
alternative label: Uskonnolliset symbolit, yl. (20)
alternative label: Uskonnot, yl. (20)
alternative label: Uskonto, yl. (20)
alternative label: Uskontoantropologia, yl. (20)
alternative label: Uskontofenomenologia, yl. (20)
alternative label: Uskontokasvatus, yl. (20)
alternative label: Uskontopsykologia, yl. (20)
alternative label: Uskontososiologia, yl. (20)
alternative label: Uskontotiede, yl. (20)
alternative label: Vertaileva uskontotiede, yl. (20)
alternative label: Ympärileikkaus, uskontotiede, yl. (20)
broader: USKONTO
in scheme: YKL - Yleisten kirjastojen luokitusjärjestelmä
narrower: Kristinusko. Teologia
notation: 20
scope note: Allmän och jämförande religionsvetenskap Allmänna verk om religionsvetenskap Religioner i allmänhet. Mytologi i allmänhet Religionspsykologi. Religionssociologi Religionsantropologi. Religionsfenomenologi Komparativ mytforskning ur religionsvetenskaplig synvinkel Förhållandet mellan religioner. Synkretism Religiösa och religionslösa samfund ur religionsvetenskaplig synvinkel Gudar. Djävlar. Demoner Animism. Fetischism. Totemism. Schamanism Religiösa kulter, riter, ceremonier och tabun Heliga tider. Heliga platser. Heliga personer. Heliga böcker Religiösa symboler Verk som behandlar en viss religion hänförs till den ifrågavarande religionens klass Allmän religionshistoria 20.09 Formtillägget 01 används inte i samband med klasserna 20-26.5 och 28.1-29.9 @sv
scope note: Yleinen ja vertaileva uskontotiede Uskontotieteen yleisteokset Uskonnot yleensä. Mytologia yleensä Uskontopsykologia. Uskontososiologia Uskontoantropologia. Uskontofenomenologia Vertaileva myyttitutkimus uskontotieteen kannalta Uskontojen väliset suhteet. Synkretismi Uskonnolliset ja uskonnottomat yhteisöt uskontotieteen kannalta Jumaluudet. Paholaiset. Demonit Animismi. Fetisismi. Totemismi. Samanismi Uskonnolliset kultit, menot, seremoniat, riitit ja tabut Pyhät ajat. Pyhät paikat. Pyhät henkilöt. Pyhät kirjat Uskonnolliset symbolit Tiettyä uskontoa koskevat teokset luokitetaan ko. uskonnon luokkaan Yleinen uskontojen historia 20.09 Muotoluokkaa 01 ei käytetä luokkien 20-26.5 ja 28.1-29.9 yhteydessä

Kristinusko. Teologia
type: Concept
References: USKONNONFILOSOFIA
References: RAAMATTU. RAAMATUNTUTKIMUS
References: DOGMATIIKKA. KRISTILLINEN ETIIKKA
References: KRISTILLINEN HARTAUSKIRJALLISUUS
References: KÄYTÄNNÖLLINEN TEOLOGIA. KRISTINUSKO
References: KRISTILLINEN LÄHETYSTYÖ
References: KRISTILLISET KIRKOT JA YHTEISÖT. KIRKKOHISTORIA
References: URN:NBN:fi:au:ykl:28.09
type: YKL-luokka
alternative label: Alkukristillisyys (20.2)
alternative label: Esoterism, kristlig teologi (20.2) @sv
alternative label: Esoterismi, kristillinen teologia (20.2)
alternative label: Kristendom (20.2) @sv
alternative label: Kristendom, teologi (20.2) @sv
alternative label: Kristinusko (20.2)
alternative label: Kristinusko, teologia (20.2)
alternative label: Kvinnoteologi (20.2) @sv
alternative label: Mytologiat, kristinuskon (20.2)
alternative label: Mytologier, kristendom (20.2) @sv
alternative label: Naisteologia (20.2)
alternative label: Religion, kristendom (20.2) @sv
alternative label: Religioner, kristendom (20.2) @sv
alternative label: Religionsantropologi, kristendom (20.2) @sv
alternative label: Religionsfenomenologi, kristendom (20.2) @sv
alternative label: Religionsfilosofi, kristendom (20.2) @sv
alternative label: Religionspsykologi, kristendom (20.2) @sv
alternative label: Religionssociologi, kristendom (20.2) @sv
alternative label: Religiositet, kristendom (20.2) @sv
alternative label: Stigmatisaatio, uskontopsykologia (20.2)
alternative label: Stigmatisation, religionspsykologi (20.2) @sv
alternative label: Teologi (20.2) @sv
alternative label: Teologia (20.2)
alternative label: Tidig kristendom (20.2) @sv
alternative label: Urkristendom (20.2) @sv
alternative label: Uskonnollisuus, kristinusko (20.2)
alternative label: Uskonnonfilosofia, kristinusko (20.2)
alternative label: Uskonnot, kristinusko (20.2)
alternative label: Uskonto, kristinusko (20.2)
alternative label: Uskontoantropologia, kristinusko (20.2)
alternative label: Uskontofenomenologia, kristinusko (20.2)
alternative label: Uskontopsykologia, kristinusko (20.2)
alternative label: Uskontososiologia, kristinusko (20.2)
alternative label: Varhaiskristillisyys (20.2)
broader: YLEINEN USKONTOTIEDE
in scheme: YKL - Yleisten kirjastojen luokitusjärjestelmä
notation: 20.2
preferred label: Christianity. Theology @en
preferred label: Kristendom. Teologi @sv
scope note: Hit allmänna verk om kristendom, kristen teologi, kristen mytologi och kristen religionsfilosofi Hit också verk om kristen religionspsykologi, -sociologi, -antropologi och -fenomenologi samt verk om kristendomens förhållande till andra religioner Om tyngdpunkten i ett verk om kristendom ligger på något specialområde, ges oavsett kyrkosamfund eller samfund företräde åt klasserna 22-26+ Om ett verk om kristendom passar in såväl i klasserna för kyrkosamfund och kristna samfund som i ämnesklass, ges företräde åt ämnesklassen Formtillägget 01 används inte i samband med klasserna 20-26.5 och 28.1-29.9 @sv
scope note: Tähän kristinuskon, kristillisen teologian, kristillisen mytologian ja kristillisen uskonnonfilosofian yleisteokset Tähän myös kristinuskoa koskeva uskontopsykologia, -sosiologia, -antropologia ja -fenomenologia sekä kristinuskon suhteet muihin uskontoihin Jos kristinuskoa koskeva teos kuitenkin painottuu johonkin erikoisalaan, annetaan etusija kirkkokunnasta tai yhteisöstä riippumatta luokille 22-26+ Jos kristinuskoa koskeva teos sopii sekä kirkkokunnan tai kristillisen yhteisön että aiheen mukaiseen luokkaan, annetaan etusija aiheen mukaiselle luokalle Muotoluokkaa 01 ei käytetä luokkien 20-26.5 ja 28.1-29.9 yhteydessä

USKONNONFILOSOFIA
type: Concept
References: FILOSOFIA
References: Elämänfilosofia. Elämäntaito
References: YLEINEN USKONTOTIEDE
References: Kristinusko. Teologia
References: MUUT USKONNOT JA MYTOLOGIAT
alternative label: Agnosticism, religionsfilosofi (21) @sv
alternative label: Agnostisismi, uskonnonfilosofia (21)
alternative label: Ande, religionsfilosofi, allm. (21) @sv
alternative label: Ateism, religionsfilosofi (21) @sv
alternative label: Ateismi, uskonnonfilosofia (21)
alternative label: Deism, religionsfilosofi (21) @sv
alternative label: Deismi, uskonnonfilosofia (21)
alternative label: Döden, religionsfilosofi, allm. (21) @sv
alternative label: Elämä, uskonnonfilosofia, yl. (21)
alternative label: Elämänkatsomukset, uskonnonfilosofia, yl. (21)
alternative label: Esoterism, religionsfilosofi, allm. (21) @sv
alternative label: Esoterismi, uskonnonfilosofia, yl. (21)
alternative label: Etiikka, uskonnonfilosofia, yl. (21)
alternative label: Etik, religionsfilosofi, allm. (21) @sv
alternative label: Fatalism, religionsfilosofi, allm. (21) @sv
alternative label: Fatalismi, uskonnonfilosofia, yl. (21)
alternative label: Filosofi, religionsfilosofi, allm. (21) @sv
alternative label: Filosofia, uskonnonfilosofia, yl. (21)
alternative label: Fritänkeri (21) @sv
alternative label: Försyn, religionsfilosofi, allm. (21) @sv
alternative label: Gott och ont, religionsfilosofi, allm. (21) @sv
alternative label: Gud, religionsfilosofi, allm. (21) @sv
alternative label: Helvete, religionsfilosofi, allm. (21) @sv
alternative label: Helvetti, uskonnonfilosofia, yl. (21)
alternative label: Henki, uskonnonfilosofia, yl. (21)
alternative label: Hyvä ja paha, uskonnonfilosofia, yl. (21)
alternative label: Jumala, uskonnonfilosofia, yl. (21)
alternative label: Kaitselmus, uskonnonfilosofia, yl. (21)
alternative label: Kirkosta eroaminen, uskonnonfilosofia (21)
alternative label: Kreationism, religionsfilosofi, allm. (21) @sv
alternative label: Kreationismi, uskonnonfilosofia, yl. (21)
alternative label: Kuolema, uskonnonfilosofia, yl. (21)
alternative label: Kärsimys, uskonnonfilosofia, yl. (21)
alternative label: Lidande, religionsfilosofi, allm. (21) @sv
alternative label: Liv, religionsfilosofi, allm. (21) @sv
alternative label: Livsåskådningar, religionsfilosofi, allm. (21) @sv
alternative label: Luominen, uskonnonfilosofia, yl. (21)
alternative label: Luonnollinen teologia (21)
alternative label: Maailmanloppu, uskonnonfilosofia, yl. (21)
alternative label: Monoteism, religionsfilosofi, allm. (21) @sv
alternative label: Monoteismi, uskonnonfilosofia, yl. (21)
alternative label: Moraali, uskonnonfilosofia, yl. (21)
alternative label: Moral, religionsfilosofi, allm. (21) @sv
alternative label: Mystiikka, uskonnonfilosofia, yl. (21)
alternative label: Mystik, religionsfilosofi, allm. (21) @sv
alternative label: Naturlig teologi (21) @sv
alternative label: Panteism, religionsfilosofi, allm. (21) @sv
alternative label: Panteismi, uskonnonfilosofia, yl. (21)
alternative label: Polyteism, religionsfilosofi, allm. (21) @sv
alternative label: Polyteismi, uskonnonfilosofia, yl. (21)
alternative label: Religionsfilosofi, allm. (21) @sv
alternative label: Religionsfrihet, religionsfilosofi, allm. (21) @sv
alternative label: Religionskritik, allm. (21) @sv
alternative label: Religiositet, allm. (21) @sv
alternative label: Saatana, uskonnonfilosofia, yl. (21)
alternative label: Satan, religionsfilosofi, allm. (21) @sv
alternative label: Sielu, uskonnonfilosofia, yl. (21)
alternative label: Själ, religionsfilosofi, allm. (21) @sv
alternative label: Skapelse, religionsfilosofi, allm. (21) @sv
alternative label: Teism, religionsfilosofi, allm. (21) @sv
alternative label: Teismi, uskonnonfilosofia, yl. (21)
alternative label: Tro, religionsfilosofi, allm. (21) @sv
alternative label: Usko, uskonnonfilosofia, yl. (21)
alternative label: Uskonnollisuus, yl. (21)
alternative label: Uskonnonfilosofia, yl. (21)
alternative label: Uskonnonvapaus, uskonnonfilosofia, yl. (21)
alternative label: Uskontokritiikki, yl. (21)
alternative label: Vapaa-ajattelu (21)
broader: USKONTO
in scheme: YKL - Yleisten kirjastojen luokitusjärjestelmä
narrower: Teosofia
notation: 21
scope note: Hit allmän religionsfilosofi Religionen sedd ur filosofisk synvinkel Religiös livsåskådning och dess förhållande till kultur, vetenskap, konst, etik och samhällsliv Religionsfrihet Naturlig teologi. Mystik Deism. Teism. Panteism. Monoteism Ateism. Fritänkare Gud, livet, döden, skapelsen, försynen, det goda och det onda samt lidandet som allmänna religionsfilosofiska frågor Om ett verk gäller en given religions religionsfilosofi, hänförs det till ifrågavarande religions klass Formtillägget 01 används inte i samband med klasserna 20-26.5 och 28.1-29.9 @sv
scope note: Tähän yleinen uskonnonfilosofia Uskonnon filosofinen tarkastelu Uskonnollinen elämänkatsomus ja sen suhde kulttuuriin, tieteeseen, taiteeseen, etiikkaan ja yhteiskuntaelämään Uskonnonvapaus Luonnollinen teologia. Mystiikka Deismi. Teismi. Panteismi. Monoteismi Ateismi. Vapaa-ajattelu Jumala, elämä, kuolema, luominen, kaitselmus, hyvä ja paha sekä kärsimys yleisinä uskonnonfilosofisina kysymyksinä Tietyn uskonnon uskonnonfilosofia luokitetaan ko. uskonnon luokkaan Muotoluokkaa 01 ei käytetä luokkien 20-26.5 ja 28.1-29.9 yhteydessä

Teosofia
type: Concept
References: Okkultismi. Spiritismi. Spiritualismi. Henkimaailma
type: YKL-luokka
alternative label: Esoterism, teosofi (21.5) @sv
alternative label: Esoterismi, teosofia (21.5)
alternative label: Frimurare (21.5) @sv
alternative label: Jälleensyntyminen, teosofia (21.5)
alternative label: Kristosofi (21.5) @sv
alternative label: Kristosofia (21.5)
alternative label: Reinkarnaatio, teosofia (21.5)
alternative label: Reinkarnation, teosofi (21.5) @sv
alternative label: Rosenkreutzare (21.5) @sv
alternative label: Ruusuristiläisyys (21.5)
alternative label: Sielunvaellus, teosofia (21.5)
alternative label: Själavandring, teosofi (21.5) @sv
alternative label: Swedenborgianism (21.5) @sv
alternative label: Swedenborgilaisuus (21.5)
alternative label: Teosofi (21.5) @sv
alternative label: Teosofia (21.5)
alternative label: Vapaamuurarit (21.5)
broader: USKONNONFILOSOFIA
in scheme: YKL - Yleisten kirjastojen luokitusjärjestelmä
narrower: Antroposofia
notation: 21.5
preferred label: Teosofi @sv
preferred label: Theosophy @en
scope note: Hit också rosenkreutzare och kristosofi Hit också frimurare Formtillägget 01 används inte i samband med klasserna 20-26.5 och 28.1-29.9 @sv
scope note: Tähän myös ruusuristiläisyys ja kristosofia Tähän myös vapaamuurarit Muotoluokkaa 01 ei käytetä luokkien 20-26.5 ja 28.1-29.9 yhteydessä

Antroposofia
type: Concept
References: Erikois- ja kokeilukoulut
type: YKL-luokka
alternative label: Antroposofi (21.51) @sv
alternative label: Antroposofia (21.51)
alternative label: Esoterism, antroposofi (21.51) @sv
alternative label: Esoterismi, antroposofia (21.51)
alternative label: Steinerilaisuus (21.51)
alternative label: Steinerism (21.51) @sv
broader: Teosofia
in scheme: YKL - Yleisten kirjastojen luokitusjärjestelmä
notation: 21.51
preferred label: Anthroposophy @en
preferred label: Antroposofi @sv
scope note: Hit antroposofi och Steiners lära i allmänhet Formtillägget 01 används inte i samband med klasserna 20-26.5 och 28.1-29.9 @sv
scope note: Tähän antroposofia ja steinerilaisuus yleensä Muotoluokkaa 01 ei käytetä luokkien 20-26.5 ja 28.1-29.9 yhteydessä

RAAMATTU. RAAMATUNTUTKIMUS
type: Concept
References: KRISTILLINEN LÄHETYSTYÖ
type: YKL-luokka
alternative label: Bibelforskning (22+) @sv
alternative label: Bibeln (22+) @sv
alternative label: Bibeln, arkeologi (22+) @sv
alternative label: Bibeln, geografi (22+) @sv
alternative label: Bibeln, hela Bibeln (22) @sv
alternative label: Bibeln, historia (22+) @sv
alternative label: Bibeln, kommentarer (22+) @sv
alternative label: Bibeln, kritik (22+) @sv
alternative label: Bibelsyner (22+) @sv
alternative label: Bibelteologi (22+) @sv
alternative label: Biblisk historia (22+) @sv
alternative label: Bibliska berättelser (22+) @sv
alternative label: Eksegetiikka (22+)
alternative label: Exegetik (22+) @sv
alternative label: Heliga böcker, Bibeln (22+) @sv
alternative label: Heliga platser, biblisk historia (22+) @sv
alternative label: Israel, bibelhistoria (22+) @sv
alternative label: Israel, raamatunhistoria (22+)
alternative label: Judar, biblisk historia (22+) @sv
alternative label: Juutalaiset, raamatunhistoria (22+)
alternative label: Kristendom, Bibeln (22+) @sv
alternative label: Kristinusko, Raamattu (22+)
alternative label: Pyhät kirjat, Raamattu (22+)
alternative label: Pyhät paikat, raamatunhistoria (22+)
alternative label: Raamattu (22+)
alternative label: Raamattu, arkeologia (22+)
alternative label: Raamattu, historia (22+)
alternative label: Raamattu, koko Raamattu (22)
alternative label: Raamattu, kommentaarit (22+)
alternative label: Raamattu, kritiikki (22+)
alternative label: Raamattu, maantiede (22+)
alternative label: Raamattukäsitykset (22+)
alternative label: Raamatunhistoria (22+)
alternative label: Raamatunkertomukset (22+)
alternative label: Raamatunselitysoppi (22+)
alternative label: Raamatunteologia (22+)
alternative label: Raamatuntutkimus (22+)
alternative label: Teologi, bibelteologi (22+) @sv
alternative label: Teologia, raamatunteologia (22+)
broader: USKONTO
in scheme: YKL - Yleisten kirjastojen luokitusjärjestelmä
narrower: Vanha testamentti
narrower: Uusi testamentti
narrower: Raamatun henkilöt
notation: 22
preferred label: BIBELN. BIBELFORSKNING. EXEGETIK @sv
preferred label: THE BIBLE. BIBLICAL RESEARCH @en
scope note: Hit och till underklasserna bibelutgåvor, delar av Bibeln, biblisk historia, bibliska berättelser och bibelcitatsamlingar samt förklaringar och kommentarer till Bibeln Hit och till underklasserna också bibelforskning samt Bibelns geografi, arkeologi och historia Hit och till underklasserna också bibelteologi och olika bibeluppfattningar, såsom liberalteologisk, historisk-kritisk, biblicistisk och fundamentalistisk bibeluppfattning Allmänna bibliska uppslagsverk och bibelkonkordanser 22.03 Formtillägget 01 används inte i samband med klasserna 20-26.5 och 28.1-29.9 @sv
scope note: Tähän ja alaluokkiin Raamatut, Raamatun osat, raamatunhistoria, raamatunkertomukset ja raamatunlausekokoelmat sekä Raamatun selitysteokset ja kommentaarit Tähän ja alaluokkiin myös raamatuntutkimus eli eksegetiikka sekä Raamatun maantiede, arkeologia ja historia Tähän ja alaluokkiin myös raamatunteologia ja erilaiset raamattukäsitykset, kuten liberaaliteologinen, historialliskriittinen, raamatullinen ja fundamentalistinen raamattukäsitys Yleiset Raamatun hakuteokset ja konkordanssit 22.03 Muotoluokkaa 01 ei käytetä luokkien 20-26.5 ja 28.1-29.9 yhteydessä

Vanha testamentti
type: Concept
References: Raamatun henkilöt
type: YKL-luokka
alternative label: Apokryfikirjat, Vanha Testamentti (22.1)
alternative label: Apokryfiska böckerna, Nya testamentet (22.1) @sv
alternative label: Bibeln, Gamla Testamentet (22.1+) @sv
alternative label: Dödahavsfynd, biblisk historia (22.1) @sv
alternative label: Gamla Testamentet (22.1) @sv
alternative label: Gamla Testamentet, apokryfiska böckerna (22.1) @sv
alternative label: Gamla Testamentet, forskning (22.1+) @sv
alternative label: Intertestamentaariset tekstit (22.1)
alternative label: Intertestamentariska texter (22.1) @sv
alternative label: Kuolleenmeren löydöt, raamatunhistoria (22.1)
alternative label: Qumran, biblisk historia (22.1) @sv
alternative label: Qumran, raamatunhistoria (22.1)
alternative label: Raamattu, Vanha Testamentti (22.1+)
alternative label: Vanha Testamentti (22.1)
alternative label: Vanha Testamentti, apokryfikirjat (22.1)
alternative label: Vanha Testamentti, tutkimus (22.1+)
broader: RAAMATTU. RAAMATUNTUTKIMUS
in scheme: YKL - Yleisten kirjastojen luokitusjärjestelmä
narrower: Vanhan testamentin historialliset kirjat
narrower: Vanhan testamentin runolliset kirjat
narrower: Vanhan testamentin profeetalliset kirjat
notation: 22.1
preferred label: Gamla testamentet @sv
preferred label: Old Testament @en
scope note: Hit också Gamla testamentets apokryfer och övrig litteratur från den intertestamentariska tiden, t.ex. Dödahavsrullarna (Qumranfynden) Formtillägget 01 används inte i samband med klasserna 20-26.5 och 28.1-29.9 @sv
scope note: Tähän myös Vanhan testamentin apokryfikirjat ja intertestamentaarinen aika, esim. Qumranin löydöt Muotoluokkaa 01 ei käytetä luokkien 20-26.5 ja 28.1-29.9 yhteydessä

Vanhan testamentin historialliset kirjat
type: Concept
type: YKL-luokka
alternative label: Aikakirjat, Vanha Testamentti (22.11)
alternative label: Domarboken (22.11) @sv
alternative label: Esran kirja (22.11)
alternative label: Esras bok (22.11) @sv
alternative label: Esterin kirja (22.11)
alternative label: Esters bok (22.11) @sv
alternative label: Gamla Testamentet, historiska böckerna (22.11) @sv
alternative label: Historialliset kirjat, Vanha Testamentti (22.11)
alternative label: Historiska böckerna, Gamla Testamentet (22.11) @sv
alternative label: Joosuan kirja (22.11)
alternative label: Josuas bok (22.11) @sv
alternative label: Konungaböckerna, Gamla Testamentet (22.11) @sv
alternative label: Krönikeböckerna, Gamla Testamentet (22.11) @sv
alternative label: Kuningasten kirjat, Vanha Testamentti (22.11)
alternative label: Moosekset kirjat (22.11)
alternative label: Moseböckerna (22.11) @sv
alternative label: Nehemian kirja (22.11)
alternative label: Nehemjas bok (22.11) @sv
alternative label: Pentateuk (22.11) @sv
alternative label: Pentateukki (22.11)
alternative label: Ruts bok (22.11) @sv
alternative label: Ruutin kirja (22.11)
alternative label: Samuelin kirjat (22.11)
alternative label: Samuels böcker (22.11) @sv
alternative label: Tuomarien kirja (22.11)
alternative label: Vanha Testamentti, historialliset kirjat (22.11)
broader: Vanha testamentti
in scheme: YKL - Yleisten kirjastojen luokitusjärjestelmä
notation: 22.11
preferred label: Gamla testamentets historiska böcker @sv
preferred label: Old Testament historical books @en
scope note: Mooseksen, Joosuan, Tuomarien, Ruutin ja Samuelin kirjat Kuningasten kirjat. Aikakirjat Esran, Nehemian ja Esterin kirjat Muotoluokkaa 01 ei käytetä luokkien 20-26.5 ja 28.1-29.9 yhteydessä
scope note: Moseböckerna, Josua, Domarboken, Ruth och Samuel Konungaböckerna. Krönikeböckerna Esra, Nehemja och Ester Formtillägget 01 används inte i samband med klasserna 20-26.5 och 28.1-29.9 @sv

Vanhan testamentin runolliset kirjat
type: Concept
type: YKL-luokka
alternative label: Gamla Testamentet, poetiska böckerna (22.12) @sv
alternative label: Höga visan (22.12) @sv
alternative label: Jobin kirja (22.12)
alternative label: Jobs bok (22.12) @sv
alternative label: Korkea veisu (22.12)
alternative label: Laulujen laulu (22.12)
alternative label: Ordspråksboken, Gamla Testamentet (22.12) @sv
alternative label: Poetiska böckerna, Gamla Testamentet (22.12) @sv
alternative label: Predikaren, Gamla Testamentet (22.12) @sv
alternative label: Psalmer, Gamla Testamentet (22.12) @sv
alternative label: Psalmit, Vanha Testamentti (22.12)
alternative label: Runolliset kirjat, Vanha Testamentti (22.12)
alternative label: Saarnaaja, Vanha Testamentti (22.12)
alternative label: Sananlaskut, Vanha Testamentti (22.12)
alternative label: Vanha Testamentti, runolliset kirjat (22.12)
broader: Vanha testamentti
in scheme: YKL - Yleisten kirjastojen luokitusjärjestelmä
notation: 22.12
preferred label: Gamla testamentets poetiska böcker @sv
preferred label: Old Testament poetical books @en
scope note: Job. Psaltaren. Ordspråksboken. Predikaren. Höga visan Formtillägget 01 används inte i samband med klasserna 20-26.5 och 28.1-29.9 @sv
scope note: Jobin kirja. Psalmit. Sananlaskut. Saarnaaja. Laulujen laulu eli Korkea veisu Muotoluokkaa 01 ei käytetä luokkien 20-26.5 ja 28.1-29.9 yhteydessä

Vanhan testamentin profeetalliset kirjat
type: Concept
type: YKL-luokka
alternative label: Aamoksen kirja (22.13)
alternative label: Amos bok (22.13) @sv
alternative label: Danielin kirja (22.13)
alternative label: Daniels bok (22.13) @sv
alternative label: Gamla Testamentet, profetiska böckerna (22.13) @sv
alternative label: Habackuks bok (22.13) @sv
alternative label: Habakukin kirja (22.13)
alternative label: Haggain kirja (22.13)
alternative label: Haggais bok (22.13) @sv
alternative label: Hesekielin kirja (22.13)
alternative label: Hesekiels bok (22.13) @sv
alternative label: Hoosean kirja (22.13)
alternative label: Hoseas bok (22.13) @sv
alternative label: Jeremian kirja (22.13)
alternative label: Jeremias bok (22.13) @sv
alternative label: Jesajan kirja (22.13)
alternative label: Jesajas bok (22.13) @sv
alternative label: Joels bok (22.13) @sv
alternative label: Jonas bok (22.13) @sv
alternative label: Jooelin kirja (22.13)
alternative label: Joonan kirja (22.13)
alternative label: Klagovisorna, Gamla Testamentet (22.13) @sv
alternative label: Malakian kirja (22.13)
alternative label: Malakis bok (22.13) @sv
alternative label: Miikan kirja (22.13)
alternative label: Mikas bok (22.13) @sv
alternative label: Naahumin kirja (22.13)
alternative label: Nahums bok (22.13) @sv
alternative label: Obadjan kirja (22.13)
alternative label: Obadjas bok (22.13) @sv
alternative label: Profeetalliset kirjat, Vanha Testamentti (22.13)
alternative label: Profetiat, Vanha Testamentti (22.13)
alternative label: Profetior, Gamla Testamentet (22.13) @sv
alternative label: Profetiska böckerna, Gamla Testamentet (22.13) @sv
alternative label: Sakarjan kirja (22.13)
alternative label: Sakarjas bok (22.13) @sv
alternative label: Sefanjan kirja (22.13)
alternative label: Sefanjas bok (22.13) @sv
alternative label: Valitusvirret, Vanha Testamentti (22.13)
alternative label: Vanha Testamentti, profeetalliset kirjat (22.13)
broader: Vanha testamentti
in scheme: YKL - Yleisten kirjastojen luokitusjärjestelmä
notation: 22.13
preferred label: Gamla testamentets profetiska böcker @sv
preferred label: Old Testament prophetic books @en
scope note: Jesaja. Jeremia. Klagovisorna Hesekiel, Daniel, Hosea, Joel, Amos, Obadja, Jona, Mika, Nahum, Habackuk, Sefanja, Haggai, Sakarja och Malaki Formtillägget 01 används inte i samband med klasserna 20-26.5 och 28.1-29.9 @sv
scope note: Jesajan kirja. Jeremian kirja. Valitusvirret Hesekielin, Danielin, Hoosean, Jooelin, Aamoksen, Obadjan, Joonan, Miikan, Naahumin, Habakukin, Sefanjan, Haggain, Sakarjan ja Malakian kirjat Muotoluokkaa 01 ei käytetä luokkien 20-26.5 ja 28.1-29.9 yhteydessä

Uusi testamentti
type: Concept
References: Raamatun henkilöt
References: Kristologia. Jeesuksen elämä
type: YKL-luokka
alternative label: Apokryfikirjat, Uusi Testamentti (22.2)
alternative label: Apokryfiska böckerna, Gamla testamentet (22.2) @sv
alternative label: Apostoliset isät (22.2)
alternative label: Apostoliska fäderna (22.2) @sv
alternative label: Bibeln, Nya Testamentet (22.2+) @sv
alternative label: Nya Testamentet (22.2) @sv
alternative label: Nya Testamentet, apokryfiska böckerna (22.2) @sv
alternative label: Nya Testamentet, apostoliska fäderna (22.2) @sv
alternative label: Nya Testamentet, forskning (22.2+) @sv
alternative label: Raamattu, Uusi Testamentti (22.2+)
alternative label: Uusi Testamentti (22.2)
alternative label: Uusi Testamentti, apokryfikirjat (22.2)
alternative label: Uusi Testamentti, apostoliset isät (22.2)
alternative label: Uusi Testamentti, tutkimus (22.2+)
broader: RAAMATTU. RAAMATUNTUTKIMUS
in scheme: YKL - Yleisten kirjastojen luokitusjärjestelmä
narrower: Evankeliumit
narrower: Apostolien teot. Apostolien kirjeet
notation: 22.2
preferred label: New Testament @en
preferred label: Nya testamentet @sv
scope note: Hit också Nya testamentets apokryfer samt de apostoliska fäderna Formtillägget 01 används inte i samband med klasserna 20-26.5 och 28.1-29.9 @sv
scope note: Tähän myös Uuden testamentin apokryfikirjat sekä apostoliset isät Muotoluokkaa 01 ei käytetä luokkien 20-26.5 ja 28.1-29.9 yhteydessä

Evankeliumit
type: Concept
References: Kristologia. Jeesuksen elämä
type: YKL-luokka
alternative label: Bergspredikan (22.21) @sv
alternative label: Evangelierna (22.21) @sv
alternative label: Evankeliumit (22.21)
alternative label: Johanneksen evankeliumi (22.21)
alternative label: Johannesevangeliet (22.21) @sv
alternative label: Lukasevangeliet (22.21) @sv
alternative label: Luukkaan evankeliumi (22.21)
alternative label: Markuksen evankeliumi (22.21)
alternative label: Markusevangeliet (22.21) @sv
alternative label: Matteuksen evankeliumi (22.21)
alternative label: Matteusevangeliet (22.21) @sv
alternative label: Nya Testamentet, evangelierna (22.21) @sv
alternative label: Uusi Testamentti, evankeliumit (22.21)
alternative label: Vuorisaarna (22.21)
broader: Uusi testamentti
in scheme: YKL - Yleisten kirjastojen luokitusjärjestelmä
notation: 22.21
preferred label: Evangelierna @sv
preferred label: Gospels @en
scope note: Matteuksen, Markuksen, Luukkaan ja Johanneksen evankeliumit Muotoluokkaa 01 ei käytetä luokkien 20-26.5 ja 28.1-29.9 yhteydessä
scope note: Matteus, Markus, Lukas och Johannes evangelier Formtillägget 01 används inte i samband med klasserna 20-26.5 och 28.1-29.9 @sv

Apostolien teot. Apostolien kirjeet
type: Concept
type: YKL-luokka
alternative label: Apostlagärningarna (22.22) @sv
alternative label: Apostolien teot (22.22)
alternative label: Apostoliset kirjeet (22.22)
alternative label: Apostoliska breven (22.22) @sv
alternative label: Hebreerbrevet (22.22) @sv
alternative label: Heprealaiskirje (22.22)
alternative label: Ilmestyskirja (22.22)
alternative label: Johanneksen ilmestys (22.22)
alternative label: Johannes uppenbarelse (22.22) @sv
alternative label: Katoliset kirjeet (22.22)
alternative label: Katolska breven (22.22) @sv
alternative label: Nya Testamentet, Apostlagärningarna (22.22) @sv
alternative label: Nya Testamentet, Johannes uppenbarelse (22.22) @sv
alternative label: Nya Testamentet, apostlabreven (22.22) @sv
alternative label: Paavalin kirjeet (22.22)
alternative label: Pauli brev (22.22) @sv
alternative label: Uppenbarelseboken (22.22) @sv
alternative label: Uusi Testamentti, Johanneksen ilmestys (22.22)
alternative label: Uusi Testamentti, apostolien teot (22.22)
alternative label: Uusi Testamentti, apostoliset kirjeet (22.22)
alternative label: Uusi Testementti, apostolien teot (22.22)
broader: Uusi testamentti
in scheme: YKL - Yleisten kirjastojen luokitusjärjestelmä
notation: 22.22
preferred label: Acts of the Apostles. Epistles @en
preferred label: Apostlagärningarna. Apostlabreven @sv
scope note: Paavalin kirjeet. Heprealaiskirje. Katoliset kirjeet Tähän myös Johanneksen ilmestys Muotoluokkaa 01 ei käytetä luokkien 20-26.5 ja 28.1-29.9 yhteydessä
scope note: Pauli brev. Hebreerbrevet. De katolska breven Hit också Johannes uppenbarelse Formtillägget 01 används inte i samband med klasserna 20-26.5 och 28.1-29.9 @sv

Raamatun henkilöt
type: Concept
References: RAAMATTU. RAAMATUNTUTKIMUS
References: Kristologia. Jeesuksen elämä
type: YKL-luokka
alternative label: Apostlarna, bibliska personer (22.3) @sv
alternative label: Apostolit, Raamatun henkilöt (22.3)
alternative label: Bibeln, personer (22.3) @sv
alternative label: Bibliska personer (22.3) @sv
alternative label: Gamla Testamentet, personer (22.3) @sv
alternative label: Heliga personer, bibliska personer (22.3+) @sv
alternative label: Johannes Döparen, bibliska personer (22.3) @sv
alternative label: Johannes Kastaja, Raamatun henkilöt (22.3)
alternative label: Johannes, Raamatun henkilöt (22.3)
alternative label: Johannes, bibliska personer (22.3) @sv
alternative label: Jungfru Maria, bibliska personer (22.3) @sv
alternative label: Lukas, bibliska personer (22.3) @sv
alternative label: Luukas, Raamatun henkilöt (22.3)
alternative label: Lärjungar, bibliska personer (22.3) @sv
alternative label: Markus, Raamatun henkilöt (22.3)
alternative label: Markus, bibliska personer (22.3) @sv
alternative label: Matteus, Raamatun henkilöt (22.3)
alternative label: Matteus, bibliska personer (22.3) @sv
alternative label: Neitsyt Maria, Raamatun henkilöt (22.3)
alternative label: Nya Testamentet, personer (22.3+) @sv
alternative label: Opetuslapset, Raamatun henkilöt (22.3)
alternative label: Paavali, Raamatun henkilöt (22.3)
alternative label: Patriarkat, Raamatun henkilöt (22.3)
alternative label: Patriarker, bibliska personer (22.3) @sv
alternative label: Paulus, bibliska personer (22.3) @sv
alternative label: Petrus, bibliska personer (22.3) @sv
alternative label: Pietari, Raamatun henkilöt (22.3)
alternative label: Profeetat, Raamatun henkilöt (22.3)
alternative label: Profeter, bibliska personer (22.3) @sv
alternative label: Pyhät henkilöt, Raamatun henkilöt (22.3+)
alternative label: Raamattu, henkilöt (22.3)
alternative label: Raamatun henkilöt (22.3)
alternative label: Uusi Testamentti, henkilöt (22.3+)
alternative label: Vanha Testamentti, henkilöt (22.3)
broader: RAAMATTU. RAAMATUNTUTKIMUS
in scheme: YKL - Yleisten kirjastojen luokitusjärjestelmä
notation: 22.3
preferred label: Biblical persons @en
preferred label: Bibliska personer @sv
scope note: Hit verk som behandlar personer ur Gamla och Nya testamentet, deras liv, levnadshistorier eller historiska existens Formtillägget 01 används inte i samband med klasserna 20-26.5 och 28.1-29.9 @sv
scope note: Tähän Vanhan ja Uuden testamentin henkilöitä, heidän elämäänsä, elämäntarinoitaan tai historiallista todellisuuttaan koskevat teokset Muotoluokkaa 01 ei käytetä luokkien 20-26.5 ja 28.1-29.9 yhteydessä

DOGMATIIKKA. KRISTILLINEN ETIIKKA
type: Concept
References: Kristinusko. Teologia
References: Sakramentit. Kirkolliset toimitukset
type: YKL-luokka
alternative label: Apologetiikka (23+)
alternative label: Apologetik (23+) @sv
alternative label: Apologiat (23+)
alternative label: Apologier (23+) @sv
alternative label: Dogmatiikka, kristillinen (23+)
alternative label: Dogmatik, kristen (23+) @sv
alternative label: Ecklesiologi (23) @sv
alternative label: Ekklesiologia (23)
alternative label: Kirkko, kristillinen dogmatiikka (23)
alternative label: Kirkko-oppi, kristillinen dogmatiikka (23)
alternative label: Kristendom, apologetik (23+) @sv
alternative label: Kristendom, dogmatik (23+) @sv
alternative label: Kristinusko, apologetiikka (23+)
alternative label: Kristinusko, dogmatiikka (23+)
alternative label: Kyrkan, kristen dogmatik (23) @sv
alternative label: Kyrkolära, kristen dogmatik (23) @sv
alternative label: Patristiikka (23+)
alternative label: Patristik (23+) @sv
alternative label: Pyhäinjäännökset, kristilliset (23)
alternative label: Reliker, kristna (23) @sv
alternative label: Teologi, dogmatik (23+) @sv
alternative label: Teologia, dogmatiikka (23+)
alternative label: Uskonoppi, kristillinen (23+)
broader: USKONTO
in scheme: YKL - Yleisten kirjastojen luokitusjärjestelmä
narrower: Jumala-käsite. Jumalan toiminta
narrower: Kristologia. Jeesuksen elämä
narrower: Pelastusoppi
narrower: Eskatologia
narrower: Uskontunnustukset. Katekismukset
narrower: Kristillinen etiikka
notation: 23
preferred label: CHRISTIAN DOGMATICS. CHRISTIAN ETHICS @en
preferred label: DOGMATIK. KRISTEN ETIK @sv
scope note: Hit och till underklasserna oavsett kyrkosamfund eller kristet samfund kristendomens dogmatik (trossatser), apologetik (försvaret av den kristna förkunnelsen), kristna reliker samt patristik Allmän dogmhistoria 23.09 Formtillägget 01 används inte i samband med klasserna 20-26.5 och 28.1-29.9 @sv
scope note: Tähän ja alaluokkiin kirkkokunnasta tai kristillisestä yhteisöstä riippumatta kristinuskon dogmatiikka eli uskonoppi, kristinuskon puolustus eli apologetiikka, kristilliset pyhäinjäännökset sekä patristiikka Yleinen dogmihistoria 23.09 Muotoluokkaa 01 ei käytetä luokkien 20-26.5 ja 28.1-29.9 yhteydessä

Jumala-käsite. Jumalan toiminta
type: Concept
References: Parapsykologia
References: MUUT USKONNOT JA MYTOLOGIAT
type: YKL-luokka
alternative label: Ande, kristen dogmatik (23.1) @sv
alternative label: Arkkienkelit, kristinusko (23.1)
alternative label: Armolahjat, kristinusko (23.1)
alternative label: Buden, kristendom (23.1) @sv
alternative label: Dekalog (23.1) @sv
alternative label: Dekalogi (23.1)
alternative label: Demoner, kristendom (23.1) @sv
alternative label: Demonit, kristinusko (23.1)
alternative label: Djävulen, kristendom (23.1) @sv
alternative label: Enkelit, kristinusko (23.1)
alternative label: Ennustukset, kristinusko (23.1)
alternative label: Försyn, kristendom (23.1) @sv
alternative label: Förutsägelser, kristendom (23.1) @sv
alternative label: Gud, kristendom (23.1) @sv
alternative label: Helbrägdagörelse, kristendom (23.1) @sv
alternative label: Helige Ande, den (23.1) @sv
alternative label: Henki, kristillinen dogmatiikka (23.1)
alternative label: Ihmeet, kristinusko (23.1)
alternative label: Ihmeparannus, kristinusko (23.1)
alternative label: Jumala, kristinusko (23.1)
alternative label: Kaitselmus, kristinusko (23.1)
alternative label: Kielilläpuhuminen, kristinusko (23.1)
alternative label: Kolminaisuusoppi, kristinusko (23.1)
alternative label: Kreationism, kristendom (23.1) @sv
alternative label: Kreationismi, kristinusko (23.1)
alternative label: Kymmenen käskyä (23.1)
alternative label: Käskyt, kristinusko (23.1)
alternative label: Luominen, kristinusko (23.1)
alternative label: Monoteism, kristendom (23.1) @sv
alternative label: Monoteismi, kristinusko (23.1)
alternative label: Nådegåvor, kristendom (23.1) @sv
alternative label: Paholainen, kristinusko (23.1)
alternative label: Pneumatiikka, kristillinen dogmatiikka (23.1)
alternative label: Pneumatik, kristen dogmatik (23.1) @sv
alternative label: Profeterande, kristendom (23.1) @sv
alternative label: Profetiat, kristillinen dogmatiikka (23.1)
alternative label: Profetior, kristen dogmatik (23.1) @sv
alternative label: Profetointi, kristinusko (23.1)
alternative label: Pyhä Henki (23.1)
alternative label: Saatana, kristinusko (23.1)
alternative label: Satan, kristendom (23.1) @sv
alternative label: Skapelse, kristendom (23.1) @sv
alternative label: Tio Guds bud (23.1) @sv
alternative label: Treenighetslära, kristendom (23.1) @sv
alternative label: Tungomålstalande, kristendom (23.1) @sv
alternative label: Under, kristendom (23.1) @sv
alternative label: Änglar, kristendom (23.1) @sv
alternative label: Ärkeänglar, kristendom (23.1) @sv
broader: DOGMATIIKKA. KRISTILLINEN ETIIKKA
in scheme: YKL - Yleisten kirjastojen luokitusjärjestelmä
notation: 23.1
preferred label: Concept of God. Work of God @en
preferred label: Gudsbegreppet. Guds verksamhet @sv
scope note: Kolminaisuus. Isä. Poika. Pyhä Henki Jumalan olemassaolo. Jumalatodistukset Jumalan toiminta. Jumalan ilmoitus. Jumalan laki Luominen. Kaitselmus. Armolahjat Enkelit, Saatana ja demonit kristinuskon kannalta Ihmeet, ihmeparannukset, ennustukset, profetointi ja kielilläpuhuminen kristilliseltä kannalta Muotoluokkaa 01 ei käytetä luokkien 20-26.5 ja 28.1-29.9 yhteydessä
scope note: Treenigheten. Fadern. Sonen. Den Helige Ande Guds existens. Gudsbevis Guds verksamhet. Guds uppenbarelse. Guds lag Skapelsen. Försynen. Nådegåvor Änglar, Satan och demonerna ur kristendomens synvinkel Under, helbrägdagörelse genom under, förutsägelser, profeterande och tungomålstalande ur kristen synvinkel Formtillägget 01 används inte i samband med klasserna 20-26.5 och 28.1-29.9 @sv

Kristologia. Jeesuksen elämä
type: Concept
References: Evankeliumit
References: Raamatun henkilöt
References: Jumala-käsite. Jumalan toiminta
References: Pelastusoppi
type: YKL-luokka
alternative label: Bibeln, personer, Jesus (23.2) @sv
alternative label: Bibliska personer, Jesus Kristus (23.2) @sv
alternative label: Bibliska personer, Jungfru Maria (23.2) @sv
alternative label: Ihmiseksi tuleminen, kristologia (23.2)
alternative label: Jeesuksen elämä (23.2)
alternative label: Jeesus (23.2)
alternative label: Jeesus Kristus, dogmatiikka (23.2)
alternative label: Jesu liv (23.2) @sv
alternative label: Jesus (23.2) @sv
alternative label: Jesus Kristus, dogmatik (23.2) @sv
alternative label: Jungfru Maria, dogmatik (23.2) @sv
alternative label: Kristi liv (23.2) @sv
alternative label: Kristologi (23.2) @sv
alternative label: Kristologia (23.2)
alternative label: Kristuksen elämä (23.2)
alternative label: Kristus (23.2)
alternative label: Kristus, dogmatiikka (23.2)
alternative label: Kristus, dogmatik (23.2) @sv
alternative label: Kärsimys, kristologia (23.2)
alternative label: Lidande, kristologi (23.2) @sv
alternative label: Lunastustyö, kristologia (23.2)
alternative label: Mariologi (23.2) @sv
alternative label: Mariologia (23.2)
alternative label: Messias, Jeesuksen elämä (23.2)
alternative label: Messias, Jesu liv (23.2) @sv
alternative label: Messias, dogmatiikka (23.2)
alternative label: Messias, dogmatik (23.2) @sv
alternative label: Människoblivande, kristologi (23.2) @sv
alternative label: Neitsyt Maria, dogmatiikka (23.2)
alternative label: Raamattu, henkilöt, Jeesus (23.2)
alternative label: Raamatun henkilöt, Jeesus Kristus (23.2)
alternative label: Raamatun henkilöt, Neitsyt Maria (23.2)
alternative label: Uppståndelse, kristologi (23.2) @sv
alternative label: Ylösnousemus, kristologia (23.2)
alternative label: Återlösningsverk, kristologi (23.2) @sv
broader: DOGMATIIKKA. KRISTILLINEN ETIIKKA
in scheme: YKL - Yleisten kirjastojen luokitusjärjestelmä
notation: 23.2
preferred label: Christology. Life of Jesus @en
preferred label: Kristologi. Jesu liv @sv
scope note: Kristus. Messias. Jeesus Kristuksen persoona, lunastustyö, ihmiseksi tuleminen, kärsimys ja ylösnousemus kristillisen opin kannalta Tähän myös Jeesuksen henkilöä, elämää, elämäntarinaa tai historiallista todellisuutta koskevat teokset Tähän myös mariologia. Neitsyt Maria Muotoluokkaa 01 ei käytetä luokkien 20-26.5 ja 28.1-29.9 yhteydessä
scope note: Kristus. Messias. Jesus Kristi person, återlösningsverk, människoblivande, lidande och uppståndelse ur den kristna lärans synvinkel Hit även verk som behandlar Jesu person, liv, levnadshistoria eller historiska existens Hit också mariologi. Jungfru Maria Formtillägget 01 används inte i samband med klasserna 20-26.5 och 28.1-29.9 @sv

Pelastusoppi
type: Concept
References: Kristologia. Jeesuksen elämä
type: YKL-luokka
alternative label: Armo, kristillinen dogmatiikka (23.3)
alternative label: Arvsynden, kristen dogmatik (23.3) @sv
alternative label: Bot, kristen dogmatik (23.3) @sv
alternative label: Ennaltamääräämisoppi, kristillinen dogmatiikka (23.3)
alternative label: Fri vilja, kristen dogmatik (23.3) @sv
alternative label: Frälsning, kristen dogmatik (23.3) @sv
alternative label: Försoningslära, kristen dogmatik (23.3) @sv
alternative label: Ihminen, kristillinen dogmatiikka (23.3)
alternative label: Katumus, kristillinen dogmatiikka (23.3)
alternative label: Kristen antropologi, dogmatik (23.3) @sv
alternative label: Kristillinen antropologia, dogmatiikka (23.3)
alternative label: Människan, kristen dogmatik (23.3) @sv
alternative label: Nåd, kristen dogmatik (23.3) @sv
alternative label: Parannus, kristillinen dogmatiikka (23.3)
alternative label: Pelastus, kristillinen dogmatiikka (23.3)
alternative label: Perisynti, kristillinen dogmatiikka (23.3)
alternative label: Predestinaatio-oppi, kristillinen dogmatiikka (23.3)
alternative label: Predestinationslära, kristen dogmatik (23.3) @sv
alternative label: Rättfärdiggörelse, kristen dogmatik (23.3) @sv
alternative label: Soteriologi (23.3) @sv
alternative label: Soteriologia (23.3)
alternative label: Sovitusoppi, kristillinen dogmatiikka (23.3)
alternative label: Synd, kristen dogmatik (23.3) @sv
alternative label: Syndafallet, kristen dogmatik (23.3) @sv
alternative label: Synti, kristillinen dogmatiikka (23.3)
alternative label: Syntiinlankeemus, kristillinen dogmatiikka (23.3)
alternative label: Tahdonvapaus, kristillinen dogmatiikka (23.3)
alternative label: Tro, kristen dogmatik (23.3) @sv
alternative label: Usko, kristillinen dogmatiikka (23.3)
alternative label: Vanhurskauttaminen, kristillinen dogmatiikka (23.3)
alternative label: Vapaa tahto, kristillinen dogmatiikka (23.3)
alternative label: Viljans frihet, kristen dogmatik (23.3) @sv
alternative label: Ånger, kristen dogmatik (23.3) @sv
broader: DOGMATIIKKA. KRISTILLINEN ETIIKKA
in scheme: YKL - Yleisten kirjastojen luokitusjärjestelmä
narrower: Kääntymys. Uskoon tuleminen. Uskonelämä
notation: 23.3
preferred label: Frälsningslära @sv
preferred label: Soteriology @en
scope note: Ihmisen olemus kristinuskon kannalta Syntiinlankeemus. Perisynti. Synti. Armo Vanhurskauttaminen. Usko. Katumus. Parannus Vapaa tahto. Predestinaatio-oppi Muotoluokkaa 01 ei käytetä luokkien 20-26.5 ja 28.1-29.9 yhteydessä
scope note: Människans väsen ur kristendomens synvinkel Syndafallet. Arvsynden. Synd. Nåd Rättfärdiggörelse. Tro. Bot. Bättring Fri vilja. Predestinationslära Formtillägget 01 används inte i samband med klasserna 20-26.5 och 28.1-29.9 @sv

Kääntymys. Uskoon tuleminen. Uskonelämä
type: Concept
References: MUUT USKONNOT JA MYTOLOGIAT
References: Elämäkerrat. Muistelmat, uskontojen ja kirkkokuntien edustajat
type: YKL-luokka
alternative label: Armo, henkilökohtaiset tunnustuskirjat (23.31)
alternative label: Bekännelseböcker, personliga, kristna (23.31) @sv
alternative label: Bot, personliga bekännelseböcker (23.31) @sv
alternative label: Frälsning, personliga bekännelseböcker (23.31) @sv
alternative label: Försoning, personliga bekännelseböcker (23.31) @sv
alternative label: Katumus, henkilökohtaiset tunnustuskirjat (23.31)
alternative label: Konversion, kristendom (23.31) @sv
alternative label: Kristendom, att växa som kristen (23.31) @sv
alternative label: Kristityn kasvu (23.31)
alternative label: Kääntymys, kristinusko (23.31)
alternative label: Nåd, personliga bekännelseböcker (23.31) @sv
alternative label: Omvändelse, kristendom (23.31) @sv
alternative label: Parannus, henkilökohtaiset tunnustuskirjat (23.31)
alternative label: Pelastus, henkilökohtaiset tunnustuskirjat (23.31)
alternative label: Religiös omvändelse (23.31) @sv
alternative label: Religiösa upplevelser, omvändelse, kristendom (23.31) @sv
alternative label: Sovitus, henkilökohtaiset tunnustuskirjat (23.31)
alternative label: Synd, personliga bekännelseböcker (23.31) @sv
alternative label: Synti, henkilökohtaiset tunnustuskirjat (23.31)
alternative label: Tro, personliga bekännelseböcker (23.31) @sv
alternative label: Trosliv (23.31) @sv
alternative label: Tunnustuskirjat, henkilökohtaiset, kristilliset (23.31)
alternative label: Usko, henkilökohtaiset tunnustuskirjat (23.31)
alternative label: Uskonelämä (23.31)
alternative label: Uskonnolliset kokemukset, kääntymys, kristinusko (23.31)
alternative label: Uskoon tuleminen (23.31)
alternative label: Uskoon tuleminen, kristinusko (23.31)
alternative label: Ånger, personliga bekännelseböcker (23.31) @sv
broader: Pelastusoppi
in scheme: YKL - Yleisten kirjastojen luokitusjärjestelmä
notation: 23.31
preferred label: Conversion. Being born again @en
preferred label: Omvändelse. Att bli troende. Trosliv @sv
scope note: Henkilökohtainen uskonelämä. Tunnustuksellinen kääntymyskirjallisuus Tähän teokset, joissa kääntymys, uskoon tuleminen, parannuksen teko tai kristityn kasvu ovat pääasiana Muotoluokkaa 01 ei käytetä luokkien 20-26.5 ja 28.1-29.9 yhteydessä
scope note: Personligt trosliv. Konfessionella verk om omvändelse Hit personliga skrifter om omvändelse, om att bli troende, om bot eller om att växa som kristen Formtillägget 01 används inte i samband med klasserna 20-26.5 och 28.1-29.9 @sv

Eskatologia
type: Concept
type: YKL-luokka
alternative label: Domedagsprofetior, kristendom (23.6) @sv
alternative label: Döden, kristen dogmatik (23.6) @sv
alternative label: Ennustukset, eskatologia (23.6)
alternative label: Eskatologi (23.6) @sv
alternative label: Eskatologia (23.6)
alternative label: Förutsägelser, eskatologi (23.6) @sv
alternative label: Harmageddon, kristen dogmatik (23.6) @sv
alternative label: Harmagedon, kristillinen dogmatiikka (23.6)
alternative label: Helvete, kristendom (23.6) @sv
alternative label: Helvetti, kristinusko (23.6)
alternative label: Himlen, kristendom (23.6) @sv
alternative label: Kuolema, kristillinen dogmatiikka (23.6)
alternative label: Kuolemanjälkeinen elämä, kristinusko (23.6)
alternative label: Livet efter döden, kristendom (23.6) @sv
alternative label: Maailmanloppu, kristillinen dogmatiikka (23.6)
alternative label: Maailmanlopun ennustukset, kristinusko (23.6)
alternative label: Sielu, kristillinen dogmatiikka (23.6)
alternative label: Sielun kuolemattomuus, kristillinen dogmatiikka (23.6)
alternative label: Själ, kristen dogmatik (23.6) @sv
alternative label: Själens odödlighet, kristen dogmatik (23.6) @sv
alternative label: Taivas, kristinusko (23.6)
alternative label: Viimeiset tapahtumat, eskatologia (23.6)
alternative label: Världens undergång, kristen dogmatik (23.6) @sv
alternative label: Yttersta tingen, eskatologi (23.6) @sv
broader: DOGMATIIKKA. KRISTILLINEN ETIIKKA
in scheme: YKL - Yleisten kirjastojen luokitusjärjestelmä
notation: 23.6
preferred label: Eschatology @en
preferred label: Eskatologi @sv
scope note: Den kristna läran om de yttersta händelserna Himlen. Helvetet. Själens tillstånd efter döden Formtillägget 01 används inte i samband med klasserna 20-26.5 och 28.1-29.9 @sv
scope note: Kristillinen oppi viimeisistä tapahtumista Taivas. Helvetti. Sielun kuolemanjälkeinen tila Muotoluokkaa 01 ei käytetä luokkien 20-26.5 ja 28.1-29.9 yhteydessä

Uskontunnustukset. Katekismukset
type: Concept
type: YKL-luokka
alternative label: Bekännelseskrifter, kristendom (23.7) @sv
alternative label: Katekeser (23.7) @sv
alternative label: Katekismukset (23.7)
alternative label: Trosbekännelser, kristna (23.7) @sv
alternative label: Tunnustuskirjat, kristinusko (23.7)
alternative label: Uskontunnustukset, kristilliset (23.7)
broader: DOGMATIIKKA. KRISTILLINEN ETIIKKA
in scheme: YKL - Yleisten kirjastojen luokitusjärjestelmä
notation: 23.7
preferred label: Creeds. Catechisms @en
preferred label: Trosbekännelser. Katekeser @sv
scope note: Hit oavsett kyrkosamfund eller kristet samfund kristendomens bekännelseskrifter och katekeser Formtillägget 01 används inte i samband med klasserna 20-26.5 och 28.1-29.9 @sv
scope note: Tähän kirkkokunnasta tai kristillisestä yhteisöstä riippumatta kristinuskon tunnustuskirjat ja katekismukset Muotoluokkaa 01 ei käytetä luokkien 20-26.5 ja 28.1-29.9 yhteydessä

Kristillinen etiikka
type: Concept
References: Etiikka. Moraalifilosofia
type: YKL-luokka
alternative label: Abort, kristen etik (23.8) @sv
alternative label: Abortti, kristillinen etiikka (23.8)
alternative label: Arvot, kristilliset (23.8)
alternative label: Avioero, kristillinen etiikka (23.8)
alternative label: Avioliitto, kristillinen etiikka (23.8)
alternative label: Avoliitto, kristillinen etiikka (23.8)
alternative label: Eheyttäminen, homoseksuaalisuus (23.8)
alternative label: Etiikka, kristillinen (23.8)
alternative label: Etik, kristen (23.8) @sv
alternative label: Familjeetik, kristen (23.8) @sv
alternative label: Förlovning, kristen etik (23.8) @sv
alternative label: Geenitekniikka, kristillinen etiikka (23.8)
alternative label: Genteknik, kristen etik (23.8) @sv
alternative label: Godhet, kristen etik (23.8) @sv
alternative label: Gott och ont, kristen etik (23.8) @sv
alternative label: Helande, homosexualitet (23.8) @sv
alternative label: Homoseksuaalisuus, eheyttäminen (23.8)
alternative label: Homosexualitet, helande (23.8) @sv
alternative label: Hyvyys, kristillinen etiikka (23.8)
alternative label: Hyvä ja paha, kristillinen etiikka (23.8)
alternative label: Ihmissuhteet, kristillinen etiikka (23.8)
alternative label: Individualetik, kristen (23.8) @sv
alternative label: Itsemurhat, kristillinen etiikka (23.8)
alternative label: Kihlaus, kristillinen etiikka (23.8)
alternative label: Kristen etik (23.8) @sv
alternative label: Kristendom, etik (23.8) @sv
alternative label: Kristendom, moral (23.8) @sv
alternative label: Kristillinen etiikka (23.8)
alternative label: Kristinusko, etiikka (23.8)
alternative label: Kristinusko, moraali (23.8)
alternative label: Moraali, kristillinen (23.8)
alternative label: Moraaliteologia (23.8)
alternative label: Moral, kristen (23.8) @sv
alternative label: Morallära, kristen (23.8) @sv
alternative label: Moralteologi (23.8) @sv
alternative label: Mänskliga relationer, kristen etik (23.8) @sv
alternative label: Normer, kristna (23.8) @sv
alternative label: Normit, kristilliset (23.8)
alternative label: Omatunto, kristillinen etiikka (23.8)
alternative label: Ondska, kristen etik (23.8) @sv
alternative label: Pahuus, kristillinen etiikka (23.8)
alternative label: Perhe-etiikka, kristillinen (23.8)
alternative label: Samhällsetik, kristen (23.8) @sv
alternative label: Sammanboende, kristen etik (23.8) @sv
alternative label: Samvete, kristen etik (23.8) @sv
alternative label: Seksuaalietiikka, kristillinen (23.8)
alternative label: Sexualetik, kristen (23.8) @sv
alternative label: Siveysoppi, kristillinen (23.8)
alternative label: Självmord, kristen etik (23.8) @sv
alternative label: Skilsmässa, kristen etik (23.8) @sv
alternative label: Socialetik, kristen (23.8) @sv
alternative label: Sosiaalietiikka, kristillinen (23.8)
alternative label: Trosliv, kristen etik (23.8) @sv
alternative label: Uskonelämä, kristillinen etiikka (23.8)
alternative label: Väkivalta, kristillinen etiikka (23.8)
alternative label: Värden, kristna (23.8) @sv
alternative label: Våld, kristen etik (23.8) @sv
alternative label: Yhteiskuntaetiikka, kristillinen (23.8)
alternative label: Yksilöetiikka, kristillinen (23.8)
alternative label: Äktenskap, kristen etik (23.8) @sv
broader: DOGMATIIKKA. KRISTILLINEN ETIIKKA
in scheme: YKL - Yleisten kirjastojen luokitusjärjestelmä
notation: 23.8
preferred label: Christian ethics @en
preferred label: Kristen etik @sv
scope note: Kristen individual- och socialetik Kristen sexualetik Kristna värden. Kristen moral Det goda och det onda ur den kristna etikens synvinkel Formtillägget 01 används inte i samband med klasserna 20-26.5 och 28.1-29.9 @sv
scope note: Kristillinen yksilö- ja sosiaalietiikka Kristillinen seksuaalietiikka Kristilliset arvot. Kristillinen moraali Hyvä ja paha kristillisen etiikan kannalta Muotoluokkaa 01 ei käytetä luokkien 20-26.5 ja 28.1-29.9 yhteydessä

KRISTILLINEN HARTAUSKIRJALLISUUS
type: Concept
References: Kääntymys. Uskoon tuleminen. Uskonelämä
References: Kristillinen etiikka
References: KÄYTÄNNÖLLINEN TEOLOGIA. KRISTINUSKO
References: Sielunhoito
References: MUUT USKONNOT JA MYTOLOGIAT
References: KAUNOKIRJALLISET SEKASISÄLTÖISET TEOKSET
References: KANSANRUNOUS
References: RUNOT
References: NÄYTELMÄT
References: KERTOMAKIRJALLISUUS
References: SADUT. KUVAKIRJAT. SARJAKUVAT
type: YKL-luokka
alternative label: Andaktslitteratur, kristen (24+) @sv
alternative label: Andligt liv, kristendom (24+) @sv
alternative label: Hartauskirjallisuus, kristillinen (24+)
alternative label: Hengellinen elämä, kristinusko (24+)
alternative label: Kristendom, andaktslitteratur (24+) @sv
alternative label: Kristinusko, hartauskirjallisuus (24+)
alternative label: Spiritualiteetti, kristinusko (24+)
alternative label: Spiritualitet, kristendom (24+) @sv
alternative label: Teologi, andaktslitteratur (24+) @sv
alternative label: Teologia, hartauskirjallisuus (24+)
alternative label: Trosliv, andaktslitteratur (24+) @sv
alternative label: Uskonelämä, hartauskirjallisuus (24+)
broader: USKONTO
in scheme: YKL - Yleisten kirjastojen luokitusjärjestelmä
narrower: Hartaus
narrower: Saarnat. Postillat
narrower: Virret. Hengelliset laulut
notation: 24
preferred label: CHRISTIAN DEVOTIONAL LITERATURE @en
preferred label: KRISTEN ANDAKTSLITTERATUR @sv
scope note: Hit och till underklasserna kristen andaktslitteratur oavsett kyrkosamfund eller kristet samfund Formtillägget 01 används inte i samband med klasserna 20-26.5 och 28.1-29.9 @sv
scope note: Tähän ja alaluokkiin kristillinen hartauskirjallisuus kirkkokunnasta tai kristillisestä yhteisöstä riippumatta Muotoluokkaa 01 ei käytetä luokkien 20-26.5 ja 28.1-29.9 yhteydessä

Hartaus
type: Concept
References: Saarnat. Postillat
References: Virret. Hengelliset laulut
type: YKL-luokka
alternative label: Andaktsböcker, kristna (24.1+) @sv
alternative label: Hartauskirjat, kristilliset (24.1+)
broader: KRISTILLINEN HARTAUSKIRJALLISUUS
in scheme: YKL - Yleisten kirjastojen luokitusjärjestelmä
narrower: Rukous. Hartaudenharjoitus
narrower: Päivänsanat. Kristilliset päivänavaukset
notation: 24.1
preferred label: Andakt @sv
preferred label: Devotional books @en
scope note: Andaktsböcker Formtillägget 01 används inte i samband med klasserna 20-26.5 och 28.1-29.9 @sv
scope note: Hartauskirjat Muotoluokkaa 01 ei käytetä luokkien 20-26.5 ja 28.1-29.9 yhteydessä

Rukous. Hartaudenharjoitus
type: Concept
References: Kristinusko. Teologia
References: Itämaiset uskonnot ja mytologiat
References: Rentoutus. Uni. Unettomuus
type: YKL-luokka
alternative label: Andaktsövning, kristen (24.11) @sv
alternative label: Askeesi, kristillinen hartaudenharjoitus (24.11)
alternative label: Askes, kristen andaktsövning (24.11) @sv
alternative label: Bedjande, kristendom (24.11) @sv
alternative label: Bönböcker, kristna (24.11) @sv
alternative label: Bönens teologi, kristendom (24.11) @sv
alternative label: Fasta, kristen andaktsövning (24.11) @sv
alternative label: Hartaudenharjoitus, kristillinen (24.11)
alternative label: Kontemplation, kristen andaktsövning (24.11) @sv
alternative label: Kristendom, meditation och bön (24.11) @sv
alternative label: Kristinusko, meditaatio ja rukous (24.11)
alternative label: Meditaatio, kristillinen hartaudenharjoitus (24.11)
alternative label: Meditation, kristen andaktsövning (24.11) @sv
alternative label: Mietiskely, kristillinen hartaudenharjoitus (24.11)
alternative label: Mystiikka, kristillinen hartaudenharjoitus (24.11)
alternative label: Mystik, kristen andaktsövning (24.11) @sv
alternative label: Paasto, kristillinen hartaudenharjoitus (24.11)
alternative label: Retreater, kristen andaktsövning (24.11) @sv
alternative label: Retriitit, kristillinen hartaudenharjoitus (24.11)
alternative label: Rukoileminen, kristinusko (24.11)
alternative label: Rukouksen teologia, kristinusko (24.11)
alternative label: Rukouskirjat, kristilliset (24.11)
alternative label: Siunaukset, rukouskirjat (24.11)
alternative label: Teologi, meditation och bön (24.11) @sv
alternative label: Teologia, meditaatio ja rukous (24.11)
alternative label: Välsignelser, bönböcker (24.11) @sv
broader: Hartaus
in scheme: YKL - Yleisten kirjastojen luokitusjärjestelmä
notation: 24.11
preferred label: Bön. Andaktsövning @sv
preferred label: Prayer. Devotions @en
scope note: Bönböcker. Bedjande. Bönens teologi Kristen meditation och askes Mystik ur den kristna andaktsövningens synvinkel Formtillägget 01 används inte i samband med klasserna 20-26.5 och 28.1-29.9 @sv
scope note: Rukouskirjat. Rukoileminen. Rukouksen teologia Kristillinen meditaatio ja askeesi Mystiikka kristillisen hartaudenharjoituksen kannalta Muotoluokkaa 01 ei käytetä luokkien 20-26.5 ja 28.1-29.9 yhteydessä

Päivänsanat. Kristilliset päivänavaukset
type: Concept
References: RAAMATTU. RAAMATUNTUTKIMUS
References: Koululaitos
type: YKL-luokka
alternative label: Aamuhartaudet, kristilliset (24.12)
alternative label: Aamunavaukset, kristilliset (24.12)
alternative label: Dagens ord, kristna (24.12) @sv
alternative label: Morgonandakter, kristna (24.12) @sv
alternative label: Morgonsamlingar, kristna (24.12) @sv
alternative label: Päivänavaukset, kristilliset (24.12)
alternative label: Päivänsanat, kristilliset (24.12)
alternative label: Religiösa morgonsamlingar (24.12) @sv
alternative label: Uskonnolliset päivänavaukset (24.12)
broader: Hartaus
in scheme: YKL - Yleisten kirjastojen luokitusjärjestelmä
notation: 24.12
preferred label: Ord för dagen. Kristna morgonsamlingar @sv
preferred label: Quotations of the day. Christian morning assemblies @en
scope note: Jos teoksessa on sekä kristillisiä että muita koulujen päivänavauksia, annetaan etusija luokalle 38.5+ Muotoluokkaa 01 ei käytetä luokkien 20-26.5 ja 28.1-29.9 yhteydessä
scope note: Om verket innehåller både kristna morgonsamlingar och andra morgonsamlingar för skolor, ges företräde åt klass 38.5+ Formtillägget 01 används inte i samband med klasserna 20-26.5 och 28.1-29.9 @sv

Saarnat. Postillat
type: Concept
References: Sakraaliteologia
type: YKL-luokka
alternative label: Herdabrev, kristna (24.2) @sv
alternative label: Kirkolliset puheet (24.2)
alternative label: Kyrkliga tal (24.2) @sv
alternative label: Paimenkirjeet, kristilliset (24.2)
alternative label: Postillat (24.2)
alternative label: Postillor (24.2) @sv
alternative label: Predikningar (24.2) @sv
alternative label: Puhekokoelmat, kristilliset (24.2)
alternative label: Saarnat (24.2)
alternative label: Talsamlingar, kristna (24.2) @sv
broader: KRISTILLINEN HARTAUSKIRJALLISUUS
in scheme: YKL - Yleisten kirjastojen luokitusjärjestelmä
narrower: Saarnaoppi. Homiletiikka
notation: 24.2
preferred label: Predikningar. Postillor @sv
preferred label: Sermons. Homilies @en
scope note: Samlingar med religiösa tal. Herdabrev Formtillägget 01 används inte i samband med klasserna 20-26.5 och 28.1-29.9 @sv
scope note: Uskonnolliset puhekokoelmat. Paimenkirjeet Muotoluokkaa 01 ei käytetä luokkien 20-26.5 ja 28.1-29.9 yhteydessä

Saarnaoppi. Homiletiikka
type: Concept
type: YKL-luokka
alternative label: Homiletiikka (24.21)
alternative label: Homiletik (24.21) @sv
alternative label: Predikningar, forskning (24.21) @sv
alternative label: Saarnaoppi (24.21)
alternative label: Saarnat, tutkimus (24.21)
broader: Saarnat. Postillat
in scheme: YKL - Yleisten kirjastojen luokitusjärjestelmä
notation: 24.21
preferred label: Predikolära. Homiletik @sv
preferred label: Study of preaching. Homiletics @en
scope note: Forskning i predikningar Formtillägget 01 används inte i samband med klasserna 20-26.5 och 28.1-29.9 @sv
scope note: Saarnojen tutkimus Muotoluokkaa 01 ei käytetä luokkien 20-26.5 ja 28.1-29.9 yhteydessä

Virret. Hengelliset laulut
type: Concept
References: Sakraaliteologia
References: MUSIIKKI
References: Liturginen musiikki
References: Hengellinen populaarimusiikki
type: YKL-luokka
alternative label: Andlig musik, psalmer och andliga sånger utan noter (24.3) @sv
alternative label: Andliga sånger, utan noter (24.3) @sv
alternative label: Hengelliset laulut, ilman nuotteja (24.3)
alternative label: Psalmböcker, utan noter (24.3) @sv
alternative label: Psalmer, utan noter (24.3) @sv
alternative label: Psalmmusik, utan noter (24.3) @sv
alternative label: Virret, ilman nuotteja (24.3)
alternative label: Virsikirjat, ilman nuotteja (24.3)
alternative label: Virsimusiikki, ilman nuotteja (24.3)
alternative label: hengellinen musiikki, virret ja hengelliset laulut ilman nuotteja (24.3)
broader: KRISTILLINEN HARTAUSKIRJALLISUUS
in scheme: YKL - Yleisten kirjastojen luokitusjärjestelmä
narrower: Virsioppi. Hymnologia
notation: 24.3
preferred label: Hymns. Spiritual songs @en
preferred label: Psalmer. Andliga sånger @sv
scope note: Psalmböcker och andliga sångböcker utan noter Formtillägget 01 används inte i samband med klasserna 20-26.5 och 28.1-29.9 @sv
scope note: Virsikirjat ja hengelliset laulukirjat, joissa ei ole nuotteja Muotoluokkaa 01 ei käytetä luokkien 20-26.5 ja 28.1-29.9 yhteydessä

Virsioppi. Hymnologia
type: Concept
type: YKL-luokka
alternative label: Andlig musik, psalmlära (24.31) @sv
alternative label: Andliga sånger, forskning (24.31) @sv
alternative label: Hengellinen musiikki, virsioppi (24.31)
alternative label: Hengelliset laulut, tutkimus (24.31)
alternative label: Hymnologi (24.31) @sv
alternative label: Hymnologia (24.31)
alternative label: Psalmer, psalmlära (24.31) @sv
alternative label: Psalmforskning (24.31) @sv
alternative label: Psalmmusik, psalmlära (24.31) @sv
alternative label: Virret, virsioppi (24.31)
alternative label: Virsimusiikki, virsioppi (24.31)
alternative label: Virsioppi (24.31)
alternative label: Virsitutkimus (24.31)
broader: Virret. Hengelliset laulut
in scheme: YKL - Yleisten kirjastojen luokitusjärjestelmä
notation: 24.31
preferred label: Psalmlära. Hynmologi @sv
preferred label: Study of hymns. Hymnology @en
scope note: Forskning i psalmer och andliga sånger Formtillägget 01 används inte i samband med klasserna 20-26.5 och 28.1-29.9 @sv
scope note: Virsien ja hengellisten laulujen tutkimus Muotoluokkaa 01 ei käytetä luokkien 20-26.5 ja 28.1-29.9 yhteydessä

KÄYTÄNNÖLLINEN TEOLOGIA. KRISTINUSKO
type: Concept
References: Kristinusko. Teologia
References: Kristillinen etiikka
References: KRISTILLINEN HARTAUSKIRJALLISUUS
References: KRISTILLINEN LÄHETYSTYÖ
References: KRISTILLISET KIRKOT JA YHTEISÖT. KIRKKOHISTORIA
type: YKL-luokka
alternative label: Andlig vägledning, kristen (25+) @sv
alternative label: Församlingsarbete, kristna kyrkor (25+) @sv
alternative label: Hengellinen ohjaus, kristillinen (25+)
alternative label: Kristendom, praktisk teologi (25+) @sv
alternative label: Kristinusko, käytännöllinen teologia (25+)
alternative label: Käytännöllinen teologia (25+)
alternative label: Praktisk teologi (25+) @sv
alternative label: Seurakuntatyö, kristilliset kirkot (25+)
alternative label: Teologi, praktisk (25+) @sv
alternative label: Teologia, käytännöllinen (25+)
broader: USKONTO
in scheme: YKL - Yleisten kirjastojen luokitusjärjestelmä
narrower: Sakraaliteologia
narrower: Kristillinen opetus ja kasvatus
narrower: Sielunhoito
narrower: Diakonia. Sisälähetys. Evankelioiminen
notation: 25
preferred label: PRACTICAL THEOLOGY. CHRISTIANITY @en
preferred label: PRAKTISK TEOLOGI. KRISTENDOM @sv
scope note: Hit och till underklasserna oavsett kyrkosamfund eller kristet samfund praktisk teologi och andlig vägledning Hit allmänna verk om praktisk teologi Formtillägget 01 används inte i samband med klasserna 20-26.5 och 28.1-29.9 @sv
scope note: Tähän ja alaluokkiin kirkkokunnasta tai kristillisestä yhteisöstä riippumatta käytännöllinen teologia ja hengellinen ohjaus Tähän käytännöllisen teologian yleisteokset Muotoluokkaa 01 ei käytetä luokkien 20-26.5 ja 28.1-29.9 yhteydessä

Sakraaliteologia
type: Concept
References: Rukous. Hartaudenharjoitus
References: Saarnat. Postillat
References: Virret. Hengelliset laulut
References: Liturginen musiikki
type: YKL-luokka
alternative label: Advent, kyrkoår (25.2) @sv
alternative label: Adventti, kirkkovuosi (25.2)
alternative label: Böndagar (25.2) @sv
alternative label: Fastetid, kyrkoåret (25.2) @sv
alternative label: Fester, kyrkliga (25.2+) @sv
alternative label: Gudstjänster, kristna (25.2+) @sv
alternative label: Helatorstai, kirkolliset juhlat (25.2)
alternative label: Helgdagar, kristna (25.2) @sv
alternative label: Heliga tider, kristna (25.2) @sv
alternative label: Helluntai, kirkolliset juhlat (25.2)
alternative label: Joulu, kirkolliset juhlat (25.2)
alternative label: Juhlat, kirkolliset (25.2+)
alternative label: Jul, kyrkliga fester (25.2) @sv
alternative label: Jumalanpalvelukset, kristilliset (25.2+)
alternative label: Kirkkokäsikirjat (25.2)
alternative label: Kirkkovuosi (25.2)
alternative label: Kirkolliset juhlat (25.2+)
alternative label: Kristi himmelsfärdsdag, kyrkliga fester (25.2) @sv
alternative label: Kyrkliga fester (25.2+) @sv
alternative label: Kyrkohandböcker (25.2) @sv
alternative label: Kyrkoåret (25.2) @sv
alternative label: Liturgiikka (25.2+)
alternative label: Liturgik (25.2+) @sv
alternative label: Liturgiset ajat (25.2)
alternative label: Liturgiset kirjat (25.2)
alternative label: Liturgiska böcker (25.2) @sv
alternative label: Liturgiska tider (25.2) @sv
alternative label: Paastonaika, kirkkovuosi (25.2)
alternative label: Pingst, kyrkliga fester (25.2) @sv
alternative label: Pyhäpäivät, kristilliset (25.2)
alternative label: Pyhät ajat, kristilliset (25.2)
alternative label: Pääsiäinen, kirkolliset juhlat (25.2)
alternative label: Påsk, kyrkliga fester (25.2) @sv
alternative label: Rukouspäivät (25.2)
alternative label: Sakraaliteologia (25.2+)
alternative label: Sakralteologi (25.2+) @sv
broader: KÄYTÄNNÖLLINEN TEOLOGIA. KRISTINUSKO
in scheme: YKL - Yleisten kirjastojen luokitusjärjestelmä
narrower: Sakramentit. Kirkolliset toimitukset
narrower: Kirkolliset esineet ja symbolit
notation: 25.2
preferred label: Sacral theology @en
preferred label: Sakralteologi @sv
scope note: Liturgiikka. Jumalanpalvelus Liturgiset kirjat. Kirkkokäsikirjat Liturgiset ajat. Kirkkovuosi. Pyhäpäivät Muotoluokkaa 01 ei käytetä luokkien 20-26.5 ja 28.1-29.9 yhteydessä
scope note: Liturgik. Gudstjänst Liturgiska böcker. Kyrkohandböcker Liturgiska tider. Kyrkoåret. Helgdagar Formtillägget 01 används inte i samband med klasserna 20-26.5 och 28.1-29.9 @sv

Sakramentit. Kirkolliset toimitukset
type: Concept
References: Kristillinen etiikka
References: Kirkolliset esineet ja symbolit
References: Kristillinen opetus ja kasvatus
References: Sielunhoito
References: Perhe- ja holhousoikeus
type: YKL-luokka
alternative label: Avioliitto, kristilliset sakramentit (25.25)
alternative label: Avioliitto, vihkiminen (25.25)
alternative label: Begravning, kyrklig (25.25) @sv
alternative label: Begravningstjänster, kristliga kyrkor (25.25) @sv
alternative label: Bikt (25.25) @sv
alternative label: Bikthemlighet (25.25) @sv
alternative label: Bröllopsceremonier, kyrkliga (25.25) @sv
alternative label: Dop (25.25) @sv
alternative label: Ehtoollinen (25.25)
alternative label: Eukaristi (25.25) @sv
alternative label: Eukaristia (25.25)
alternative label: Faddrar (25.25) @sv
alternative label: Hautaus, kirkollinen (25.25)
alternative label: Hautauspalvelut, kristilliset kirkot (25.25)
alternative label: Häämenot, kirkolliset (25.25)
alternative label: Kaste (25.25)
alternative label: Kirkolliset toimitukset (25.25)
alternative label: Konfirmaatio (25.25)
alternative label: Konfirmation (25.25) @sv
alternative label: Kummius (25.25)
alternative label: Kyrkliga förrättningar (25.25) @sv
alternative label: Nattvarden (25.25) @sv
alternative label: Rippi (25.25)
alternative label: Rippisalaisuus (25.25)
alternative label: Sakrament (25.25) @sv
alternative label: Sakramentit (25.25)
alternative label: Salassapitovelvollisuus, rippisalaisuus (25.25)
alternative label: Sekretess, bikthemlighet (25.25) @sv
alternative label: Sista smörjelsen (25.25) @sv
alternative label: Siunaus (25.25)
alternative label: Syndaförlåtelse (25.25) @sv
alternative label: Synninpäästö (25.25)
alternative label: Tystnadsplikt, bikthemlighet (25.25) @sv
alternative label: Vaitiolovelvollisuus, rippisalaisuus (25.25)
alternative label: Vigsel, kyrklig (25.25) @sv
alternative label: Vihkiminen, kirkollinen (25.25)
alternative label: Viimeinen voitelu (25.25)
alternative label: Välsignelse (25.25) @sv
alternative label: Äktenskap, kristna sakrament (25.25) @sv
alternative label: Äktenskap, vigsel (25.25) @sv
broader: Sakraaliteologia
in scheme: YKL - Yleisten kirjastojen luokitusjärjestelmä
notation: 25.25
preferred label: Sacraments. Church ceremonies @en
preferred label: Sakrament. Kyrkliga förrättningar @sv
scope note: Dop. Gudföräldrar. Konfirmation. Nattvard Äktenskap. Vigsel till äktenskap Bikt. Absolution Sista smörjelsen. Välsignelse. Jordfästning Hit sakramenten också ur den kristna lärans synvinkel Formtillägget 01 används inte i samband med klasserna 20-26.5 och 28.1-29.9 @sv
scope note: Kaste. Kummius. Konfirmaatio. Ehtoollinen Avioliitto. Avioliittoon vihkiminen Rippi. Synninpäästö Viimeinen voitelu. Siunaus. Hautaus Tähän sakramentit myös kristillisen opin kannalta Muotoluokkaa 01 ei käytetä luokkien 20-26.5 ja 28.1-29.9 yhteydessä

Kirkolliset esineet ja symbolit
type: Concept
References: Kirkot ja muut uskonnolliset rakennukset
References: Aiheet piirustus- ja maalaustaiteessa
type: YKL-luokka
alternative label: Altare (25.26) @sv
alternative label: Altarkläden (25.26) @sv
alternative label: Alttarit (25.26)
alternative label: Alttarivaatteet (25.26)
alternative label: Astiat, kirkolliset (25.26)
alternative label: Dopfuntar (25.26) @sv
alternative label: Ehtoollisastiat (25.26)
alternative label: Fattiggubbar (25.26) @sv
alternative label: Inredning, kyrkor (25.26) @sv
alternative label: Kastemaljat (25.26)
alternative label: Kellot, kirkonkellot (25.26)
alternative label: Kirkkolaivat, kirkolliset esineet (25.26)
alternative label: Kirkkotaide, kirkolliset esineet (25.26)
alternative label: Kirkkotekstiilit (25.26)
alternative label: Kirkolliset esineet (25.26)
alternative label: Kirkolliset koriste-esineet (25.26)
alternative label: Kirkolliset symbolit (25.26)
alternative label: Kirkonkellot (25.26)
alternative label: Klockor, kyrkklockor (25.26) @sv
alternative label: Koriste-esineet, kirkolliset (25.26)
alternative label: Kristendom, symbolik (25.26) @sv
alternative label: Kristinusko, symboliikka (25.26)
alternative label: Krucifix (25.26) @sv
alternative label: Krusifiksit (25.26)
alternative label: Kyrkklockor (25.26) @sv
alternative label: Kyrkliga föremål (25.26) @sv
alternative label: Kyrkliga prydnadsföremål (25.26) @sv
alternative label: Kyrkliga symboler (25.26) @sv
alternative label: Kyrkokonst, kyrkliga föremål (25.26) @sv
alternative label: Kyrkotextilier (25.26) @sv
alternative label: Kyrkskepp, kyrkliga föremål (25.26) @sv
alternative label: Kärl, kyrkliga (25.26) @sv
alternative label: Liturgiset esineet (25.26)
alternative label: Liturgiset symbolit (25.26)
alternative label: Liturgiska föremål (25.26) @sv
alternative label: Liturgiska symboler (25.26) @sv
alternative label: Nattvardskärl (25.26) @sv
alternative label: Predikstolar (25.26) @sv
alternative label: Prydnadsföremål, kyrkliga (25.26) @sv
alternative label: Religiösa symboler, kristna (25.26) @sv
alternative label: Saarnatuolit (25.26)
alternative label: Sisustus, kirkot (25.26)
alternative label: Symboler, kristliga (25.26) @sv
alternative label: Symboler, kyrkliga (25.26) @sv
alternative label: Symboliikka, kirkollinen (25.26)
alternative label: Symboliikka, kristillinen (25.26)
alternative label: Symbolik, kristen (25.26) @sv
alternative label: Symbolik, kyrklig (25.26) @sv
alternative label: Symbolit, kirkolliset (25.26)
alternative label: Symbolit, kristilliset (25.26)
alternative label: Tekstiilit, kirkolliset (25.26)
alternative label: Textilier, kyrkliga (25.26) @sv
alternative label: Uskonnolliset symbolit, kristilliset (25.26)
alternative label: Vaivaisukot (25.26)
broader: Sakraaliteologia
in scheme: YKL - Yleisten kirjastojen luokitusjärjestelmä
notation: 25.26
preferred label: Church objects and symbols @en
preferred label: Kyrkliga föremål och symboler @sv
scope note: Kirkolliset ja liturgiset esineet ja välineet Kirkolliset ja kristilliset symbolit Kirkolliset tekstiilit, astiat, kastemaljat, alttarit, saarnastuolit, kirkonkellot, kirkkolaivat, vaivaisukot, kirkkojen koriste-esineet ja sisustus sekä kirkolliselta että taidehistorialliselta kannalta Jos teoksessa on sekä kirkollisia esineitä ja symboleja että kirkkoarkkitehtuuria, annetaan etusija luokalle 72.24 Muotoluokkaa 01 ei käytetä luokkien 20-26.5 ja 28.1-29.9 yhteydessä
scope note: Kyrkliga och liturgiska föremål och medel Kyrkliga och kristna symboler Kyrkotextilier, kärl, dopfuntar, altaren, predikstolar, kyrkklockor, kyrkskepp, fattiggubbar, kyrkliga prydnadsföremål och interiörer både ur kyrklig och konsthistorisk synvinkel Om verket innehåller både kyrkliga föremål och symboler samt kyrkoarkitektur, ges företräde åt klass 72.24 Formtillägget 01 används inte i samband med klasserna 20-26.5 och 28.1-29.9 @sv

Kristillinen opetus ja kasvatus
type: Concept
References: Sielunhoito
References: Diakonia. Sisälähetys. Evankelioiminen
References: KRISTILLISET KIRKOT JA YHTEISÖT. KIRKKOHISTORIA
References: Perhe- ja kotikasvatus
References: Aikuiskoulutus. Vapaa sivistystyö
References: Nuorisotyö. Lapsityö
type: YKL-luokka
alternative label: Aikuiskasvatus, kristillinen (25.3)
alternative label: Barnarbete, kristet (25.3) @sv
alternative label: Bibelkretsar (25.3) @sv
alternative label: Dagklubbar, församlingarnas (25.3) @sv
alternative label: Eettinen kasvatus, kirkko (25.3)
alternative label: Etisk fostran, kyrkan (25.3) @sv
alternative label: Flickarbete, kristet (25.3) @sv
alternative label: Församlingarnas dagklubbar (25.3) @sv
alternative label: Gängarbete, kristligt (25.3) @sv
alternative label: Jengityö, kristillinen (25.3)
alternative label: Kasvatus, kristillinen (25.3)
alternative label: Kateketiikka (25.3)
alternative label: Kateketik (25.3) @sv
alternative label: Kinkerit (25.3)
alternative label: Kirkollinen aikuiskasvatus (25.3)
alternative label: Kirkollinen kasvatus (25.3)
alternative label: Kirkollinen nuorisotyö (25.3)
alternative label: Kirkollinen opetus (25.3)
alternative label: Koululaistyö, kristillinen (25.3)
alternative label: Kristen fostran, kyrkan (25.3) @sv
alternative label: Kristen undervisning (25.3) @sv
alternative label: Kristillinen kasvatus, kirkko (25.3)
alternative label: Kristillinen nuorisotyö (25.3)
alternative label: Kristillinen opetus (25.3)
alternative label: Kristligt ungdomsarbete (25.3) @sv
alternative label: Kyrklig fostran (25.3) @sv
alternative label: Kyrklig undervisning (25.3) @sv
alternative label: Kyrklig vuxenutbildning (25.3) @sv
alternative label: Kyrkligt ungdomsarbete (25.3) @sv
alternative label: Lapsityö, kristillinen (25.3)
alternative label: Läsförhör (25.3) @sv
alternative label: Nuorisotyö, kristillinen (25.3)
alternative label: Opetus, kristillinen (25.3)
alternative label: Poikatyö, kristillinen (25.3)
alternative label: Pojkarbete, kristet (25.3) @sv
alternative label: Pyhäkoulut (25.3)
alternative label: Päiväkerhot, seurakuntien (25.3)
alternative label: Raamattupiirit (25.3)
alternative label: Religionsfostran, kristen (25.3) @sv
alternative label: Rippikoulut (25.3)
alternative label: Seurakuntien päiväkerhot (25.3)
alternative label: Skolelever, kristligt arbete bland skolelever (25.3) @sv
alternative label: Skriftskolor (25.3) @sv
alternative label: Söndagsskolor (25.3) @sv
alternative label: Tyttötyö, kristillinen (25.3)
alternative label: Undervisning, kristen (25.3) @sv
alternative label: Ungdomsarbete, kristligt (25.3) @sv
alternative label: Uppfostran, kristen (25.3) @sv
alternative label: Uskontokasvatus, kristillinen (25.3)
alternative label: Vuxenfostran, kristen (25.3) @sv
broader: KÄYTÄNNÖLLINEN TEOLOGIA. KRISTINUSKO
in scheme: YKL - Yleisten kirjastojen luokitusjärjestelmä
notation: 25.3
preferred label: Christian education and upbringing @en
preferred label: Kristen undervisning och fostran @sv
scope note: Kateketiikka. Kirkon kasvatustoiminta Kristillinen lapsi-, koululais- ja nuorisotyö Kirkon tai seurakunnan antama kristillinen kasvatus Kristillinen aikuiskasvatus. Raamattupiirit. Pyhäkoulu. Rippikoulu. Seurakuntien päiväkerhot Tähän kristillisen opetus- ja kasvatustyön teologia, menetelmät ja opetusohjelmistot sekä työntekijät ja heidän koulutuksensa Kristilliset nuorisojärjestöt, kuten NMKY ja NNKY 25.306 Muotoluokkaa 01 ei käytetä luokkien 20-26.5 ja 28.1-29.9 yhteydessä
scope note: Kateketik. Kyrklig fostran Kristligt barn- och ungdomsarbete, kyrkligt arbete i skolor Kristen fostran inom kyrkan eller församlingen Kristlig undervisning för vuxna. Bibelcirklar. Söndagsskola. Skriftskola. Församlingarnas dagklubbar Hit det kristliga undervisnings- och fostringsarbetets teologi, metoder och undervisningsprogram samt diakonerna och deras utbildning Kristna ungdomsorganisationer såsom KFUM och KFUK 25.306 Formtillägget 01 används inte i samband med klasserna 20-26.5 och 28.1-29.9 @sv

Sielunhoito
type: Concept
References: Perhepolitiikka
References: Perhe- ja kotikasvatus
References: Saattohoito
References: Kriisipsykologia. Katastrofipsykologia. Surutyö
type: YKL-luokka
alternative label: Avioliittoneuvonta, kristillinen (25.4)
alternative label: Döden, kristen själavård (25.4) @sv
alternative label: Familjearbete, kristlig (25.4) @sv
alternative label: Familjerådgivning, kristlig (25.4) @sv
alternative label: Familjerådgivningsbyråer, kristliga (25.4) @sv
alternative label: Hembesöksarbete, kristligt (25.4) @sv
alternative label: Hemtjänst, kristlig (25.4) @sv
alternative label: Kirkollinen avioliittoneuvontatyö (25.4)
alternative label: Kirkollinen perheneuvontatyö (25.4)
alternative label: Kliininen teologia (25.4)
alternative label: Klinisk teologi (25.4) @sv
alternative label: Kotikäyntityö, kristillinen (25.4)
alternative label: Kotipalvelu, kristillinen (25.4)
alternative label: Kuolema, kristillinen sielunhoito (25.4)
alternative label: Kyrklig familjerådgivning (25.4) @sv
alternative label: Kyrklig äktenskapsrådgivning (25.4) @sv
alternative label: Lähimmäispalvelu, kristillinen (25.4)
alternative label: Palveleva puhelin, kristillinen (25.4)
alternative label: Pastoraaliteologia (25.4)
alternative label: Pastoralteologi (25.4) @sv
alternative label: Perheneuvolat, kristilliset (25.4)
alternative label: Perheneuvonta, kristillinen (25.4)
alternative label: Perhetyö, kristillinen (25.4)
alternative label: Psykologi, kristen själavård (25.4) @sv
alternative label: Psykologia, kristillinen sielunhoito (25.4)
alternative label: Sairaalasielunhoito (25.4)
alternative label: Sairaalateologia (25.4)
alternative label: Samtalstjänst, kristen (25.4) @sv
alternative label: Sielunhoito, kristillinen (25.4)
alternative label: Sjukhussjälavård (25.4) @sv
alternative label: Sjukhusteologi (25.4) @sv
alternative label: Själavård, kristen (25.4) @sv
alternative label: Sorgearbete, kristen själavård (25.4) @sv
alternative label: Surutyö, kristillinen sielunhoito (25.4)
alternative label: Väntjänst, kristlig (25.4) @sv
alternative label: Ystäväpalvelu, kristillinen (25.4)
alternative label: Äktenskapsrådgivning, kristlig (25.4) @sv
broader: KÄYTÄNNÖLLINEN TEOLOGIA. KRISTINUSKO
in scheme: YKL - Yleisten kirjastojen luokitusjärjestelmä
notation: 25.4
preferred label: Pastoral care @en
preferred label: Själavård @sv
scope note: Pastoraaliteologia Kristillinen perhe- ja avioliittoneuvonta Palveleva puhelin. Kotikäyntityö Sairaalasielunhoito. Sairaalateologia Kuolema ja surutyö sielunhoidon kannalta Tähän sielunhoidon teologia, menetelmät ja työntekijät sekä heidän koulutuksensa Muotoluokkaa 01 ei käytetä luokkien 20-26.5 ja 28.1-29.9 yhteydessä
scope note: Pastoralteologi Kristen familje- och äktenskapsrådgivning Själavårdstelefon. Hembesöksverksamhet Siukhussjälavård. Sjukhusteologi Död och sorgearbete ur själavårdens synvinkel Hit själavårdens teologi och metoder samt själavårdsdiakonerna och deras utbildning Formtillägget 01 används inte i samband med klasserna 20-26.5 och 28.1-29.9 @sv

Diakonia. Sisälähetys. Evankelioiminen
type: Concept
References: Sielunhoito
References: KRISTILLINEN LÄHETYSTYÖ
References: KRISTILLISET KIRKOT JA YHTEISÖT. KIRKKOHISTORIA
References: Protestanttiset kirkot ja yhteisöt
type: YKL-luokka
alternative label: Auttaminen, kirkon avustustoiminta (25.5)
alternative label: Auttamistyö, kirkon (25.5)
alternative label: Avustustoiminta, kirkon (25.5)
alternative label: Barndiakoni (25.5) @sv
alternative label: Bibeln, inre mission (25.5) @sv
alternative label: Diakoni (25.5) @sv
alternative label: Diakonia (25.5)
alternative label: Diasporaarbete (25.5) @sv
alternative label: Diasporatyö (25.5)
alternative label: Evangelisationsarbete (25.5) @sv
alternative label: Evankelioimistyö (25.5)
alternative label: Flyktingarbete, kristen (25.5) @sv
alternative label: Gatumission (25.5) @sv
alternative label: Hjälp, kyrkans hjälpverksamhet (25.5) @sv
alternative label: Hjälparbete, kyrkans (25.5) @sv
alternative label: Hjälpverksamhet, kyrkans (25.5) @sv
alternative label: Inre mission (25.5) @sv
alternative label: Invandrararbete, kristen (25.5) @sv
alternative label: Katastrofhjälp, kyrkans hjälpverksamhet (25.5) @sv
alternative label: Katastrofiapu, kirkon avustustoiminta (25.5)
alternative label: Katulähetys (25.5)
alternative label: Kaupunkilähetys (25.5)
alternative label: Kirkollinen avustustoiminta (25.5)
alternative label: Kirkollinen pakolaisapu (25.5)
alternative label: Kirkollinen ulkomaanapu (25.5)
alternative label: Kyrklig flyktinghjälp (25.5) @sv
alternative label: Kyrklig hjälpverksamhet (25.5) @sv
alternative label: Kyrklig utlandshjälp (25.5) @sv
alternative label: Lapsidiakonia (25.5)
alternative label: Lähetystyö, sisälähetys (25.5)
alternative label: Maahanmuuttajatyö, kristillinen (25.5)
alternative label: Merimieslähetys (25.5)
alternative label: Mission, inre mission (25.5) @sv
alternative label: Mustalaislähetys (25.5)
alternative label: Pakolaistyö, kristillinen (25.5)
alternative label: Raamattu, sisälähetystyö (25.5)
alternative label: Sisälähetys (25.5)
alternative label: Sjömansmission (25.5) @sv
alternative label: Stadsmission (25.5) @sv
alternative label: Ulkoseurakuntatyö (25.5)
alternative label: Zigenarmission (25.5) @sv
broader: KÄYTÄNNÖLLINEN TEOLOGIA. KRISTINUSKO
in scheme: YKL - Yleisten kirjastojen luokitusjärjestelmä
notation: 25.5
preferred label: Church social work. Home mission. Evangelisation @en
preferred label: Diakoni. Inre mission. Evangelisation @sv
scope note: Kirkollinen avustustoiminta. Kansainvälinen diakonia. Kirkon ulkomaanapu. Kirkon pakolaisapu Kristillisen sanoman levittäminen kristinuskosta vieraantuneiden keskuuteen Merimieslähetys. Mustalaislähetys. Katulähetys Diaspora- eli ulkoseurakuntatyö Tähän diakonian sekä sisälähetys- ja evankelioimistyön teologia, menetelmät ja työntekijät sekä heidän koulutuksensa Jos teoksessa on sekä sisälähetystä että lähetystyötä, annetaan etusija luokalle 26+ Muotoluokkaa 01 ei käytetä luokkien 20-26.5 ja 28.1-29.9 yhteydessä
scope note: Kyrklig biståndsverksamhet. Internationell diakoni. Kyrkans utlandshjälp. Kyrkans flyktinghjälp Spridandet av det kristna budskapet till dem som fjärmats från kristendomen Sjömansmission. Zigenarmission. Gatumission Församlingsverksamhet utomlands (diasporaarbete) Hit diakonins samt inre missionens och evangelisationens teologi och metoder samt diakonerna och deras utbildning Om verket innehåller både inremission och missionsarbete, ges företräde åt klass 26+ Formtillägget 01 används inte i samband med klasserna 20-26.5 och 28.1-29.9 @sv

KRISTILLINEN LÄHETYSTYÖ
type: Concept
References: Diakonia. Sisälähetys. Evankelioiminen
References: MUUT USKONNOT JA MYTOLOGIAT
type: YKL-luokka
alternative label: Bibeln, mission (26+) @sv
alternative label: Judemission (26+) @sv
alternative label: Juutalaislähetys (26+)
alternative label: Kristendom, mission (26+) @sv
alternative label: Kristinusko, lähetystyö (26+)
alternative label: Lähetystyö, kristillinen (26+)
alternative label: Missiologi, kristen (26+) @sv
alternative label: Missiologia, kristillinen (26+)
alternative label: Mission, kristen (26+) @sv
alternative label: Raamattu, lähetystyö (26+)
alternative label: Teologi, mission (26+) @sv
alternative label: Teologia, lähetystyö (26+)
broader: USKONTO
in scheme: YKL - Yleisten kirjastojen luokitusjärjestelmä
narrower: Kristillinen lähetystyö, Aasia
narrower: Kristillinen lähetystyö, Afrikka
narrower: Kristillinen lähetystyö, Amerikka
narrower: Kristillinen lähetystyö, Australia ja Oseania
notation: 26
preferred label: CHRISTIAN MISSION @en
preferred label: KRISTEN MISSION @sv
scope note: Hit och till underklasserna oavsett kyrkosamfund eller kristet samfund kristen mission och spridning av Bibeln på icke-kristna områden eller bland icke-kristna befolkningsgrupper Hit och till underklasserna också mission bland judarna Hit och till underklasserna missionsarbetets teologi och metoder samt missionsarbetarna och deras utbildning Om verket innehåller både missionsarbete och inremission, ges företräde åt klass 26+ Formtillägget 01 används inte i samband med klasserna 20-26.5 och 28.1-29.9 @sv
scope note: Tähän ja alaluokkiin kirkkokunnasta tai kristillisestä yhteisöstä riippumatta kristillinen lähetystyö ja Raamatun levitystyö ei-kristillisillä alueilla tai ei-kristittyjen väestöryhmien keskuudessa Tähän ja alaluokkiin myös juutalaislähetys Tähän ja alaluokkiin lähetystyön teologia, menetelmät ja työntekijät sekä heidän koulutuksensa Jos teoksessa on sekä lähetystyötä että sisälähetystyötä, annetaan etusija luokalle 26+ Muotoluokkaa 01 ei käytetä luokkien 20-26.5 ja 28.1-29.9 yhteydessä

Kristillinen lähetystyö, Aasia
type: Concept
type: YKL-luokka
alternative label: Aasia, kristillinen lähetystyö (26.1)
alternative label: Asien, kristen mission (26.1) @sv
broader: KRISTILLINEN LÄHETYSTYÖ
in scheme: YKL - Yleisten kirjastojen luokitusjärjestelmä
notation: 26.1
preferred label: Christian mission, Asia @en
preferred label: Kristen mission, Asien @sv
scope note: Kristen mission i Asien Formtillägget 01 används inte i samband med klasserna 20-26.5 och 28.1-29.9 @sv
scope note: Kristillinen lähetystyö Aasiassa Muotoluokkaa 01 ei käytetä luokkien 20-26.5 ja 28.1-29.9 yhteydessä

Kristillinen lähetystyö, Afrikka
type: Concept
type: YKL-luokka
alternative label: Afrika, kristen mission (26.2) @sv
alternative label: Afrikka, kristillinen lähetystyö (26.2)
alternative label: Amboland, kristen mission (26.2) @sv
alternative label: Ambomaa, kristillinen lähetystyö (26.2)
broader: KRISTILLINEN LÄHETYSTYÖ
in scheme: YKL - Yleisten kirjastojen luokitusjärjestelmä
notation: 26.2
preferred label: Christian mission, Africa @en
preferred label: Kristen mission, Afrika @sv
scope note: Kristen mission i Afrika Formtillägget 01 används inte i samband med klasserna 20-26.5 och 28.1-29.9 @sv
scope note: Kristillinen lähetystyö Afrikassa Muotoluokkaa 01 ei käytetä luokkien 20-26.5 ja 28.1-29.9 yhteydessä

Kristillinen lähetystyö, Amerikka
type: Concept
type: YKL-luokka
alternative label: Amerika, kristen mission (26.3) @sv
alternative label: Amerikka, kristillinen lähetystyö (26.3)
broader: KRISTILLINEN LÄHETYSTYÖ
in scheme: YKL - Yleisten kirjastojen luokitusjärjestelmä
notation: 26.3
preferred label: Christian mission, America @en
preferred label: Kristen mission, Amerika @sv
scope note: Kristen mission i Amerika Formtillägget 01 används inte i samband med klasserna 20-26.5 och 28.1-29.9 @sv
scope note: Kristillinen lähetystyö Amerikassa Muotoluokkaa 01 ei käytetä luokkien 20-26.5 ja 28.1-29.9 yhteydessä

Kristillinen lähetystyö, Australia ja Oseania
type: Concept
type: YKL-luokka
alternative label: Australia, kristillinen lähetystyö (26.5)
alternative label: Australien, kristen mission (26.5) @sv
alternative label: Oceanien, kristen mission (26.5) @sv
alternative label: Oseania, kristillinen lähetystyö (26.5)
broader: KRISTILLINEN LÄHETYSTYÖ
in scheme: YKL - Yleisten kirjastojen luokitusjärjestelmä
notation: 26.5
preferred label: Christian mission, Australia and Oceania @en
preferred label: Kristen mission, Australia och Oceania @sv
scope note: Kristen mission i Australien och Oceanien Formtillägget 01 används inte i samband med klasserna 20-26.5 och 28.1-29.9 @sv
scope note: Kristillinen lähetystyö Australiassa ja Oseaniassa Muotoluokkaa 01 ei käytetä luokkien 20-26.5 ja 28.1-29.9 yhteydessä

KRISTILLISET KIRKOT JA YHTEISÖT. KIRKKOHISTORIA
type: Concept
References: Kristinusko. Teologia
References: RAAMATTU. RAAMATUNTUTKIMUS
References: DOGMATIIKKA. KRISTILLINEN ETIIKKA
References: KRISTILLINEN HARTAUSKIRJALLISUUS
References: KÄYTÄNNÖLLINEN TEOLOGIA. KRISTINUSKO
References: KRISTILLINEN LÄHETYSTYÖ
References: Kirkko-oikeus
References: Kirkot ja muut uskonnolliset rakennukset
alternative label: Arkkipiispan istuimet, kristilliset kirkot (28+)
alternative label: Befattningar, kristna kyrkor (28+) @sv
alternative label: Biskopssäten, kristna kyrkor (28+) @sv
alternative label: Brödraskap, kristna (28+) @sv
alternative label: Församlingar, kristna kyrkor (28+) @sv
alternative label: Förvaltning, kristna kyrkor (28+) @sv
alternative label: Hallinto, kristilliset kirkot (28+)
alternative label: Helgon, kristna, allm. (28) @sv
alternative label: Heliga personer, kristna helgon (28+) @sv
alternative label: Herätysliikkeet, kristilliset kirkot (28+)
alternative label: Jeesus-liike (28+)
alternative label: Jesus-rörelsen (28+) @sv
alternative label: Kirkkohallinto, kristilliset kirkot (28+)
alternative label: Kirkkokunnat (28+)
alternative label: Kirkkososiologia (28+)
alternative label: Kirkolliset laitokset, kristilliset kirkot (28+)
alternative label: Kirkolliset virat, kristilliset kirkot (28+)
alternative label: Kirkolliskokoukset, kristilliset kirkot (28+)
alternative label: Kirkon ja valtion suhde, kristilliset kirkot (28+)
alternative label: Kirkon työntekijät, kristilliset kirkot (28+)
alternative label: Kirkosta eroaminen, kristilliset kirkot (28+)
alternative label: Kirkot, kristilliset (28+)
alternative label: Kloster, kristna, allm. (28) @sv
alternative label: Kristendom, kyrkor (28+) @sv
alternative label: Kristinusko, kirkot (28+)
alternative label: Kvinnliga präster, kristna kyrkor (28+) @sv
alternative label: Kyrka och stat, relation mellan, kristna kyrkor (28+) @sv
alternative label: Kyrkans arbetstagare, kristna kyrkor (28+) @sv
alternative label: Kyrkliga institutioner, kristna kyrkor (28+) @sv
alternative label: Kyrkliga ämbeten, kristna kyrkor (28+) @sv
alternative label: Kyrkoförvaltning, kristna kyrkor (28+) @sv
alternative label: Kyrkomöten, kristna kyrkor (28+) @sv
alternative label: Kyrkor, kristna (28+) @sv
alternative label: Kyrkosamfund (28+) @sv
alternative label: Kyrkosociologi (28+) @sv
alternative label: Lahkot, kristilliset (28+)
alternative label: Luostarit, kristilliset, yl. (28)
alternative label: Munkkijärjestöt, kristilliset, yl. (28)
alternative label: Munkordnar, kristna, allm. (28) @sv
alternative label: Naispappeus, kristilliset kirkot (28+)
alternative label: Nunnajärjestöt, kristilliset (28+)
alternative label: Nunneordnar, kristna (28+) @sv
alternative label: Papisto, kristilliset kirkot (28+)
alternative label: Pappiskoulutus, kristilliset kirkot (28+)
alternative label: Piispanistuimet, kristilliset kirkot (28+)
alternative label: Pilgrimsfärder, kristna (28+) @sv
alternative label: Prästerskap, kristna kyrkor (28+) @sv
alternative label: Prästutbildning, kristna kyrkor (28+) @sv
alternative label: Pyhiinvaellukset, kristilliset (28+)
alternative label: Pyhimykset, kristilliset, yl. (28)
alternative label: Pyhät henkilöt, kristilliset pyhimykset (28+)
alternative label: Religiös identitet, olika religioner (28 ... 29+) @sv
alternative label: Sekter, kristna (28+) @sv
alternative label: Seurakunnat, kristilliset kirkot (28+)
alternative label: Uskonnollinen identiteetti, eri uskonnot (28 ... 29+)
alternative label: Utträde ur kyrkan, kristna kyrkor (28+) @sv
alternative label: Veljeskunnat, kristilliset (28+)
alternative label: Virat, kristillisten kirkkojen (28+)
alternative label: Virkateologia, kristilliset kirkot (28+)
alternative label: Väckelserörelser, kristna kyrkor (28+) @sv
alternative label: Ämbetsteologi, kristna kyrkor (28+) @sv
broader: USKONTO
in scheme: YKL - Yleisten kirjastojen luokitusjärjestelmä
narrower: Roomalaiskatolinen kirkko
narrower: Ortodoksinen kirkko
narrower: Itämaiset kirkot
narrower: Protestanttiset kirkot ja yhteisöt
narrower: Muut kristillisperäiset yhteisöt
notation: 28
scope note: Hit och till underklasserna allmänna verk om kristna kyrkor och kyrkosamfund och andra kristna samfund, deras organisation, administration och sociologi, församlingar, tjänster, prästerskap och övriga anställda. Hit och till underklasserna också kristna väckelserörelser, brödraskap och kristet klosterväsen samt helgon, trosförföljelser och martyrer. Hit och till underklasserna också kyrkornas förhållande till staten och samhället. Om verket passar både i klassen för kristna kyrkosamfund eller kristna samfund och i ämnesklass, ges företräde åt ämnesklass 22-26+. Ekumenik 28.01. Allmän kyrkohistoria, kristendomens allmänna historia samt kyrkohistoria som behandlar flera kyrkosamfund i olika länder 28.09. Allmän finsk kyrkohistoria, Finlands evangelisk-lutherska kyrkas historia samt den katolska kyrkans historia i Finland under medeltiden 28.7109. Filosofi, teori och forskningmetoder i allmän kyrkohistoria 28.01. Tidiga kyrkan och urkristendom 28.09. Formtillägget 01 används inte i samband med klasserna 20-26.5 och 28.1-29.9 @sv
scope note: Tähän ja alaluokkiin kristillisten kirkkojen, kirkkokuntien ja yhteisöjen yleisteokset, organisaatio, hallinto ja sosiologia, seurakunnat, virat, papisto ja muu henkilöstö. Tähän ja alaluokkiin myös kristilliset herätysliikkeet, veljeskunnat ja luostarilaitokset sekä pyhimykset, uskonvainot ja marttyyrit . Tähän ja alaluokkiin myös kirkkojen suhde valtioon ja yhteiskuntaan. Jos teos sopii sekä kristillisen kirkkokunnan tai yhteisön että aiheen mukaiseen luokkaan, annetaan etusija aiheen mukaisille luokille 22-26+. Ekumenia eli kirkkojen yhteistyö 28.01. Yleinen kirkkohistoria, kristinuskon yleinen historia sekä eri maiden useampaa kirkkokuntaa koskeva kirkkohistoria 28.09. Suomen yleinen kirkkohistoria, Suomen ev.-lut. kirkon sekä Suomen keskiajan katolisen kirkon historia 28.7109. Yleisen kirkkohistorian filosofia, teoria ja tutkimusmenetelmät 28.01. Alkukirkko ja alkuseurakunta 28.09. Muotoluokkaa 01 ei käytetä luokkien 20-26.5 ja 28.1-29.9 yhteydessä

Roomalaiskatolinen kirkko
type: Concept
References: Suomen kirkkohistoria
type: YKL-luokka
alternative label: Benediktiinit (28.1)
alternative label: Benediktiner (28.1) @sv
alternative label: Birgittalaiset (28.1)
alternative label: Birgittiner (28.1) @sv
alternative label: Dominikaanit (28.1)
alternative label: Dominikaner (28.1) @sv
alternative label: Franciskaner (28.1) @sv
alternative label: Fransiskaanit (28.1)
alternative label: Helgon, romersk-katolska (28.1) @sv
alternative label: Inkvisitio, historia (28.1+)
alternative label: Inkvisition, historia (28.1+) @sv
alternative label: Jesuiitat (28.1)
alternative label: Jesuiter (28.1) @sv
alternative label: Kartusiaanit (28.1)
alternative label: Kartusianer (28.1) @sv
alternative label: Katolicism, romersk-katolicism (28.1) @sv
alternative label: Katolinen kirkko, roomalaiskatolinen (28.1)
alternative label: Katolisuus, roomalaiskatolisuus (28.1)
alternative label: Katolska kyrkan, romersk-katolska (28.1) @sv
alternative label: Kloster, romersk-katolska (28.1) @sv
alternative label: Luostarit, roomalaiskatoliset (28.1)
alternative label: Munkkijärjestöt, roomalaiskatoliset (28.1)
alternative label: Munkordnar, romersk-katolska (28.1) @sv
alternative label: Nunnajärjestöt, roomalaiskatoliset (28.1)
alternative label: Nunneordnar, romersk-katolska (28.1) @sv
alternative label: Paavinistuin (28.1)
alternative label: Pyhimykset, roomalaiskatoliset (28.1)
alternative label: Påvestolen (28.1) @sv
alternative label: Romersk-katolska kyrkan (28.1) @sv
alternative label: Roomalaiskatolinen kirkko (28.1)
alternative label: Vatikaani, roomalaiskatolinen kirkko (28.1)
alternative label: Vatikanen, romersk-katolska kyrkan (28.1) @sv
broader: KRISTILLISET KIRKOT JA YHTEISÖT. KIRKKOHISTORIA
in scheme: YKL - Yleisten kirjastojen luokitusjärjestelmä
notation: 28.1
preferred label: Roman Catholic Church @en
preferred label: Romersk-katolska kyrkan @sv
scope note: Den romersk-katolska kyrkans historia i Finland 28.109. Formtillägget 01 används inte i samband med klasserna 20-26.5 och 28.1-29.9 @sv
scope note: Roomalaiskatolisen kirkon historia 28.109. Muotoluokkaa 01 ei käytetä luokkien 20-26.5 ja 28.1-29.9 yhteydessä

Ortodoksinen kirkko
type: Concept
References: Maalaustaiteen materiaalit ja tekniikka
References: Aiheet piirustus- ja maalaustaiteessa
type: YKL-luokka
alternative label: Bysantinska kyrkan, religion (28.2) @sv
alternative label: Bysanttilainen kirkko, uskonto (28.2)
alternative label: Grekisk-katolska kyrkan (28.2) @sv
alternative label: Helgon, ortodoxa (28.2) @sv
alternative label: Katolicism, grekisk-katolicism (28.2) @sv
alternative label: Katolinen kirkko, ortodoksinen (28.2)
alternative label: Katolisuus, kreikkalaiskatolisuus (28.2)
alternative label: Katolska kyrkan, ortodoxa (28.2) @sv
alternative label: Kloster, ortodoxa (28.2) @sv
alternative label: Kreikkalaiskatolinen kirkko (28.2)
alternative label: Luostarit, ortodoksiset (28.2)
alternative label: Munkkijärjestöt, ortodoksiset (28.2)
alternative label: Munkordnar, ortodoxa (28.2) @sv
alternative label: Nunnajärjestöt, ortodoksiset (28.2)
alternative label: Nunneordnar, ortodoxa (28.2) @sv
alternative label: Ortodoksinen kirkko (28.2)
alternative label: Ortodoxa kyrkan (28.2) @sv
alternative label: Pyhimykset, ortodoksiset (28.2)
alternative label: Pyhät, ortodoksinen kirkko (28.2)
broader: KRISTILLISET KIRKOT JA YHTEISÖT. KIRKKOHISTORIA
in scheme: YKL - Yleisten kirjastojen luokitusjärjestelmä
notation: 28.2
preferred label: Eastern Orthodox Church @en
preferred label: Ortodoxa kyrkan @sv
scope note: Den ortodoxa kyrkans historia 28.209 Formtillägget 01 används inte i samband med klasserna 20-26.5 och 28.1-29.9 @sv
scope note: Ortodoksisen kirkon historia 28.209 Muotoluokkaa 01 ei käytetä luokkien 20-26.5 ja 28.1-29.9 yhteydessä

Itämaiset kirkot
type: Concept
type: YKL-luokka
alternative label: Alkukirkot (28.4)
alternative label: Itämaiset kirkot, kristilliset (28.4)
alternative label: Katolinen kirkko, Armenian (28.4)
alternative label: Katolska kyrkan, Armenien (28.4) @sv
alternative label: Koptilainen kirkko (28.4)
alternative label: Koptiska kyrkan (28.4) @sv
alternative label: Tomaskristnas kyrka (28.4) @sv
alternative label: Tuomaskristittyjen kirkko (28.4)
alternative label: Urkyrkor (28.4) @sv
alternative label: Österländska kyrkor, kristna (28.4) @sv
broader: KRISTILLISET KIRKOT JA YHTEISÖT. KIRKKOHISTORIA
in scheme: YKL - Yleisten kirjastojen luokitusjärjestelmä
notation: 28.4
preferred label: Oriental churches @en
preferred label: Österländska kyrkor @sv
scope note: De första kyrkorna i Mellanöstern. Den katolska kyrkan i Armenien. Den koptiska kyrkan. De tomaskristna kyrkorna i Indien De österländska kyrkornas historia 28.409 Formtillägget 01 används inte i samband med klasserna 20-26.5 och 28.1-29.9 @sv
scope note: Lähi-Idän varhaiset kirkot. Armenian katolinen kirkko. Koptilainen kirkko. Intian tuomaskristittyjen kirkot Itämaisten kirkkojen historia 28.409 Muotoluokkaa 01 ei käytetä luokkien 20-26.5 ja 28.1-29.9 yhteydessä

Protestanttiset kirkot ja yhteisöt
type: Concept
type: YKL-luokka
alternative label: Adventism (28.7) @sv
alternative label: Adventismi (28.7)
alternative label: Anglikaaninen kirkko (28.7)
alternative label: Anglikanska kyrkan (28.7) @sv
alternative label: Ashram-liike (28.7)
alternative label: Ashram-rörelsen (28.7) @sv
alternative label: Baptism (28.7) @sv
alternative label: Baptismi (28.7)
alternative label: Bekännelsekyrkan (28.7) @sv
alternative label: Episkopaaliset kirkot (28.7)
alternative label: Episkopala kyrkor (28.7) @sv
alternative label: Frikyrkor (28.7) @sv
alternative label: Frälsningsarmén (28.7) @sv
alternative label: Helluntailiike (28.7)
alternative label: Herrnhutilaisuus (28.7)
alternative label: Herrnhutism (28.7) @sv
alternative label: Herätysliikkeet, protestanttiset (28.7+)
alternative label: Kalvinilaisuus (28.7)
alternative label: Kalvinism (28.7) @sv
alternative label: Kongregationalister (28.7) @sv
alternative label: Kongregationalistit (28.7)
alternative label: Kveekarit (28.7)
alternative label: Kväkare (28.7) @sv
alternative label: Luterilaiset kirkot (28.7+)
alternative label: Luterilaisuus (28.7+)
alternative label: Lutheranism (28.7+) @sv
alternative label: Lutherska kyrkor (28.7+) @sv
alternative label: Mennoniitit (28.7)
alternative label: Mennoniter (28.7) @sv
alternative label: Metodism (28.7) @sv
alternative label: Metodismi (28.7)
alternative label: Pelastusarmeija (28.7)
alternative label: Pietism (28.7+) @sv
alternative label: Pietismi (28.7+)
alternative label: Pingströrelsen (28.7) @sv
alternative label: Presbyteerit (28.7)
alternative label: Presbyterer (28.7) @sv
alternative label: Protestantiska kyrkor (28.7+) @sv
alternative label: Protestantiska väckelserörelser (28.7+) @sv
alternative label: Protestanttiset herätysliikkeet (28.7+)
alternative label: Protestanttiset kirkot (28.7+)
alternative label: Puritaanit (28.7)
alternative label: Puritaner (28.7) @sv
alternative label: Reformerta kyrkor (28.7) @sv
alternative label: Reformoidut kirkot (28.7)
alternative label: Schartauanism (28.7) @sv
alternative label: Schartaulaisuus (28.7)
alternative label: Tunnustuskirkko (28.7)
alternative label: Vapaakirkot (28.7)
alternative label: Väckelserörelser, protestantiska (28.7+) @sv
broader: KRISTILLISET KIRKOT JA YHTEISÖT. KIRKKOHISTORIA
in scheme: YKL - Yleisten kirjastojen luokitusjärjestelmä
narrower: Suomen evankelis-luterilainen kirkko
notation: 28.7
preferred label: Protestant churches and communities @en
preferred label: Protestantiska kyrkor och samfund @sv
scope note: Anglikaaninen kirkko. Episkopaaliset kirkot Luterilaiset kirkot. Reformoidut kirkot Herrnhutilaiset. Kalvinilaiset. Vapaakirkot Presbyteerit. Kongregationalistit. Puritaanit Baptistit. Adventistit. Helluntailaiset Mennoniitit. Metodistit. Kveekarit. Ashram-liike. Pelastusarmeija Tähän ja alaluokkiin myös protestanttisten kirkkojen herätysliikkeet Protestanttisten kirkkojen, yhteisöjen ja herätysliikkeiden historia 28.709 Muotoluokkaa 01 ei käytetä luokkien 20-26.5 ja 28.1-29.9 yhteydessä
scope note: Den anglikanska kyrkan. De episkopala kyrkorna De lutheranska kyrkorna. De reformerta kyrkorna Herrnhuter. Kalvinister. Frikyrkor Presbyterianer. Kongregationalister. Puritaner Baptister. Adventister. Pingstvänner. Kväkare Mennoniter. Metodister. Ashramrörelsen. Frälsningsarmén Hit och till underklasserna också väckelserörelserna inom de protestantiska kyrkorna De protestantiska kyrkornas, samfundens och väckelserörelsernas historia 28.709 Formtillägget 01 används inte i samband med klasserna 20-26.5 och 28.1-29.9 @sv

Suomen evankelis-luterilainen kirkko
type: Concept
References: RAAMATTU. RAAMATUNTUTKIMUS
References: DOGMATIIKKA. KRISTILLINEN ETIIKKA
References: KRISTILLINEN HARTAUSKIRJALLISUUS
References: KÄYTÄNNÖLLINEN TEOLOGIA. KRISTINUSKO
References: KRISTILLINEN LÄHETYSTYÖ
References: Kirkko-oikeus
References: Elämäkerrat. Muistelmat, uskontojen ja kirkkokuntien edustajat
References: Elämäkerralliset hakuteokset, Uskontojen ja kirkkokuntien edustajat
type: YKL-luokka
alternative label: Arkkipiispan istuin, Suomen ev.-lut. kirkko (28.71)
alternative label: Befattningar, Finlands ev.luth. kyrka (28.71) @sv
alternative label: Biskopssäten, Finlands ev.-luth. kyrka (28.71) @sv
alternative label: Evangelisk-lutherska kyrkan, Finland (28.71) @sv
alternative label: Evankelis-luterilainen kirkko, Suomi (28.71)
alternative label: Församlingar, Finlands ev.-luth. kyrka (28.71) @sv
alternative label: Församlingsplaner, Finlands ev.-luth. kyrka (28.71) @sv
alternative label: Förvaltning, Finlands ev.-luth. kyrka (28.71) @sv
alternative label: Hallinto, Suomen ev.-lut. kirkko (28.71)
alternative label: Hiippakunnat, Suomen ev.-lut. kirkko (28.71)
alternative label: Kantorer, ev-luth. kyrkan (28.71) @sv
alternative label: Kanttorit, ev.-lut. kirkko (28.71)
alternative label: Kirkkohallinto, Suomen ev.-lut. kirkko (28.71)
alternative label: Kirkkomuusikot, ev.lut kirkko (28.71)
alternative label: Kirkkoneuvosto, Suomen ev.-lut. kirkko (28.71)
alternative label: Kirkkovaltuustot, Suomen ev.-lut. kirkko (28.71)
alternative label: Kirkolliset laitokset, Suomen ev.-lut. kirkko (28.71)
alternative label: Kirkolliset virat, Suomen ev.-lut. kirkko (28.71)
alternative label: Kirkollisverotus, Suomi (28.71)
alternative label: Kirkon ja valtion suhde, Suomen ev.-lut. kirkko (28.71)
alternative label: Kirkon työntekijät, Suomen ev.-lut. kirkko (28.71)
alternative label: Klockarbefattning, Finlands ev.-luth. kyrka (28.71) @sv
alternative label: Kvinnliga präster, Finlands ev.-luth. kyrka (28.71) @sv
alternative label: Kyrka och stat, relation mellan, Finlands ev.-luth. kyrka (28.71) @sv
alternative label: Kyrkans arbetstagare, Finlands ev.-luth. kyrka (28.71) @sv
alternative label: Kyrkliga institutioner, Finlands ev.-luth. kyrka (28.71) @sv
alternative label: Kyrkliga ämbeten, Finlands ev.-luth. kyrka (28.71) @sv
alternative label: Kyrkobeskattning, Finland (28.71) @sv
alternative label: Kyrkofullmäktige, Finlands ev.-luth. kyrka (28.71) @sv
alternative label: Kyrkoförvaltning, Finlands ev.-luth. kyrka (28.71) @sv
alternative label: Kyrkomusiker, ev.-luth. kyrkan (28.71) @sv
alternative label: Kyrkorådet, Finlands ev.-luth. kyrka (28.71) @sv
alternative label: Lukkarintoimi, Suomen ev.-lut. kirkko (28.71)
alternative label: Naispappeus, Suomen ev.-lut. kirkko (28.71)
alternative label: Papisto, Suomen ev.-lut. kirkko (28.71)
alternative label: Pappiskoulutus, Suomen ev.-lut. kirkko (28.71)
alternative label: Piispanistuimet, Suomen ev.-lut. kirkko (28.71)
alternative label: Prästerskap, Finlands ev.-luth. kyrka (28.71) @sv
alternative label: Prästutbildning, Finlands ev.-luth. kyrka (28.71) @sv
alternative label: Seurakunnat, Suomen ev.-lut. kirkko (28.71)
alternative label: Seurakuntasuunnitelmat, Suomen ev.-lut. kirkko (28.71)
alternative label: Stift, Finlands ev.-luth. kyrka (28.71) @sv
alternative label: Virat, Suomen ev.-lut. kirkon (28.71)
alternative label: Virkateologia, Suomen ev.-lut. kirkko (28.71)
alternative label: Ämbetsteologi, Finlands ev.luth. kyrka (28.71) @sv
alternative label: Ärkebiskopssäte, Finlands ev.-luth. kyrka (28.71) @sv
broader: Protestanttiset kirkot ja yhteisöt
in scheme: YKL - Yleisten kirjastojen luokitusjärjestelmä
narrower: Suomen kirkkohistoria
narrower: Suomen herätysliikkeet
notation: 28.71
preferred label: Finlands evangelisk-lutherska kyrka @sv
preferred label: Finnish Evangelical Lutheran Church @en
scope note: Hit allmänna verk om den evangelisk-lutherska kyrkan i Finland Kyrkans organisation och administration Kyrkans förhållande till stat och samhälle Kyrkans ekonomi. Kyrkoskatt Kyrkliga ämbeten. Ämbetsteologi Kyrkans personal och utbildningen av den Ärkebiskopen. Biskopar. Prästerskap. Kvinnopräster Lektorer. Kyrkomusik Stift. Församlingar. Församlingsplaner Om tyngdpunkten i ett verk om ev.-luth. kyrkan ligger på ett specialområde, ges företräde åt klasserna 22-26+ Kyrko-, biskops-, stifts-, synodal-, och prästmöten 28.71065 Formtillägget 01 används inte i samband med klasserna 20-26.5 och 28.1-29.9 @sv
scope note: Tähän Suomen evankelis-luterilaista kirkkoa koskevat yleisteokset Kirkon organisaatio ja hallinto Kirkon suhde valtioon ja yhteiskuntaan Kirkon talous. Kirkollisverotus Kirkolliset virat. Virkateologia Kirkon henkilökunta ja sen koulutus Arkkipiispa. Piispat. Papisto. Naispappeus Lehtorit. Kirkkomuusikot Hiippakunnat. Seurakunnat. Seurakuntasuunnitelmat Jos Suomen ev.-lut. kirkkoa koskeva teos painottuu johonkin erikoisalaan, annetaan etusija luokille 22-26+ Kirkollis-, piispain-, hiippakunta-, synodaali- ja pappeinkokoukset 28.71065 Muotoluokkaa 01 ei käytetä luokkien 20-26.5 ja 28.1-29.9 yhteydessä

Suomen kirkkohistoria
type: Concept
References: URN:NBN:fi:au:ykl:28.109
References: URN:NBN:fi:au:ykl:28.209
type: YKL-luokka
alternative label: Församlingshistoriker, lutherska kyrkan (28.7109) @sv
alternative label: Kirkkohistoria, Suomi (28.7109)
alternative label: Kyrkohistoria, Finland (28.7109) @sv
alternative label: Reformaatio kirkkohistoria, Suomi (28.7109)
alternative label: Reformation, kyrkohistoria, Finland (28.7109) @sv
alternative label: Seurakuntahistoriikit, luterilainen kirkko (28.7109)
alternative label: Uskonpuhdistus, kirkkohistoria, Suomi (28.7109)
broader: Suomen evankelis-luterilainen kirkko
in scheme: YKL - Yleisten kirjastojen luokitusjärjestelmä
notation: 28.7109
preferred label: Finlands kyrkohistoria @sv
preferred label: Finnish church history @en
scope note: Hit Finlands allmänna kyrkohistoria Hit också den finska ev.-luth. kyrkans historia och den katolska kyrkans historia i Finland under medeltiden @sv
scope note: Tähän Suomen yleinen kirkkohistoria Tähän myös Suomen ev.-lut. kirkon ja Suomen keskiajan katolisen kirkon historia

Suomen herätysliikkeet
type: Concept
type: YKL-luokka
alternative label: Bedjarrörelsen, Finland (28.714) @sv
alternative label: Evangeliska rörelsen, Finland (28.714) @sv
alternative label: Evankelinen liike, Suomi (28.714)
alternative label: Hedbergianism, Finland (28.714) @sv
alternative label: Hedbergiläisyys, Suomi (28.714)
alternative label: Herännäisyys, Suomi (28.714)
alternative label: Herätysliikkeet, Suomi (28.714)
alternative label: Karismaattinen liike, Suomi (28.714)
alternative label: Karismatiska rörelsen, Finland (28.714) @sv
alternative label: Laestadianism, Finland (28.714) @sv
alternative label: Laestadiolaisuus, Suomi (28.714)
alternative label: Lestadianism, Finland (28.714) @sv
alternative label: Lestadiolaisuus, Suomi (28.714)
alternative label: Nypietism, Finland (28.714) @sv
alternative label: Pietism, Finland (28.714) @sv
alternative label: Renqvistianism, Finland (28.714) @sv
alternative label: Renqvistiläisyys, Suomi (28.714)
alternative label: Rukoilevaisuus, Suomi (28.714)
alternative label: Uuspietismi, Suomi (28.714)
alternative label: Väckelserörelser, Finland (28.714) @sv
broader: Suomen evankelis-luterilainen kirkko
in scheme: YKL - Yleisten kirjastojen luokitusjärjestelmä
notation: 28.714
preferred label: Finnish revival movements @en
preferred label: Väckelserörelserna i Finland @sv
scope note: Hit allmänna verk om väckelserörelserna i Finland Bedjarrörelsen. Pietister. Nypietister Laestadianer. Den karismatiska rörelsen Om tyngdpunkten i ett verk om väckelserörelsen ligger på ett specialområde, ges företräde åt klasserna 22-26+ Formtillägget 01 används inte i samband med klasserna 20-26.5 och 28.1-29.9 @sv
scope note: Tähän Suomen herätysliikkeitä koskevat yleisteokset Rukoilevaisuus. Herännäisyys. Uuspietismi Lestadiolaisuus. Karismaattinen liike Jos herätysliikettä koskeva teos painottuu johonkin erikoisalaan, annetaan etusija luokille 22-26+ Muotoluokkaa 01 ei käytetä luokkien 20-26.5 ja 28.1-29.9 yhteydessä

Muut kristillisperäiset yhteisöt
type: Concept
type: YKL-luokka
alternative label: Antitrinitaarit (28.8)
alternative label: Antitrinitarier (28.8) @sv
alternative label: Christian science (28.8)
alternative label: Frikatolicism (28.8) @sv
alternative label: Jehovan todistajat (28.8)
alternative label: Jehovas vittnen (28.8) @sv
alternative label: MRA (28.8)
alternative label: Messiaaniset juutalaiset (28.8)
alternative label: Messianska judar (28.8) @sv
alternative label: Moraalinen varustautuminen (28.8)
alternative label: Moralisk upprustning (28.8) @sv
alternative label: Mormoner (28.8) @sv
alternative label: Mormonit (28.8)
alternative label: Oxfordgrupprörelsen (28.8) @sv
alternative label: Oxfordin ryhmäliike (28.8)
alternative label: Unitaarit (28.8)
alternative label: Unitarierna (28.8) @sv
alternative label: Vapaakatolisuus (28.8)
broader: KRISTILLISET KIRKOT JA YHTEISÖT. KIRKKOHISTORIA
in scheme: YKL - Yleisten kirjastojen luokitusjärjestelmä
notation: 28.8
preferred label: Andra samfund av kristet ursprung @sv
preferred label: Other denominations of Christian origin @en
scope note: Mormoner. Jehovas vittnen. Antitrinitarer. Unitarer. MRA. Christian science Formtillägget 01 används inte i samband med klasserna 20-26.5 och 28.1-29.9 @sv
scope note: Mormonit. Jehovan todistajat. Antitrinitaarit. Unitaarit. MRA. Christian science Muotoluokkaa 01 ei käytetä luokkien 20-26.5 ja 28.1-29.9 yhteydessä

MUUT USKONNOT JA MYTOLOGIAT
type: Concept
References: YLEINEN USKONTOTIEDE
References: URN:NBN:fi:au:ykl:20.09
References: Kristinusko. Teologia
References: USKONNONFILOSOFIA
References: Teosofia
References: Antroposofia
alternative label: Andligt liv, icke-kristna religioner (29+) @sv
alternative label: Animistiset uskonnot, yksittäiset (29+)
alternative label: Animistiska religioner, enskilda (29+) @sv
alternative label: Begravningstjänster, övriga religioner (29+) @sv
alternative label: Demonit, ei-kristilliset uskonnot (29+)
alternative label: Dianetiikka (29)
alternative label: Ei-kristilliset uskonnot ja mytologiat (29+)
alternative label: Enkelit, ei-kristilliset uskonnot (29+)
alternative label: Esoterismi, ei-kristilliset uskonnot (29+)
alternative label: Fetisistiset uskonnot, yksittäiset (29+)
alternative label: Hautauspalvelut, muut uskonnot (29+)
alternative label: Hengellinen elämä, ei-kristilliset uskonnot (29+)
alternative label: Jumalaistarut, ei-kristilliset uskonnot (29+)
alternative label: Jumalat, ei-kristilliset (29+)
alternative label: Kuolemanjälkeinen elämä, ei-kristilliset uskonnot (29+)
alternative label: Kääntymys, ei-kristilliset uskonnot (29+)
alternative label: Loitsut, uusnoituus (29+)
alternative label: Loitsut, uuspakanauus (29+)
alternative label: Luostarit, ei-kristilliset (29+)
alternative label: Lähetystyö, ei-kristilliset uskonnot (29+)
alternative label: Maailmanloppu, ei-kristilliset uskonnot (29+)
alternative label: Munkkijärjestöt, ei-kristilliset uskonnot (29+)
alternative label: Mystiikka, ei-kristilliset uskonnot (29+)
alternative label: Mytologiat, ei-kristillisten uskontojen (29+)
alternative label: Myytit, ei-kristilliset uskonnot (29+)
alternative label: New age, yl. (29)
alternative label: Paholainen, satanismi (29)
alternative label: Paholaiset, ei-kristilliset uskonnot (29+)
alternative label: Polyteistiset uskonnot, yksittäiset (29+)
alternative label: Profetiat, ei-kristilliset uskonnot (29+)
alternative label: Pyhiinvaellukset, ei-kristilliset uskonnot (29+)
alternative label: Pyhäinjäännökset, ei-kristilliset (29+)
alternative label: Pyhät ajat, ei-kristilliset (29+)
alternative label: Pyhät henkilöt, ei-kristilliset (29+)
alternative label: Pyhät kirjat, ei-kristilliset (29+)
alternative label: Pyhät paikat, ei-kristilliset (29+)
alternative label: Rastafari-liike (29)
alternative label: Retriitit, ei-kristilliset uskonnot (29+)
alternative label: Saatana, satanismi (29)
alternative label: Samanistiset uskonnot, yksittäiset (29+)
alternative label: Satanismi (29)
alternative label: Shamanistiset uskonnot, yksittäiset (29+)
alternative label: Sielu, ei-kristilliset uskonnot (29+)
alternative label: Skientologia (29)
alternative label: Spiritualiteetti, ei-kristilliset uskonnot (29+)
alternative label: Symbolit, ei-kristilliset uskonnot (29+)
alternative label: Tabut, ei-kristilliset uskonnot (29+)
alternative label: Totemistiset uskonnot, yksittäiset (29+)
alternative label: Usko, ei-kristilliset uskonnot (29+)
alternative label: Uskonnollinen identiteetti, eri uskonnot (28 ... 29+)
alternative label: Uskonnolliset kokemukset, ei-kristilliset uskonnot (29+)
alternative label: Uskonnonfilosofia, ei-kristilliset uskonnot (29+)
alternative label: Uskonnot, ei-kristilliset (29+)
alternative label: Uskontoantropologia, ei-kristilliset uskonnot (29+)
alternative label: Uskontofenomenologia, ei-kristilliset uskonnot (29+)
alternative label: Uskontokasvatus, ei-kristilliset uskonnot (29+)
alternative label: Uskontopsykologia, ei-kristilliset uskonnot (29+)
alternative label: Uskontososiologia, ei-kristilliset uskonnot (29+)
alternative label: Uusnoituus (29+)
alternative label: Uuspakanuus (29+)
alternative label: Ympärileikkaus, uskontotiede, eri uskonnot (29+)
broader: USKONTO
in scheme: YKL - Yleisten kirjastojen luokitusjärjestelmä
narrower: Suomalais-ugrilaisten kansojen muinaisuskonnot ja mytologiat
narrower: Antiikin uskonnot ja mytologiat
narrower: Muinaisgermaaniset, muinaisbalttilaiset, muinais- pohjoismaiset, muinaisslaavilaiset ja muinaiskelttiläiset uskonnot ja mytologiat
narrower: Itämaiset uskonnot ja mytologiat
narrower: Juutalaisten uskonto ja sen mytologia
narrower: Islam ja sen mytologia
narrower: Alkuperäiskansojen uskonnot ja mytologiat
notation: 29
scope note: Hit och till underklasserna icke-kristna religioner och verk om deras mytologier New age rörelsen i allmänhet. Rastafarirörelsen. Satanism. Dianetik. Scientologi Formtillägget 01 används inte i samband med klasserna 20-26.5 och 28.1-29.9 @sv
scope note: Tähän ja alaluokkiin ei-kristillisiä uskontoja ja niiden mytologioita koskevat teokset New age -liike yleensä. Rastafari-liike. Satanismi. Dianetiikka. Skientologia Muotoluokkaa 01 ei käytetä luokkien 20-26.5 ja 28.1-29.9 yhteydessä

Suomalais-ugrilaisten kansojen muinaisuskonnot ja mytologiat
type: Concept
type: YKL-luokka
alternative label: Finsk-ugrisk religion och mytologier (29.2) @sv
alternative label: Forntida religioner, finsk-ugriska (29.2) @sv
alternative label: Muinaisuskonnot, suomalais-ugrilaiset (29.2)
alternative label: Saamelaiset, uskonto ja mytologia (29.2)
alternative label: Samer, religion och mytologi (29.2) @sv
alternative label: Suomalais-ugrilainen uskonto ja mytologia (29.2)
broader: MUUT USKONNOT JA MYTOLOGIAT
in scheme: YKL - Yleisten kirjastojen luokitusjärjestelmä
notation: 29.2
preferred label: Ancient religions and mythologies of the Finno-Ugric peoples @en
preferred label: De finsk-ugriska folkens fornreligioner och mytologier @sv
scope note: Formtillägget 01 används inte i samband med klasserna 20-26.5 och 28.1-29.9 @sv
scope note: Muotoluokkaa 01 ei käytetä luokkien 20-26.5 ja 28.1-29.9 yhteydessä

Antiikin uskonnot ja mytologiat
type: Concept
type: YKL-luokka
alternative label: Antiikki, uskonnot ja mytologiat (29.3)
alternative label: Antiken, religioner och mytologier (29.3) @sv
alternative label: Egypten, forntida religioner och mytologier (29.3) @sv
alternative label: Egypti, muinaisuskonnot ja mytologiat (29.3)
alternative label: Etrusker, religioner och mytologier (29.3) @sv
alternative label: Etruskit, uskonnot ja mytologiat (29.3)
alternative label: Etu-Aasia, muinaisuskonnot ja mytologiat (29.3)
alternative label: Forntida religioner, antiken (29.3) @sv
alternative label: Främre Asien, forntida religioner och mytologier (29.3) @sv
alternative label: Gnosticism (29.3) @sv
alternative label: Gnostilaisuus (29.3)
alternative label: Grekland, antikens religioner och mytologier (29.3) @sv
alternative label: Gudasagor, antikens religioner (29.3) @sv
alternative label: Jumalaistarut, antiikin uskonnot (29.3)
alternative label: Kreikka, antiikin uskonnot ja mytologiat (29.3)
alternative label: Mesopotamia, muinaisuskonnot ja mytologiat (29.3)
alternative label: Mesopotamien, forntida religioner och mytologier (29.3) @sv
alternative label: Mithran kultti (29.3)
alternative label: Mithras kult (29.3) @sv
alternative label: Muinaisuskonnot, antiikin (29.3)
alternative label: Mytologiat, antiikin uskontojen (29.3)
alternative label: Mytologier, antikens religioner (29.3) @sv
alternative label: Romerska riket, antikens religioner och mytologier (29.3) @sv
alternative label: Rooman valtakunta, antiikin uskonnot ja mytologiat (29.3)
broader: MUUT USKONNOT JA MYTOLOGIAT
in scheme: YKL - Yleisten kirjastojen luokitusjärjestelmä
notation: 29.3
preferred label: Antikens religioner och mytologi @sv
preferred label: Religions and mythologies of the antiquity @en
scope note: Antiikin Kreikan ja Rooman uskonnot Egyptin, Pohjois-Afrikan, Syyrian, Palestiinan ja Mesopotamian muinaisuskonnot. Mithran kultti. Gnostilaisuus Muotoluokkaa 01 ei käytetä luokkien 20-26.5 ja 28.1-29.9 yhteydessä
scope note: Religionerna i antikens Grekland och Rom Religionerna i det forna Egypten, Nordafrika, Syrien, Palestina och Mesopotamien. Mithraskulten. Gnosticism Formtillägget 01 används inte i samband med klasserna 20-26.5 och 28.1-29.9 @sv

Muinaisgermaaniset, muinaisbalttilaiset, muinais- pohjoismaiset, muinaisslaavilaiset ja muinaiskelttiläiset uskonnot ja mytologiat
type: Concept
type: YKL-luokka
alternative label: Baltiska forntida religioner och mytologier (29.4) @sv
alternative label: Balttilaiset muinaisuskonnot ja mytologiat (29.4)
alternative label: Forntida religioner, baltiska (29.4) @sv
alternative label: Forntida religioner, germanska (29.4) @sv
alternative label: Forntida religioner, keltiska (29.4) @sv
alternative label: Forntida religioner, nordiska (29.4) @sv
alternative label: Forntida religioner, slaviska (29.4) @sv
alternative label: Germaaniset muinaisuskonnot ja mytologiat (29.4)
alternative label: Germanska fornreligioner och mytologier (29.4) @sv
alternative label: Gudasagor, nordiska (29.4) @sv
alternative label: Jumalaistarut, pohjoismaiset (29.4)
alternative label: Kelter, forntida religioner och mytologier (29.4) @sv
alternative label: Keltit, muinaisuskonnot ja mytologiat (29.4)
alternative label: Muinaisuskonnot, balttilaiset (29.4)
alternative label: Muinaisuskonnot, germaaniset (29.4)
alternative label: Muinaisuskonnot, kelttiläiset (29.4)
alternative label: Muinaisuskonnot, pohjoismaiset (29.4)
alternative label: Muinaisuskonnot, slaavilaiset (29.4)
alternative label: Mytologiat, pohjoismaisten uskontojen (29.4)
alternative label: Mytologier, nordiska religioner (29.4) @sv
alternative label: Nordiska fornreligioner och mytologier (29.4) @sv
alternative label: Pohjoismaiset muinaisuskonnot ja mytologiat (29.4)
alternative label: Slaavilaiset muinaisuskonnot ja mytologiat (29.4)
alternative label: Slaviska fornreligioner och mytologier (29.4) @sv
alternative label: Viikingit, uskonto ja mytologia (29.4)
alternative label: Vikingar, religion och mytologi (29.4) @sv
broader: MUUT USKONNOT JA MYTOLOGIAT
in scheme: YKL - Yleisten kirjastojen luokitusjärjestelmä
notation: 29.4
preferred label: Ancient Germanic, ancient Baltic, ancient Norse, ancient Slavonic and ancient Celtic religions and mythologies @en
preferred label: Forngermanska, fornbaltiska, fornnordiska, fornslaviska och fornkeltiska religioner och mytologier @sv
scope note: Formtillägget 01 används inte i samband med klasserna 20-26.5 och 28.1-29.9 @sv
scope note: Muotoluokkaa 01 ei käytetä luokkien 20-26.5 ja 28.1-29.9 yhteydessä

Itämaiset uskonnot ja mytologiat
type: Concept
References: Itämainen filosofia
References: Rukous. Hartaudenharjoitus
References: Juutalaisten uskonto ja sen mytologia
References: Islam ja sen mytologia
References: Rentoutus. Uni. Unettomuus
References: Yleinen taidehistoria, Aasia
References: Itämaisperäiset lajit ja kamppailulajit
type: YKL-luokka
alternative label: Aasia, itämaiset uskonnot (29.5+)
alternative label: Ananda Marga (29.5)
alternative label: Asien, österländska religioner (29.5+) @sv
alternative label: Askeesi, itämaiset uskonnot (29.5+)
alternative label: Askes, österländska religioner (29.5+) @sv
alternative label: Avesta, Persian uskonnot (29.5)
alternative label: Avesta, Persiens religioner (29.5) @sv
alternative label: Bahai (29.5) @sv
alternative label: Bahai-usko (29.5)
alternative label: Chakrat, itämainen filosofia(29.5+)
alternative label: Chakror, österländsk filosofi(29.5+) @sv
alternative label: Forntida religioner, österländska (29.5+) @sv
alternative label: Gudasagor, österländska religioner (29.5+) @sv
alternative label: Hare Krishna (29.5)
alternative label: Itämaiset uskonnot (29.5+)
alternative label: Jumalaistarut, itämaiset uskonnot (29.5+)
alternative label: Kontemplation, transcendental (29.5) @sv
alternative label: Kontemplation, österländska religioner (29.5+) @sv
alternative label: Manikealaisuus (29.5)
alternative label: Manikeism (29.5) @sv
alternative label: Mazdaism (29.5) @sv
alternative label: Mazdalaisuus (29.5)
alternative label: Meditaatio, itämaiset uskonnot (29.5+)
alternative label: Meditaatio, transsendenttinen (29.5)
alternative label: Meditation, transcendental (29.5) @sv
alternative label: Meditation, österländska religioner (29.5+) @sv
alternative label: Mietiskely, itämaiset uskonnot (29.5+)
alternative label: Mietiskely, transsendenttinen (29.5)
alternative label: Muinaisuskonnot, itämaiset (29.5+)
alternative label: Mytologiat, itämaisten uskontojen (29.5+)
alternative label: Mytologier, österländska religioner (29.5+) @sv
alternative label: Parsilaisuus (29.5)
alternative label: Parsism (29.5) @sv
alternative label: Persia, uskonnot ja mytologiat (29.5)
alternative label: Persien, religioner och mytologier (29.5) @sv
alternative label: Religioner, österländska (29.5+) @sv
alternative label: TM-meditering (29.5) @sv
alternative label: TM-mietiskely (29.5)
alternative label: Transcendental meditation (29.5) @sv
alternative label: Transsendenttinen mietiskely (29.5)
alternative label: Uskonnot, itämaiset (29.5+)
alternative label: Zarathustralaisuus (29.5)
alternative label: Zoroastrialaisuus (29.5)
alternative label: Zoroastrism (29.5) @sv
alternative label: Österländska religioner (29.5+) @sv
broader: MUUT USKONNOT JA MYTOLOGIAT
in scheme: YKL - Yleisten kirjastojen luokitusjärjestelmä
narrower: Itä-Aasian uskonnot ja mytologiat
narrower: Intian uskonnot ja mytologiat
narrower: Buddhalaisuus ja sen mytologia
notation: 29.5
preferred label: Oriental religions and mythologies @en
preferred label: Österländska religioner och mytologier @sv
scope note: Hit och till underklasserna också meditation och askes ur de österländska religionernas synvinkel Hit persiska religioner såsom parsism, mazdaism, zoroastrism, zarathustralära och manikeism Hit också nya religiösa rörelser av österländskt ursprung såsom Ananda Marga, Hare Krishna och TM Hit också bahai Formtillägget 01 används inte i samband med klasserna 20-26.5 och 28.1-29.9 @sv
scope note: Tähän ja alaluokkiin myös meditaatio ja askeesi itämaisten uskontojen kannalta Tähän Persian uskonnot, kuten parsilaisuus, mazdalaisuus, zoroastrialaisuus, zarathustralaisuus ja manikealaisuus Tähän myös uudet itämaisperäiset uskonnolliset liikkeet, kuten Ananda Marga, Hare Krishna ja TM Tähän myös bahai-usko Muotoluokkaa 01 ei käytetä luokkien 20-26.5 ja 28.1-29.9 yhteydessä

Itä-Aasian uskonnot ja mytologiat
type: Concept
References: Buddhalaisuus ja sen mytologia
type: YKL-luokka
alternative label: Daoism (29.51) @sv
alternative label: Daolaisuus (29.51)
alternative label: Itä-Aasia, uskonnot ja mytologiat (29.51)
alternative label: Konfucianism (29.51) @sv
alternative label: Konfutselaisuus (29.51)
alternative label: Kungfutselaisuus (29.51)
alternative label: Ostasien, religioner och mytologier (29.51) @sv
alternative label: Shintoism (29.51) @sv
alternative label: Sintolaisuus (29.51)
alternative label: Taoism (29.51) @sv
alternative label: Taolaisuus (29.51)
broader: Itämaiset uskonnot ja mytologiat
in scheme: YKL - Yleisten kirjastojen luokitusjärjestelmä
notation: 29.51
preferred label: Religions and mythologies of Eastern Asia @en
preferred label: Östasiatiska religioner och mytologier @sv
scope note: Konfucianism. Taoism. Shintoism Formtillägget 01 används inte i samband med klasserna 20-26.5 och 28.1-29.9 @sv
scope note: Kungfutselaisuus. Taolaisuus. Sintolaisuus Muotoluokkaa 01 ei käytetä luokkien 20-26.5 ja 28.1-29.9 yhteydessä

Intian uskonnot ja mytologiat
type: Concept
References: Itämaiset uskonnot ja mytologiat
References: Buddhalaisuus ja sen mytologia
References: Rentoutus. Uni. Unettomuus
References: Jooga
type: YKL-luokka
alternative label: Askeesi, Intian uskonnot (29.52)
alternative label: Askes, Indiens religioner (29.52) @sv
alternative label: Atharvaveda (29.52)
alternative label: Bhagavad Gita (29.52)
alternative label: Bhagavad-Gita (29.52) @sv
alternative label: Brahmalaisuus (29.52)
alternative label: Brahmanism (29.52) @sv
alternative label: Hinduism (29.52) @sv
alternative label: Hindulaisuus (29.52)
alternative label: Indien, religioner och mytologier (29.52) @sv
alternative label: Intia, uskonnot ja mytologiat (29.52)
alternative label: Jainalaisuus (29.52)
alternative label: Jainism (29.52) @sv
alternative label: Jooga, Intian uskonnot (29.52)
alternative label: Jälleensyntyminen, Intian uskonnot ja mytologiat (29.52)
alternative label: Kaster, hinduism (29.52) @sv
alternative label: Kastit, hindulaisuus (29.52)
alternative label: Kontemplation, Indiens religioner (29.52) @sv
alternative label: Kontemplation, yoga, indiska religioner (29.52) @sv
alternative label: Mahabharata (29.52)
alternative label: Meditaatio, Intian uskonnot (29.52)
alternative label: Meditaatio, jooga, Intian uskonnot (29.52)
alternative label: Meditation, Indiens religioner (29.52) @sv
alternative label: Meditation, yoga, indiska religioner (29.52) @sv
alternative label: Mietiskely, Intian uskonnot (29.52)
alternative label: Mietiskely, jooga, Intian uskonnot (29.52)
alternative label: Ramayana (29.52)
alternative label: Reinkarnaatio, Intian uskonnot ja mytologiat (29.52)
alternative label: Reinkarnation, Indiens religioner och mytologier (29.52) @sv
alternative label: Rigveda (29.52)
alternative label: Samaveda (29.52)
alternative label: Sielunvaellus, Intian uskonnot ja mytologiat (29.52)
alternative label: Sikhiläisyys, uskonto (29.52)
alternative label: Sikhism, religion (29.52) @sv
alternative label: Själavandring, Indiens religioner och mytologier (29.52) @sv
alternative label: Tantra (29.52)
alternative label: Upanisadit (29.52)
alternative label: Upanishaderna (29.52) @sv
alternative label: Veda-kirjat (29.52)
alternative label: Vedaböcker (29.52) @sv
alternative label: Vedalaisuus (29.52)
alternative label: Vedism (29.52) @sv
alternative label: Yajurveda (29.52)
alternative label: Yoga, Indiens religioner (29.52) @sv
broader: Itämaiset uskonnot ja mytologiat
in scheme: YKL - Yleisten kirjastojen luokitusjärjestelmä
notation: 29.52
preferred label: Indiska religioner och mytologier @sv
preferred label: Religions and mythologies of India @en
scope note: Hinduism. Brahmanism. Jainism. Vedism. Sikher Hit också yoga, askes och och meditation ur de indiska religionernas synvinkel Formtillägget 01 används inte i samband med klasserna 20-26.5 och 28.1-29.9 @sv
scope note: Hindulaisuus. Brahmalaisuus. Jainalaisuus. Vedalaisuus. Sikhiläisyys Tähän myös jooga, askeesi ja meditaatio Intian uskontojen kannalta Muotoluokkaa 01 ei käytetä luokkien 20-26.5 ja 28.1-29.9 yhteydessä

Buddhalaisuus ja sen mytologia
type: Concept
References: Rentoutus. Uni. Unettomuus
type: YKL-luokka
alternative label: Askeesi, buddhalaisuus (29.53)
alternative label: Askes, buddhism (29.53) @sv
alternative label: Buddhalaisuus (29.53)
alternative label: Buddhism (29.53) @sv
alternative label: Hinajana (29.53)
alternative label: Hinayana (29.53) @sv
alternative label: Jälleensyntyminen, buddhalaisuus (29.53)
alternative label: Karmamudra (29.53)
alternative label: Kontemplation, buddhism (29.53) @sv
alternative label: Lamaism (29.53) @sv
alternative label: Lamalaisuus (29.53)
alternative label: Mahajana (29.53)
alternative label: Meditaatio, buddhalaisuus (29.53)
alternative label: Meditation, buddhism (29.53) @sv
alternative label: Mietiskely, buddhalaisuus (29.53)
alternative label: Nirvana, buddhalaisuus (29.53)
alternative label: Nirvana, buddhism (29.53) @sv
alternative label: Reinkarnaatio, buddhalaisuus (29.53)
alternative label: Reinkarnation, buddhism (29.53) @sv
alternative label: Sielunvaellus, buddhalaisuus (29.53)
alternative label: Själavandring, buddhism (29.53) @sv
alternative label: Tibetansk buddhism (29.53) @sv
alternative label: Tiibetinbuddhalaisuus (29.53)
alternative label: Tipitaka (29.53)
alternative label: Tripitaka (29.53)
alternative label: Zen (29.53)
broader: Itämaiset uskonnot ja mytologiat
in scheme: YKL - Yleisten kirjastojen luokitusjärjestelmä
notation: 29.53
preferred label: Buddhism and Buddhist mythology @en
preferred label: Buddhism och buddhistisk mytologi @sv
scope note: Hinajana. Mahajana. Tiibetinbuddhalaisuus. Zen. Tähän myös meditaatio ja askeesi buddhalaisuuden kannalta. Muotoluokkaa 01 ei käytetä luokkien 20-26.5 ja 28.1-29.9 yhteydessä
scope note: Hinayana. Mahayana. Tibetansk buddhism. Zen Hit också meditation och askes ur buddhistisk synvinkel. Formtillägget 01 används inte i samband med klasserna 20-26.5 och 28.1-29.9 @sv

Juutalaisten uskonto ja sen mytologia
type: Concept
References: Okkultismi. Spiritismi. Spiritualismi. Henkimaailma
References: Vanha testamentti
References: Israelin ja Palestiinan historia
type: YKL-luokka
alternative label: Israel, religion (29.6) @sv
alternative label: Israel, uskonto (29.6)
alternative label: Judar, religion och mytologi (29.6) @sv
alternative label: Judendom, religion och mytologi (29.6) @sv
alternative label: Juutalaiset, uskonto ja mytologia (29.6)
alternative label: Juutalaisuus, uskonto ja mytologia (29.6)
alternative label: Sionism, judarnas religion (29.6) @sv
alternative label: Sionismi, juutalaisten uskonto (29.6)
alternative label: Talmud (29.6)
broader: MUUT USKONNOT JA MYTOLOGIAT
in scheme: YKL - Yleisten kirjastojen luokitusjärjestelmä
notation: 29.6
preferred label: Judaism and Jewish mythology @en
preferred label: Judisk religion och mytologi @sv
scope note: Talmud Formtillägget 01 används inte i samband med klasserna 20-26.5 och 28.1-29.9 @sv
scope note: Talmud Muotoluokkaa 01 ei käytetä luokkien 20-26.5 ja 28.1-29.9 yhteydessä

Islam ja sen mytologia
type: Concept
References: Itämaiset uskonnot ja mytologiat
type: YKL-luokka
alternative label: Islam (29.7)
alternative label: Islamin laki (29.7)
alternative label: Islamisk lag (29.7) @sv
alternative label: Koraani (29.7)
alternative label: Koranen (29.7) @sv
alternative label: Shia (29.7) @sv
alternative label: Shialaisuus (29.7)
alternative label: Sufilaisuus (29.7)
alternative label: Sufism (29.7) @sv
alternative label: Sunnilaisuus (29.7)
alternative label: Sunnism (29.7) @sv
broader: MUUT USKONNOT JA MYTOLOGIAT
in scheme: YKL - Yleisten kirjastojen luokitusjärjestelmä
notation: 29.7
preferred label: Islam and Islamic mythology @en
preferred label: Islam och islamisk mytologi @sv
scope note: Muhamettilaisuus Sunnilaisuus. Shialaisuus. Sufilaisuus Koraani. Islamilainen laki Muotoluokkaa 01 ei käytetä luokkien 20-26.5 ja 28.1-29.9 yhteydessä
scope note: Muhammedanism Sunna. Shia. Sufism Koranen. Islamisk lag Formtillägget 01 används inte i samband med klasserna 20-26.5 och 28.1-29.9 @sv

Alkuperäiskansojen uskonnot ja mytologiat
type: Concept
References: YLEINEN USKONTOTIEDE
References: KANSATIEDE. KULTTUURIANTROPOLOGIA
type: YKL-luokka
alternative label: Aasia, alkuperäiskansojen uskonnot (29.9)
alternative label: Afrika, urbefolkningars religioner (29.9) @sv
alternative label: Afrikka, alkuperäiskansojen uskonnot (29.9)
alternative label: Alkuperäiskansat, uskonnot ja mytologiat (29.9)
alternative label: Amerika, urbefolkningars religioner (29.9) @sv
alternative label: Amerikka, alkuperäiskansojen uskonnot (29.9)
alternative label: Asien, urbefolkningars religioner (29.9) @sv
alternative label: Asteekit, uskonnot ja mytologia (29.9)
alternative label: Australia, aboriginaalit, uskonnot (29.9)
alternative label: Australien, aboriginer, religioner (29.9) @sv
alternative label: Azteker, religioner och mytologi (29.9) @sv
alternative label: Inkafolket, religion och mytologier (29.9) @sv
alternative label: Inkat, uskonto ja mytologia (29.9)
alternative label: Inuiter, religioner och mytologier (29.9) @sv
alternative label: Inuitit, uskonnot ja mytologiat (29.9)
alternative label: Jälleensyntyminen, alkuperäiskansojen uskonnot (29.9)
alternative label: Luonnonkansat, uskonnot ja mytologiat (29.9)
alternative label: Mayafolket, religion och mytologi (29.9) @sv
alternative label: Mayat, uskonto ja mytologia (29.9)
alternative label: Naturfolk, religioner och mytologier (29.9) @sv
alternative label: Oceanien, urbefolkningarnas religioner (29.9) @sv
alternative label: Oseania, alkuperäiskansojen uskonnot (29.9)
alternative label: Reinkarnaatio, alkuperäiskansojen uskonnot (29.9)
alternative label: Reinkarnation, urbefolkningarnas religioner (29.9) @sv
alternative label: Sielunvaellus, alkuperäiskansojen uskonnot (29.9)
alternative label: Själavandring, urbefolkningarnas religioner (29.9) @sv
alternative label: Urbefolkningar, religioner och mytologier (29.9) @sv
broader: MUUT USKONNOT JA MYTOLOGIAT
in scheme: YKL - Yleisten kirjastojen luokitusjärjestelmä
notation: 29.9
preferred label: Religions and mythologies of the indigenous peoples @en
preferred label: Ursprungsfolkens religioner och deras mytologi @sv
scope note: Aasian, Afrikan, Amerikan, Australian ja Oseanian sekä napamaiden alkuperäis- tai luonnonkansojen uskonnot Muotoluokkaa 01 ei käytetä luokkien 20-26.5 ja 28.1-29.9 yhteydessä
scope note: Ursprungs- eller naturfolkens religioner i Asien, Afrika, Amerika, Australien och Oceanien samt Polarländerna Formtillägget 01 används inte i samband med klasserna 20-26.5 och 28.1-29.9 @sv

YHTEISKUNTA
type: Concept
type: YKL-luokka
in scheme: YKL - Yleisten kirjastojen luokitusjärjestelmä
narrower: YLEINEN YHTEISKUNTATIEDE
narrower: TILASTOTIEDE
narrower: VALTIO-OPPI. POLITIIKKA
narrower: OIKEUSTIEDE
narrower: ALUESUUNNITTELU. ALUEPOLITIIKKA
narrower: HALLINTO
narrower: TALOUSTIEDE. KANSANTALOUSTIEDE
narrower: SOSIAALIPOLITIIKKA
narrower: KASVATUS. OPETUS. KASVATUSTIEDE
narrower: MAANPUOLUSTUS
notation: 3
preferred label: SAMHÄLLE @sv
preferred label: SOCIETY @en
top concept of: YKL - Yleisten kirjastojen luokitusjärjestelmä

YLEINEN YHTEISKUNTATIEDE
type: Concept
References: TILASTOTIEDE
References: VALTIO-OPPI. POLITIIKKA
References: OIKEUSTIEDE
References: ALUESUUNNITTELU. ALUEPOLITIIKKA
References: HALLINTO
References: TALOUSTIEDE. KANSANTALOUSTIEDE
References: SOSIAALIPOLITIIKKA
References: KASVATUS. OPETUS. KASVATUSTIEDE
References: MAANPUOLUSTUS
References: MAAILMANHISTORIA. EUROOPAN HISTORIA
References: SUOMEN HISTORIA
References: POHJOISMAIDEN HISTORIA
References: KESKI-EUROOPAN HISTORIA
References: BRITTEINSAARTEN HISTORIA
References: ETELÄ-EUROOPAN HISTORIA
References: ITÄ-EUROOPAN HISTORIA
References: MUIDEN MAANOSIEN HISTORIA
type: YKL-luokka
alternative label: Arvostelu, yhteiskunta (30+)
alternative label: Etnografi, samhällsvetenskaper (30+) @sv
alternative label: Etnografia, yhteiskuntatieteet (30+)
alternative label: Försörjningskvot (30+) @sv
alternative label: Försörjningskvot, samhällspolitik (30+) @sv
alternative label: Huoltosuhde (30+)
alternative label: Huoltosuhde, yhteiskuntapolitiikka (30+)
alternative label: Kritiikki, yhteiskunta (30+)
alternative label: Kritik, samhället (30+) @sv
alternative label: Kritik, samhällskritik (30+) @sv
alternative label: Samhälle (30+) @sv
alternative label: Samhällsfilosofi (30+) @sv
alternative label: Samhällskritik (30+) @sv
alternative label: Samhällspolitik (30+) @sv
alternative label: Samhällsvetenskaper (30+) @sv
alternative label: Samhällsvetenskaper, filosofi (30+) @sv
alternative label: Tieteenfilosofia, yhteiskuntatieteet (30+)
alternative label: Utopiat, yhteiskuntafilosofia (30+)
alternative label: Utopier, samhällsfilosofi (30+) @sv
alternative label: Vetenskapsfilosofi, samhällsvetenskaper (30+) @sv
alternative label: Yhteiskunta (30+)
alternative label: Yhteiskuntafilosofia (30+)
alternative label: Yhteiskuntakritiikki (30+)
alternative label: Yhteiskuntapolitiikka (30+)
alternative label: Yhteiskuntatieteet (30+)
alternative label: Yhteiskuntatieteet, filosofia (30+)
broader: YHTEISKUNTA
in scheme: YKL - Yleisten kirjastojen luokitusjärjestelmä
narrower: Sosiologia
narrower: Kansalaistoiminta ja –aktivismi. Järjestötoiminta. Kokoustekniikka.
narrower: Käytös- ja tapatieto
notation: 30
preferred label: ALLMÄN SAMHÄLLSVETENSKAP @sv
preferred label: SOCIAL SCIENCES @en
scope note: Hit allmänna verk om samhällsvetenskap samt verk som behandlar flera olika samhällsvetenskapliga områden. Om verket behandlar ett speciellt område inom samhällsvetenskapen, ges företräde åt ifrågavarande klass. Allmän samhällsfilosofi samt samhällsvetenskaplig filosofi och teori och samhällsvetenskapliga forskningsmetoder i allmänhet 30.01. Läroböcker i samhällslära, samhällskunskap och medborgarkunskap 30.07 @sv
scope note: Tähän yhteiskuntatieteitä koskevat yleisteokset sekä teokset, jotka koskevat useampaa eri yhteiskuntatieteen alaa. Jos teos kuitenkin painottuu johonkin tiettyyn yhteis- kuntatieteen alaan, annetaan etusija ko. alan luokalle. Yleinen yhteiskuntafilosofia sekä yhteiskuntatieteiden filosofia, teoria ja tutkimusmenetelmät yleensä 30.01. Yhteiskuntaopin, yhteiskuntatiedon ja kansalaistaidon oppikirjat 30.07

Sosiologia
type: Concept
modified: 2026-02-24T13:25:35
References: Elämäntapojen sosiologia. Kulttuurisosiologia
References: Sosiaalipsykologia
References: Perhesosiologia
References: SOSIAALIPOLITIIKKA
References: KANSATIEDE. KULTTUURIANTROPOLOGIA
type: YKL-luokka
alternative label: Attitydsbarometrar, sociologi (30.1) @sv
alternative label: Barometrit, sosiologia (30.1)
alternative label: Biografier, sociologi, forskning (30.1) @sv
alternative label: Elämäkerrat, sosiologia, tutkimus (30.1)
alternative label: Elämäkertatutkimus, sosiologia (30.1)
alternative label: Livshistorieforskning, sociologi (30.1) @sv
alternative label: Opinionsmätare, sociologi (30.1) @sv
alternative label: Publikundersökning, sociologi (30.1+) @sv
alternative label: Samhällsundersökningar, sociologiska (30.1+) @sv
alternative label: Sociala problem, sociologi (30.1) @sv
alternative label: Sociologi (30.1+) @sv
alternative label: Sosiaaliset ongelmat, sosiologia (30.1)
alternative label: Sosiologia (30.1+)
alternative label: Yhteiskuntatutkimukset, sosiologiset (30.1+)
alternative label: Yleisötutkimus, sosiologia (30.1+)
broader: YLEINEN YHTEISKUNTATIEDE
in scheme: YKL - Yleisten kirjastojen luokitusjärjestelmä
narrower: Sosiaaliset järjestelmät
narrower: Elämäntapojen sosiologia. Kulttuurisosiologia
narrower: Sosiaalipsykologia
narrower: Perhesosiologia
narrower: Kriminologia. Kriminaalisosiologia
notation: 30.1
preferred label: Sociologi @sv
preferred label: Sociology @en
scope note: Hit allmänna verk om sociologi och allmänna verk om riktningarna inom sociologin Hit och till underklasserna också allmänna sociologiska samhällsundersökningar Om verket passar i klasserna för kultursociologi, familjesociologi och socialpsykologi, ges företräde i följande ordning: kultursociologi, familjesociologi, socialpsykologi Om verket behandlar både sociologi och socialpolitik, ges företräde åt klass 37+ Sociologi inom specialområden klassificeras enligt område @sv
scope note: Tähän sosiologian yleisteokset sekä yleisteokset sosiologian suuntauksista Tähän ja alaluokkiin myös yleiset sosiologiset yhteiskuntatutkimukset Jos teos sopii sekä kulttuurisosiologian, perhesosiologian että sosiaalipsykologian luokkaan, annetaan etusija järjestyksessä: kulttuurisosiologia, perhesosiologia, sosiaalipsykologia Jos teos koskee sekä sosiologiaa että sosiaalipolitiikkaa, annetaan etusija luokalle 37+ Erikoisalojen sosiologia luokitetaan alan mukaan

Sosiaaliset järjestelmät
type: Concept
References: Valtiofilosofia. Poliittiset ideologiat
References: TALOUSTIEDE. KANSANTALOUSTIEDE
References: Tuotanto. Tuottavuus
References: KANSATIEDE. KULTTUURIANTROPOLOGIA
alternative label: Aatelisto, sosiologia, yl. (30.11+)
alternative label: Adel, sociologi, allm. (30.11+) @sv
alternative label: Ammatillinen jakautuminen, sosiologia (30.11+)
alternative label: Arbetarklassen, sociologi (30.11+) @sv
alternative label: Borgerskapet, sociologi (30.11+) @sv
alternative label: Bönder, sociologi (30.11+) @sv
alternative label: Digitaalinen kuilu (30.11+)
alternative label: Digitala klyftan (30.11+) @sv
alternative label: Eliitit, sosiologia (30.11)
alternative label: Eliter, sociologi (30.11) @sv
alternative label: Feodaaliyhteiskunnat, sosiologia (30.11+)
alternative label: Feodalsamhällen, sociologi (30.11+) @sv
alternative label: Globalisaatio, yhteiskuntakehitys (30.11+)
alternative label: Globalisering, samhällsutveckling (30.11+) @sv
alternative label: Informaatioyhteiskunta (30.11)
alternative label: Informationssamhälle (30.11) @sv
alternative label: Intelligentia, sociologi (30.11) @sv
alternative label: Kapitalistiset yhteiskunnat, sosiologia (30.11+)
alternative label: Kapitalistiska samhällen, sociologi (30.11+) @sv
alternative label: Kaster, sociologi (30.11+) @sv
alternative label: Kastit, sosiologia (30.11+)
alternative label: Keskiluokka, sosiologia (30.11+)
alternative label: Klassamhällen, sociologi (30.11+) @sv
alternative label: Kolonialistiset yhteiskunnat, sosiologia (30.11+)
alternative label: Kolonialistiska samhällen, sociologi (30.11+) @sv
alternative label: Luokkayhteiskunnat, sosiologia (30.11+)
alternative label: Medelklassen, sociologi (30.11+) @sv
alternative label: Orjayhteiskunnat, sosiologia (30.11+)
alternative label: Palvelijat, yhteiskuntaluokat (30.11)
alternative label: Palvelusväki (30.11)
alternative label: Porvaristo, sosiologia (30.11+)
alternative label: Prekariaatti, sosiaalinen kerrostuneisuus (30.11+)
alternative label: Prekariat, social stratifiering (30.11+) @sv
alternative label: Prekarisaatio, sosiaalinen kerrostuneisuus (30.11+)
alternative label: Prekarisering, social stratifiering (30.11+) @sv
alternative label: Samhällsklasser, sociologi (30.11+) @sv
alternative label: Samhällssystem, sociologi (30.11+) @sv
alternative label: Slavsamhällen, sociologi (30.11+) @sv
alternative label: Släktsamhällen, sociologi (30.11+) @sv
alternative label: Social rörlighet (30.11+) @sv
alternative label: Social skiktning (30.11+) @sv
alternative label: Sociala strukturer (30.11+) @sv
alternative label: Sociala system (30.11+) @sv
alternative label: Socialistiska samhällen, sociologi (30.11+) @sv
alternative label: Sosiaalinen kerrostuneisuus (30.11+)
alternative label: Sosiaalinen liikkuvuus (30.11+)
alternative label: Sosiaaliset järjestelmät (30.11+)
alternative label: Sosiaaliset rakenteet (30.11+)
alternative label: Sosialistiset yhteiskunnat, sosiologia (30.11+)
alternative label: Ständer, sociologi (30.11+) @sv
alternative label: Ståndcirkulation, sociologi (30.11+) @sv
alternative label: Sukulaisyhteiskunnat, sosiologia (30.11+)
alternative label: Säädyt, sosiologia (30.11+)
alternative label: Säätykierto, sosiologia (30.11+)
alternative label: Talonpojat, sosiologia (30.11+)
alternative label: Tietoyhteiskunta (30.11)
alternative label: Tjänare, samhällsklasser (30.11) @sv
alternative label: Tjänstefolk (30.11) @sv
alternative label: Työväenluokka, sosiologia (30.11+)
alternative label: U-samhälle (30.11) @sv
alternative label: Ubiikkiyhteiskunta (30.11)
alternative label: Yhteiskuntajärjestelmät, sosiologia (30.11+)
alternative label: Yhteiskuntaluokat, sosiologia (30.11+)
alternative label: Yläluokka, sosiologia (30.11+)
alternative label: Yrkesmässig fördelning, sociologi (30.11+) @sv
alternative label: Älymystö, sosiologia (30.11)
alternative label: Överklassen, sociologi (30.11+) @sv
broader: Sosiologia
in scheme: YKL - Yleisten kirjastojen luokitusjärjestelmä
narrower: Yhteiskunnallinen futurologia
narrower: Organisaatiososiologia
narrower: Alueellinen sosiologia
notation: 30.11
scope note: Hit och till underklasserna allmänt om sociala system och konstruktioner samt utvecklingen av dem Samhällenas, samhällssystemens och samhällsklassernas sociologi och utveckling Släktsamhällen. Slavsamhällen Feodala samhällen. Kolonialistiska samhällen Kapitalistiska samhällen. Socialistiska samhällen Social skiktning. Social rörlighet Kaster. Ständer. Ståndscirkulation Borgerskap. Arbetarbefolkning. Prekariat. Bönder. Medelklassen. Överklassen @sv
scope note: Tähän ja alaluokkiin sosiaalisia järjestelmiä ja rakenteita sekä niiden kehitystä koskevat yleisteokset Yhteiskuntien, yhteiskuntajärjestelmien ja yhteiskuntaluokkien sosiologia ja kehitys Sukulaisyhteiskunnat. Orjayhteiskunnat Feodaaliyhteiskunnat. Kolonialistiset yhteiskunnat Kapitalistiset yhteiskunnat. Sosialistiset yhteiskunnat Sosiaalinen kerrostuneisuus. Sosiaalinen liikkuvuus Kastit. Säädyt. Säätykierto Porvaristo. Työväestö. Prekariaatti. Talonpojat. Keskiluokka. Yläluokka

Yhteiskunnallinen futurologia
type: Concept
type: YKL-luokka
alternative label: Dystopiat, futurologia (30.111)
alternative label: Dystopier, futurologi (30.111) @sv
alternative label: Framtidsforskning (30.111) @sv
alternative label: Futurologi (30.111) @sv
alternative label: Futurologia (30.111)
alternative label: Samhällsfuturologi (30.111) @sv
alternative label: Transhumanism, framtidsforskning (30.111) @sv
alternative label: Transhumanism, social futurologi (30.111) @sv
alternative label: Transhumanismi, tulevaisuudentutkimus (30.111)
alternative label: Transhumanismi, yhteiskunnallinen futurologia (30.111)
alternative label: Tulevaisuudentutkimus (30.111)
alternative label: Utopiat, futurologia (30.111)
alternative label: Utopier, futurologi (30.111) @sv
alternative label: Yhteiskunnallinen futurologia (30.111)
broader: Sosiaaliset järjestelmät
in scheme: YKL - Yleisten kirjastojen luokitusjärjestelmä
notation: 30.111
preferred label: Samhällsfuturologi @sv
preferred label: Social futurology @en
scope note: Hit allmänna verk om samhällelig framtidsforskning Hit också verk som behandlar både samhällelig och teknologisk futurologi Futurologi inom specialområden klassificeras enligt område @sv
scope note: Tähän yhteiskunnallisen tulevaisuudentutkimuksen yleisteokset Tähän myös teokset, jotka koskevat sekä yhteiskunnallista että teknologista futurologiaa Erikoisalojen futurologia luokitetaan alan mukaan

Organisaatiososiologia
type: Concept
References: HALLINTO
References: Työ. Työelämä
References: MAANPUOLUSTUS
References: Hoitotiede. Hoitotyö. Hoitohenkilökunta
References: Liiketalous
type: YKL-luokka
alternative label: Byrokratia, sosiologia (30.112)
alternative label: Byråkrati, sociologi (30.112) @sv
alternative label: Kibbutsit, sosiologia (30.112)
alternative label: Kibbutzer, sociologi (30.112) @sv
alternative label: Korruptio, sosiologia (30.112)
alternative label: Korruption, sociologi (30.112) @sv
alternative label: Lahjonta, sosiologia (30.112)
alternative label: Mutande, sociologi (30.112) @sv
alternative label: Organisaatiot, sosiologia (30.112)
alternative label: Organisaatioteoriat (30.112)
alternative label: Organisationer, sociologi (30.112) @sv
alternative label: Organisationsteorier (30.112) @sv
broader: Sosiaaliset järjestelmät
in scheme: YKL - Yleisten kirjastojen luokitusjärjestelmä
notation: 30.112
preferred label: Organisational sociology @en
preferred label: Organisationssociologi @sv
scope note: Organisaatioiden, laitosten ja sosiaalisten instituutioiden sosiologia yleensä Byrokratia ja korruptio sosiologisina ilmiöinä Tietyn organisaation, laitoksen tai sosiaalisen instituution sosiologia luokitetaan alan mukaan
scope note: Organisationers, inrättningars och sociala institutionens sociologi i allmänhet Byråkrati och korruption som sociologiska fenomen Sociologi för en viss organisation, inrättning eller social institution klassificeras enligt område @sv

Alueellinen sosiologia
type: Concept
References: Väestötiede. Väestöpolitiikka
References: Siirtolaiset. Pakolaiset
References: ALUESUUNNITTELU. ALUEPOLITIIKKA
References: Asuntopolitiikka
type: YKL-luokka
alternative label: Alueellinen sosiologia (30.114)
alternative label: Byforskning (30.114) @sv
alternative label: Byverksamhet (30.114) @sv
alternative label: Flyttning från landsbygden, sociologi (30.114) @sv
alternative label: Flyttningsrörelse, migration (30.114) @sv
alternative label: Förorter, stadssociologi (30.114) @sv
alternative label: Kaupungistuminen (30.114)
alternative label: Kaupunkilaistuminen (30.114)
alternative label: Kaupunkisosiologia (30.114)
alternative label: Kaupunkiyhteisöt (30.114)
alternative label: Kehitysalueet, sosiologia (30.114)
alternative label: Kylätoiminta (30.114)
alternative label: Kylätutkimus (30.114)
alternative label: Landsbygdssamhällen (30.114) @sv
alternative label: Landsbygdssociologi (30.114) @sv
alternative label: Lähiöt, kaupunkisosiologia (30.114)
alternative label: Maaltamuutto, sosiologia (30.114)
alternative label: Maaseutusosiologia (30.114)
alternative label: Maaseutuyhteisöt (30.114)
alternative label: Maassamuutto, sosiologia (30.114)
alternative label: Maastamuutto, sosiologia (30.114)
alternative label: Migration, sociologi (30.114) @sv
alternative label: Muuttoliike, maassamuutto (30.114)
alternative label: Regional sociologi (30.114) @sv
alternative label: Sociala problem, regionalgeografi (30.114) @sv
alternative label: Socialekologi (30.114) @sv
alternative label: Sosiaaliekologia (30.114)
alternative label: Sosiaaliset ongelmat, aluemaantiede (30.114)
alternative label: Stadssamfund (30.114) @sv
alternative label: Stadssociologi (30.114) @sv
alternative label: Urbanisering (30.114) @sv
alternative label: Urbanisering, sociologi (30.114) @sv
alternative label: Urbanisoituminen, sosiologia (30.114)
alternative label: Utvandring, sociologi (30.114) @sv
alternative label: Utvecklingsområden, sociologi (30.114) @sv
broader: Sosiaaliset järjestelmät
in scheme: YKL - Yleisten kirjastojen luokitusjärjestelmä
notation: 30.114
preferred label: Regional sociologi @sv
preferred label: Regional sociology @en
scope note: Hit sociologiska eller socialekologiska verk om samhällets regionala struktur och utveckling Landsbygdssociologi. Landsbygdsgemenskaper. Bystudier Stadssociologi. Stadsgemenskaper. Förortsstudier Hit också social skiktning och rörlighet ur regional synvinkel Flyttning inom landet. Flykten från landsbygden. Urbanisering @sv
scope note: Tähän yhteiskunnan alueellista rakennetta ja kehitystä koskevat sosiologiset tai sosiaaliekologiset teokset Maaseutusosiologia. Maaseutuyhteisöt. Kylätutkimukset Kaupunkisosiologia. Kaupunkiyhteisöt. Lähiötutkimukset Tähän myös sosiaalinen kerrostuneisuus ja liikkuvuus alueelliselta kannalta Maassamuutto. Maaltamuutto. Kaupungistuminen

Elämäntapojen sosiologia. Kulttuurisosiologia
type: Concept
modified: 2026-05-06T13:30:36
References: YLEINEN KULTTUURIPOLITIIKKA
References: VIESTINTÄ. JOUKKOVIESTINTÄ
References: Tiedepolitiikka
References: Etiikka. Moraalifilosofia
References: Sosiaalipsykologia
References: Perhesosiologia
References: KANSATIEDE. KULTTUURIANTROPOLOGIA
References: Taidepsykologia. Taidesosiologia. Taidepolitiikka
References: Tatuointi. Kehotaide
References: Katutaide. Graffititaide
References: Musiikin sosiologia
References: KIRJALLISUUSTIEDE
References: Historianfilosofia. Kulttuurifilosofia
References: Yleinen kulttuurihistoria
alternative label: Ajankäyttötutkimukset, kulttuurisosiologia, yl. (30.12)
alternative label: Alakulttuurit, elämäntapojen sosiologia (30.12)
alternative label: Arvot, kulttuurisosiologia (30.12)
alternative label: Bordellit (30.12)
alternative label: Digipaasto (30.12)
alternative label: Diskot, kulttuurisosiologia (30.12+)
alternative label: Elämäntapa, sosiologia (30.12)
alternative label: Elämäntapojen sosiologia (30.12)
alternative label: Erotografia (30.12)
alternative label: Etninen identiteetti, kulttuurisosiologia (30.12)
alternative label: Fanius (30.12)
alternative label: Furry, yl. (30.12)
alternative label: Graffitit, elämäntapojen sosiologia (30.12)
alternative label: Harrastukset, sosiologia (30.12)
alternative label: Hipit, alakulttuurien sosiologia (30.12)
alternative label: Homoseksuaalisuus, kulttuurisosiologia (30.12)
alternative label: Hämyt, alakulttuurien sosiologia (30.12)
alternative label: Ilotalot (30.12)
alternative label: Jengit, elämäntapojen sosiologia (30.12)
alternative label: Kansalaisaktiivisuus, elämäntapojen sosiologia (30.12)
alternative label: Kansallinen identiteetti, kulttuurisosiologia (30.12)
alternative label: Katutaide, elämäntapojen sosiologia (30.12)
alternative label: Kaupunkikulttuuri, sosiologia (30.12)
alternative label: Kielellinen identiteetti, kulttuurisosiologia (30.12)
alternative label: Kultit, kulttuurisosiologia (30.12)
alternative label: Kulttuuri-identiteetti, kulttuurisosiologia (30.12)
alternative label: Kulttuurintutkimus (30.12)
alternative label: Kulttuurintutkimus, kulttuurisosiologia (30.12)
alternative label: Kulttuurisosiologia (30.12)
alternative label: Lastenkulttuuri, sosiologia (30.12)
alternative label: Lesbous, kulttuurisosiologia (30.12)
alternative label: Lomanvietto, sosiologia (30.12)
alternative label: Maaseutukulttuuri, sosiologia (30.12)
alternative label: Monikulttuurisuus, kulttuurisosiologia (30.12)
alternative label: Musiikkiklubit, kulttuurisosiologia (30.12+)
alternative label: Muunsukupuolisuus, kulttuurisosiologia (30.12)
alternative label: Myytit, kulttuurisosiologia (30.12)
alternative label: Normit, kulttuurisosiologia (30.12)
alternative label: Nuoriso-ongelmat, alakulttuurien sosiologia (30.12)
alternative label: Nuorisokulttuuri, elämäntapojen sosiologia (30.12)
alternative label: Nuorisososiologia, alakulttuurit (30.12)
alternative label: Nörtit, elämäntapojen sosiologia (30.12)
alternative label: Osakulttuurit, elämäntapojen sosiologia (30.12)
alternative label: Populaarikulttuuri, kulttuurisosiologia (30.12)
alternative label: Pornografia (30.12)
alternative label: Pornografia, elämäntapojen sosiologia (30.12)
alternative label: Prostituutio, elämäntapojen sosiologia (30.12)
alternative label: Punkkarit, alakulttuurien sosiologia (30.12)
alternative label: Seksiala, pornografian ja prostituution sosiologia (30.12)
alternative label: Seksografia (30.12)
alternative label: Seksuaalinen identiteetti, kulttuurisosiologia (30.12)
alternative label: Seksuaalivähemmistöt, kulttuurisosiologia (30.12)
alternative label: Sosiaalinen elämä, kulttuurisosiologia (30.12)
alternative label: Sosiaaliset normit (30.12)
alternative label: Sukupuolenkorjaus, kulttuurisosiologia (30.12)
alternative label: Sukupuolentutkimus, sosiologia (30.12)
alternative label: Sukupuoli-identiteetti, kulttuurisosiologia (30.12)
alternative label: Sukupuoliroolit, kulttuurisosiologia (30.12)
alternative label: Sukupuoliset vähemmistöt, kulttuurisosiologia (30.12)
broader: Sosiologia
in scheme: YKL - Yleisten kirjastojen luokitusjärjestelmä
notation: 30.12
scope note: Hit allmänna verk om levnadssättens och fritidens sociologi samt allmänna verk om kultursociologi Hit även verk som behandlar t.ex. barnens, de ungas eller de gamlas levnadssätt i allmänhet Hit också allmänna verk om kultursociologi Populärkultur. Ungdomskulturer. Gängundersökningar Underground. Gatukonst och graffiti som sociologiska fenomen Värden, normer och tabun ur sociologisk synvinkel Etniska, språkliga och sexuella minoriteters samt rasminoriteters levnadssätt ur sociologisk synvinkel Subkulturer. Delkulturer Hit också pornografins och prostitutionens sociologi Om verket passar i klasserna för kultursociologi, familjesociologi och socialpsykologi, ges företräde i följande ordning: kultursociologi, familjesociologi, socialpsykologi Kultursociologi för olika områden klassificeras enligt område @sv
scope note: Tähän elämäntapojen ja vapaa-ajanvieton sosiologian sekä kulttuurisosiologian yleisteokset Tähän myös esim. lasten, nuorten tai vanhusten elämäntapoja yleensä koskevat teokset Populaarikulttuuri. Nuorisokulttuurit. Jengitutkimus Underground. Katutaide ja graffitit sosiologisina ilmiöinä Arvot, normit ja tabut sosiologian kannalta Kansallisten, kielellisten, rodullisten ja sukupuolisten vähemmistöryhmien elämäntavat sosiologiselta kannalta Alakulttuurit. Osakulttuurit Tähän myös pornografian ja prostituution sosiologia Jos teos sopii sekä kulttuurisosiologian, perhesosiologian että sosiaalipsykologian luokkaan, annetaan etusija järjestyksessä: kulttuurisosiologia, perhesosiologia, sosiaalipsykologia Eri alojen kulttuurisosiologia luokitetaan alan mukaan

Sosiaalipsykologia
type: Concept
References: Ihmissuhteiden psykologia
References: Organisaatiososiologia
References: Elämäntapojen sosiologia. Kulttuurisosiologia
References: Perhesosiologia
References: Perhe-, ryhmä- ja ympäristöterapiat
References: Luovuus- ja toimintaterapiat
alternative label: Aivopesu, sosiaalipsykologia (30.13)
alternative label: Alienation, socialpsykologi (30.13) @sv
alternative label: Allmänna opinionen, socialpsykologi (30.13) @sv
alternative label: Asennetutkimukset, sosiaalipsykologia (30.13)
alternative label: Asenteet, sosiaalipsykologia (30.13)
alternative label: Asocialt beteende, socialpsykologi (30.13) @sv
alternative label: Attityder, socialpsykologi (30.13) @sv
alternative label: Attitydforskningar, socialpsykologi (30.13) @sv
alternative label: Beteendestörningar, socialpsykologi (30.13) @sv
alternative label: Demonstrationer, socialpsykologi (30.13) @sv
alternative label: Ensamhet, socialpsykologi (30.13) @sv
alternative label: Gallupar, socialpsykologi (30.13) @sv
alternative label: Gallupit, sosiaalipsykologia (30.13)
alternative label: Grupparbete, socialpsykologi (30.13) @sv
alternative label: Gruppsociologi (30.13) @sv
alternative label: Gruppsykologi (30.13) @sv
alternative label: Gruppundersökningar, socialpsykologi (30.13) @sv
alternative label: Haastattelututkimukset, sosiaalipsykologia (30.13)
alternative label: Hjärntvätt, socialpsykologi (30.13) @sv
alternative label: Institutionalisering (30.13) @sv
alternative label: Intervjuundersökningar, socialpsykologi (30.13) @sv
alternative label: Joukkopsykologia (30.13)
alternative label: Kiusaaminen, sosiaalipsykologia (30.13)
alternative label: Kulttuuripsykologia (30.13)
alternative label: Kulturpsykologi (30.13) @sv
alternative label: Käyttäytymishäiriöt, sosiaalipsykologia (30.13)
alternative label: Käytöshäiriöt, sosiaalipsykologia (30.13)
alternative label: Laitostuminen (30.13)
alternative label: Manipulaatio, sosiaalipsykologia (30.13)
alternative label: Manipulation, socialpsykologi (30.13) @sv
alternative label: Masspsykologi (30.13) @sv
alternative label: Mielenosoitukset, sosiaalipsykologia (30.13)
alternative label: Mielipidetutkimukset (30.13)
alternative label: Mielipiteenmuodostus, sosiaalipsykologia (30.13)
alternative label: Mielipiteenmuokkaus, sosiaalipsykologia (30.13)
alternative label: Mobbning, socialpsykologi (30.13) @sv
alternative label: Motiverande samtal (30.13) @sv
alternative label: Motivoiva keskustelu (30.13)
alternative label: Ongelmakäyttäytyminen, sosiaalipsykologia (30.13)
alternative label: Opinionsbildning, socialpsykologi (30.13) @sv
alternative label: Opinionsundersökningar (30.13) @sv
alternative label: Problembeteende, socialpsykologi (30.13) @sv
alternative label: Propaganda, socialpsykologi (30.13) @sv
alternative label: Propaganda, sosiaalipsykologia (30.13)
alternative label: Psykologinen sosiologia (30.13)
alternative label: Psykologisk sociologi (30.13) @sv
alternative label: Publikundersökning, allmänna opinionen (30.13) @sv
alternative label: Roller, socialpsykologi (30.13) @sv
alternative label: Roolit, sosiaalipsykologia (30.13)
alternative label: Ryhmäpsykologia (30.13)
alternative label: Ryhmäsosiologia (30.13)
alternative label: Ryhmätutkimukset, sosiaalipsykologia (30.13)
alternative label: Ryhmätyö, sosiaalipsykologia (30.13)
alternative label: Social interaktion, socialpsykologi (30.13) @sv
alternative label: Sociala roller, socialpsykologi (30.13) @sv
alternative label: Socialisation, socialpsykologi (30.13) @sv
alternative label: Socialpsykologi (30.13) @sv
alternative label: Socialt beteende, socialpsykologi (30.13) @sv
alternative label: Sosiaalinen käyttäytyminen, sosiaalipsykologia (30.13)
alternative label: Sosiaalinen vuorovaikutus, sosiaalipsykologia (30.13)
alternative label: Sosiaalipsykologia (30.13)
alternative label: Sosiaaliset roolit, sosiaalipsykologia (30.13)
alternative label: Sosialisaatio, sosiaalipsykologia (30.13)
alternative label: Vieraantuminen, sosiaalipsykologia (30.13)
alternative label: Yksinäisyys, sosiaalipsykologia (30.13)
alternative label: Yleinen mielipide, sosiaalipsykologia (30.13)
alternative label: Yleisötutkimus, yleinen mielipide (30.13)
alternative label: Åsiktsbearbetning, socialpsykologi (30.13) @sv
broader: Sosiologia
in scheme: YKL - Yleisten kirjastojen luokitusjärjestelmä
notation: 30.13
scope note: Växelverkan mellan individ och samhälle Masspsykologi. Propaganda. Indoktrinering Allmänna opinionen. Opinionsundersökningar Attityder. Attitydundersökningar Gruppsociologi. Gruppundersökningar Social växelverkan. Socialt beteende Sociala roller. Socialisation Om verket passar i klasserna för kultursociologi, familjesociologi och socialpsykologi, ges företräde i följande ordning: kultursociologi, familjesociologi, socialpsykologi Sociometri 30.1301 @sv
scope note: Yksilön ja yhteiskunnan vuorovaikutus Joukkopsykologia. Propaganda. Mielipiteenmuokkaus Yleinen mielipide. Mielipidetutkimukset Asenteet. Asennetutkimukset Ryhmäsosiologia. Ryhmätutkimukset Sosiaalinen vuorovaikutus. Sosiaalinen käyttäytyminen Sosiaaliset roolit. Sosialisaatio Jos teos sopii sekä kulttuurisosiologian, perhesosiologian että sosiaalipsykologian luokkaan, annetaan etusija järjestyksessä: kulttuurisosiologia, perhesosiologia, sosiaalipsykologia Sosiometria 30.1301

Perhesosiologia
type: Concept
References: Ihmissuhteiden psykologia
References: Sosiaalipsykologia
References: Sukupuolten ja seksuaalisten ryhmien asema yhteiskunnassa
References: Ikäryhmien asema yhteiskunnassa
References: Perhe- ja holhousoikeus
References: Vanhuspalvelut
References: Perhepolitiikka
References: Päivähoitopalvelut
References: Lasten ja nuorten huolto ja suojelu
References: Perhe- ja kotikasvatus
References: Perhe-, ryhmä- ja ympäristöterapiat
type: YKL-luokka
alternative label: Avioero, perhesosiologia (30.15)
alternative label: Avioliitto, perhesosiologia (30.15)
alternative label: Avoliitto, perhesosiologia (30.15)
alternative label: Barn, familjesociologi (30.15) @sv
alternative label: Barnlöshet, familjesociologi (30.15) @sv
alternative label: Ensamförsörjare, sociologi (30.15) @sv
alternative label: Ensamstående, sociologi (30.15) @sv
alternative label: Familjer (30.15) @sv
alternative label: Familjesociologi (30.15) @sv
alternative label: Fäder, familjesociologi (30.15) @sv
alternative label: Föräldraskap, familjesociologi (30.15) @sv
alternative label: Gemensam vårdnad, familjesociologi (30.15) @sv
alternative label: Gruppäktenskap, familjesociologi (30.15) @sv
alternative label: Huoltajuus, perhesosiologia (30.15)
alternative label: Ikäryhmät, perhesosiologia (30.15)
alternative label: Isät, perhesosiologia (30.15)
alternative label: Kvinnor, familjesociologi (30.15) @sv
alternative label: Könsroller, familjesociologi (30.15) @sv
alternative label: Lapset, perhesosiologia (30.15)
alternative label: Lapsettomuus, perhesosiologia (30.15)
alternative label: Miehet, perhesosiologia (30.15)
alternative label: Män, familjesociologi (30.15) @sv
alternative label: Mödrar, familjesociologi (30.15) @sv
alternative label: Naiset, perhesosiologia (30.15)
alternative label: Nuoriso-ongelmat, perhesosiologia (30.15)
alternative label: Nuorisososiologia, perhesosiologia (30.15)
alternative label: Perheet (30.15)
alternative label: Perhesosiologia (30.15)
alternative label: Registrerat parförhållande, familjesociologi (30.15) @sv
alternative label: Regnbågsfamiljer, familjesociologi (30.15) @sv
alternative label: Rekisteröity parisuhde, perhesosiologia (30.15)
alternative label: Roller, familjesociologi (30.15) @sv
alternative label: Roolit, perhesosiologia (30.15)
alternative label: Ryhmäavioliitto, perhesosiologia (30.15)
alternative label: Sammanboende, familjesociologi (30.15) @sv
alternative label: Sateenkaariperheet, perhesosiologia (30.15)
alternative label: Skilsmässa, familjesociologi (30.15) @sv
alternative label: Storfamiljer, familjesociologi (30.15) @sv
alternative label: Sukupuoliroolit, perhesosiologia (30.15)
alternative label: Suurperheet, perhesosiologia (30.15)
alternative label: Ungdomsproblem, familjesociologi (30.15) @sv
alternative label: Ungdomssociologi, familjesociologi (30.15) @sv
alternative label: Vanhemmuus, perhesosiologia (30.15)
alternative label: Vanhukset, perhesosiologia (30.15)
alternative label: Vårdnad om barn, familjesociologi (30.15) @sv
alternative label: Yhteishuolto, perhesosiologia (30.15)
alternative label: Yksineläjät, sosiologia (30.15)
alternative label: Yksinhuoltajat, sosiologia (30.15)
alternative label: Äidit, perhesosiologia (30.15)
alternative label: Äktenskap, familjesociologi (30.15) @sv
alternative label: Åldersgrupper, familjesociologi (30.15) @sv
alternative label: Åldringar, familjesociologi (30.15) @sv
broader: Sosiologia
in scheme: YKL - Yleisten kirjastojen luokitusjärjestelmä
notation: 30.15
preferred label: Familjesociologi @sv
preferred label: Family sociology @en
scope note: Hit de olika familjeformernas sociologi Äktenskap. Samboende. Registrerat parförhållande. Skilsmässa Storfamiljer. Andra familjeliknande gemenskapen Ensamboende. Ensamförsörjare Familjemedlemmarnas ställning och roller i familjen Om verket passar i klasserna för kultursociologi, familjesociologi och socialpsykologi, ges företräde i följande ordning: kultursociologi, familjesociologi, socialpsykologi Om verket behandlar både familjesociologi och familjepolitik eller barnskydd, ges företräde åt klass 37.4+ @sv
scope note: Tähän eri perhemuotojen sosiologia Avioliitto. Avoliitto. Rekisteröity parisuhde. Avioero Suurperheet. Muut perheenomaiset yhteisöt Yksineläjät. Yksinhuoltajat Perheenjäsenten asema ja roolit perheessä Jos teos sopii sekä kulttuurisosiologian, perhesosiologian että sosiaalipsykologian luokkaan, annetaan etusija järjestyksessä: kulttuurisosiologia, perhesosiologia, sosiaalipsykologia Jos teos koskee sekä perhesosiologiaa että perhepolitiikkaa tai lastensuojelua, annetaan etusija luokalle 37.4+

Kriminologia. Kriminaalisosiologia
type: Concept
References: Rikosoikeus
References: Kriminaalipolitiikka. Vankeinhoito
References: Poliisitoimi. Yleinen turvallisuus
References: Työ. Työelämä
References: Perhepolitiikka
References: Koululaitos
References: MAANPUOLUSTUS
alternative label: Alkoholirikollisuus, kriminologia (30.16)
alternative label: Haittaohjelmat, kriminologia (30.16)
alternative label: Hakkerointi, kriminologia (30.16)
alternative label: Harmaa talous, rikollisuus (30.16)
alternative label: Henkirikokset, kriminologia (30.16)
alternative label: Huijaus, kriminologia (30.16)
alternative label: Huumekauppa, kriminologia (30.16)
alternative label: Huumerikokset, kriminologia (30.16)
alternative label: Ihmiskauppa (30.16)
alternative label: Ihmisryöstöt, rikollisuus (30.16)
alternative label: Ihmissalakuljetus, rikollisuus (30.16)
alternative label: Järjestäytynyt rikollisuus, kriminologia (30.16)
alternative label: Konkurssirikokset, kriminologia (30.16)
alternative label: Krakkerointi, kriminologia (30.16)
alternative label: Kriminaalisosiologia (30.16)
alternative label: Kriminalisoitu toiminta, tutkimus (30.16)
alternative label: Kriminologia (30.16)
alternative label: Lentokonekaappaukset (30.16)
alternative label: Liikennerikokset, kriminologia (30.16)
alternative label: Mafia (30.16)
alternative label: Merirosvot, rikollisuus (30.16)
alternative label: Merirosvous yl. (30.16)
alternative label: Murhat, väkivallan sosiologia (30.16)
alternative label: Naiskauppa (30.16)
alternative label: Nuoriso-ongelmat, nuorisorikollisuus (30.16)
alternative label: Nuorisorikollisuus, sosiologia (30.16)
alternative label: Omaisuusrikokset, kriminologia (30.16)
alternative label: Paritus, kriminologia (30.16)
alternative label: Pedofilia, rikollisuus (30.16)
alternative label: Pimeä työ, rikollisuus (30.16)
alternative label: Piraattituotteet, kriminologia (30.16)
alternative label: Piratismi, kriminologia (30.16)
alternative label: Plagiaatit, kriminologia (30.16)
alternative label: Plagiointi, kriminologia (30.16)
alternative label: Raiskaukset, kriminologia (30.16)
alternative label: Raiskaus, kriminologia (30.16)
alternative label: Rikoksentekijät, kriminologia (30.16)
alternative label: Rikokset, kriminologia (30.16)
alternative label: Rikokset, sosiologia (30.16)
alternative label: Rikolliset, kriminologia (30.16)
alternative label: Rikollisuuden tutkimus (30.16)
alternative label: Rikollisuus (30.16)
alternative label: Rikollisuus, kriminologia (30.16)
alternative label: Rikollisuus, sosiologia (30.16)
alternative label: Salakuljetus, rikollisuus (30.16)
alternative label: Seksiala, rikollinen liiketoiminta (30.16)
alternative label: Seksuaalinen hyväksikäyttö, kriminologia (30.16)
alternative label: Seksuaalirikokset, kriminologia (30.16)
alternative label: Sukupuolinen häirintä, kriminologia (30.16)
alternative label: Taideväärennökset, kriminologia (30.16)
alternative label: Talousrikokset, kriminologia (30.16)
alternative label: Tappo, väkivallan sosiologia (30.16)
alternative label: Teollisuusvakoilu, kriminologia (30.16)
alternative label: Terrorismi (30.16)
alternative label: Tieto- ja viestintärikokset, kriminologia (30.16)
alternative label: Tietokonevirukset, kriminologia (30.16)
alternative label: Tietotekniikkarikokset (30.16)
alternative label: Tietoverkkorikokset (30.16)
alternative label: Tietovuodot (30.16)
alternative label: Uskonnollinen terrorismi (30.16)
alternative label: Vakoilu, tekniikassa ja teollisuudessa (30.16)
alternative label: Veronkierto, kriminologia (30.16)
alternative label: Verorikokset, krimonologia (30.16)
alternative label: Viharikokset, rikollisuus (30.16)
alternative label: Virkarikokset, kriminologia (30.16)
alternative label: Väkivalta, sosiologia (30.16)
alternative label: Väkivaltarikokset, kriminologia (30.16)
broader: Sosiologia
in scheme: YKL - Yleisten kirjastojen luokitusjärjestelmä
notation: 30.16
scope note: Väkivallan ja rikollisuuden sosiologia. Rikollisuus yleensä. Rikollisuuden ja kriminalisoidun toiminnan tutkimus. Järjestäytynyt rikollisuus. Väkivaltarikollisuus. Mafia. Terrorismi. Lentokonekaappaukset. Huumausainekauppa. Salakuljetus. Talousrikollisuus. Tietotekniikkarikollisuus. Hakkeritoiminta. Tähän myös muita rikollisuuden lajeja koskeva kriminologinen ja sosiologinen tutkimus. Rikollisten elämäkerrat luokkaan 99.1
scope note: Vålds- och brottssociologi. Brottslighet i allmänhet. Forskning i brottslighet och kriminaliserad verksamhet. Organiserad brottslighet. Våldsbrott. Maffian. Terrorism. Flygkapningar. Narkotikahandel. Smuggling. Ekonomisk brottslighet. Databrott. Hackare. Hit också kriminologisk och sociologisk utredning av andra brottstyper. Brottslingars biografier förs till klass 99.1 @sv

Kansalaistoiminta ja –aktivismi. Järjestötoiminta. Kokoustekniikka.
type: Concept
References: YLEINEN KULTTUURIPOLITIIKKA
References: Yhdistykset. Säätiöt. Seurat. Kerhot
References: Kokoukset. Kulttuuritapahtumat
References: Kristillinen opetus ja kasvatus
References: Nuorisotyö. Lapsityö
References: Ilmaisutaito. Puhetaito. Lausuntataide
type: YKL-luokka
alternative label: Bolagsstämma, mötesteknik (30.7) @sv
alternative label: Bolagsstämmor, mötesteknik (30.7) @sv
alternative label: Debatt, mötesteknik (30.7) @sv
alternative label: Engagemang, (30.7) @sv
alternative label: Frivilligt arbete (30.7) @sv
alternative label: Föreningar, organisationsteknik (30.7) @sv
alternative label: Föreningsverksamhet (30.7) @sv
alternative label: Föreningsverksamhet, organisationsteknik (30.7) @sv
alternative label: Förhandlingskonst (30.7) @sv
alternative label: Förhandlingsteknik (30.7) @sv
alternative label: Johtaminen, järjestö- ja kokoustekniikka (30.7)
alternative label: Järjestötoiminta (30.7)
alternative label: Järjestötyö (30.7)
alternative label: Kansalaisaktivismi (30.7)
alternative label: Kansalaistoiminta (30.7)
alternative label: Kerhotoiminta, järjestötekniikka (30.7)
alternative label: Klubbverksamhet, organisationsteknik (30.7) @sv
alternative label: Kokoukset, asiakirjatekniikka (30.7)
alternative label: Kokoukset, järjestäminen (30.7)
alternative label: Kokoukset, tekniikka (30.7)
alternative label: Kolmas sektori (30.7)
alternative label: Kommunal mötesteknik (30.7) @sv
alternative label: Kongresser, mötesteknik (30.7) @sv
alternative label: Kongressit, kokoustekniikka (30.7)
alternative label: Kulttuuritapahtumat, järjestäminen (30.7)
alternative label: Kulturhändelser, anordnande (30.7) @sv
alternative label: Kunnallinen kokoustekniikka (30.7)
alternative label: Ledarskap, organisations- och mötesteknik (30.7) @sv
alternative label: Medborgaraktivism (30.7) @sv
alternative label: Medborgaraktivitet (30.7) @sv
alternative label: Muntlig framställning, mötesteknik (30.7) @sv
alternative label: Möten, arrangemang (30.7) @sv
alternative label: Möten, dokumentteknik (30.7) @sv
alternative label: Möten, teknik (30.7) @sv
alternative label: Neuvottelutaito (30.7)
alternative label: Neuvottelutekniikka (30.7)
alternative label: Organisationsarbete (30.7) @sv
alternative label: Organisationsverksamhet (30.7) @sv
alternative label: Osallistuminen, (30.7)
alternative label: Protokoll, skrivanvisningar (30.7) @sv
alternative label: Puhetaito ja -tekniikka, kokoustekniikka (30.7)
alternative label: Pöytäkirja, laatiminen (30.7)
alternative label: Seuratoiminta, järjestötekniikka (30.7)
alternative label: Statsförvaltning, mötesteknik (30.7) @sv
alternative label: Stiftelser, organisationsteknik (30.7) @sv
alternative label: Suullinen esitystaito, kokoustekniikka (30.7)
alternative label: Säätiöt, järjestötekniikka (30.7)
alternative label: Talarkonst och talteknik, mötesteknik (30.7) @sv
alternative label: Telekonferenser (30.7) @sv
alternative label: Teleneuvottelut (30.7)
alternative label: Toimintakertomukset, laadinta (30.7)
alternative label: Tredje sektorn (30.7) @sv
alternative label: Valtionhallinto, kokoustekniikka (30.7)
alternative label: Vapaaehtoistyö (30.7)
alternative label: Verksamhetsberättelser, utarbetande (30.7) @sv
alternative label: Videokonferenser (30.7) @sv
alternative label: Videoneuvottelut (30.7)
alternative label: Vuosikertomukset, laadinta (30.7)
alternative label: Väittely, kokoustekniikka (30.7)
alternative label: Yhdistykset, järjestötekniikka (30.7)
alternative label: Yhdistystoiminta (30.7)
alternative label: Yhtiökokoukset, kokoustekniikka (30.7)
alternative label: Yhtiökokous, kokoustekniikka (30.7)
alternative label: Årsberättelser, utarbetande (30.7) @sv
broader: YLEINEN YHTEISKUNTATIEDE
in scheme: YKL - Yleisten kirjastojen luokitusjärjestelmä
notation: 30.7
preferred label: Civic activity. Organisational activities. Procedure of meetings @en
preferred label: Medborgaraktivitet och medborgaraktivism. Organisationsverksamhet. Mötesteknik. @sv
scope note: Kansalaistoiminta, kansalaisaktivismi, osallistuminen, kolmas sektori ja vapaaehtoistyö yleensä Neuvottelutaito. Neuvottelutekniikka. Kokouksen asiakirjatekniikka Yleisten järjestöllisten tilaisuuksien, kokousten, kongressien sekä yleisten kulttuuri-ja yleisötilaisuuksien järjestäminen Tähän myös kunnallinen ja valtionhallinnollinen kokoustekniikka Jos teoksessa on sekä yhdistysten kokoustekniikkaa että taloudenhoitoa, annetaan etusija luokalle 30.7 Jos teoksessa on sekä järjestö- tai kokoustekniikkaa että puhe- tai ilmaisutaitoa, annetaan etusija luokalle 30.7 Eri alojen kansalais- ja järjestötoiminta sekä järjestöt kokoukset ja kongressit luokitetaan alan mukaan. Tähän myös esim. Me too ja Black lives matter -liikkeet.
scope note: Medborgaraktivitet och -aktivism, engagemang, tredje sektorn och frivilligt arbete i allmänhet Förhandlingskonst. Förhandlingsteknik. Hur man upprättar mötesdokument Anordnande av allmänna tillställningar, möten och kongressen inom organisationer samt anordnande av allmänna kulturevenemang och evenemang för allmänheten Hit också mötesteknik för den kommunala sektorn och statsförvaltningen Om verket innehåller både mötesteknik och ekonomi för föreningar, ges företräde åt klass 30.7 Om verket innehåller organisationsteknik, mötesteknik, talarkonst och retorik, ges företräde åt klass 30.7 Medborgaraktivitet, organisationsverksamhet samt organisationer, möten och kongressen inom olika områden klassificeras enligt område. Hit även t.ex. Me too- och Black lives matter-rörelserna. @sv

Käytös- ja tapatieto
type: Concept
References: KANSATIEDE. KULTTUURIANTROPOLOGIA
References: Kauneudenhoito. Ulkonäkö
References: Yleinen kulttuurihistoria
type: YKL-luokka
alternative label: Brev, umgängesformer och etikett (30.8) @sv
alternative label: Brevväxling, umgängesformer och etikett (30.8) @sv
alternative label: Etikett (30.8+) @sv
alternative label: Etikett, gott uppförande (30.8+) @sv
alternative label: Etikettguider (30.8+) @sv
alternative label: Etiketti, käytöstavat (30.8+)
alternative label: Gott uppförande (30.8+) @sv
alternative label: Kirjeenvaihto, käytös- ja tapatieto (30.8)
alternative label: Kirjeet, käytös- ja tapatieto (30.8)
alternative label: Kläder, klädguider (30.8+) @sv
alternative label: Klädguider, etikett (30.8+) @sv
alternative label: Kunniamerkit, käyttö (30.8+)
alternative label: Käyttäytymisoppaat (30.8+)
alternative label: Käytös- ja tapatieto (30.8+)
alternative label: Käytöstavat (30.8+)
alternative label: Puheet, käytösoppaat (30.8+)
alternative label: Puhelinkäyttäytyminen, käytös- ja tapatieto (30.8+)
alternative label: Pukeutumisoppaat, käytöstavat (30.8+)
alternative label: Seder och bruk, etiketthandböcker (30.8+) @sv
alternative label: Seder, etiketthandböcker (30.8+) @sv
alternative label: Seurusteluoppaat (30.8+)
alternative label: Seurustelutavat, käytösoppaat (30.8+)
alternative label: Seurustelutavat, pukeutumisohjeet (30.8+)
alternative label: Stilar, etikett (30.8) @sv
alternative label: Sähkeet, käytös- ja tapatieto (30.8+)
alternative label: Tal, etiketthandböcker (30.8+) @sv
alternative label: Tapakulttuuri, käytösoppaat (30.8+)
alternative label: Tapatieto (30.8+)
alternative label: Tavat, käytösoppaat (30.8+)
alternative label: Telefonetikett, umgängesformer och etikett (30.8+) @sv
alternative label: Telegram, umgängesformer och etikett (30.8+) @sv
alternative label: Tyylit, etiketti (30.8)
alternative label: Umgängesformer och etikett (30.8+) @sv
alternative label: Umgängeshandböcker (30.8+) @sv
alternative label: Umgängesvanor, etiketthandböcker (30.8+) @sv
alternative label: Umgängesvanor, klädetikett (30.8+) @sv
alternative label: Utmärkelsetecken, att bära utmärkelsetecken (30.8+) @sv
alternative label: Vaatteet, pukeutumisoppaat (30.8+)
broader: YLEINEN YHTEISKUNTATIEDE
in scheme: YKL - Yleisten kirjastojen luokitusjärjestelmä
narrower: Juhlien järjestäminen
notation: 30.8
preferred label: Good manners and etiquette @en
preferred label: Umgängesformer och etikett @sv
scope note: Hit verk som behandlar umgängesformer och etikett i olika länder och kulturer Etiketthandböcker Hit också anvisningar om klädetikett Etiketthandböcker för turister och affärsmän @sv
scope note: Tähän eri maita tai kulttuureja koskeva käytös- ja tapatieto Käytös- ja seurusteluoppaat. Etiketti Tähän myös käytös- ja seurustelutapoihin liittyvät pukeutumisohjeet Matkailijoille ja liikemiehille tarkoitetut käytösoppaat

Juhlien järjestäminen
type: Concept
References: Kansalaistoiminta ja –aktivismi. Järjestötoiminta. Kokoustekniikka.
References: KANSATIEDE. KULTTUURIANTROPOLOGIA
References: Ruoanvalmistus. Ruokakulttuuri
References: Säilöntä
References: Tarjoilu
References: Juomat
References: Hotelli- ja ravintolatalous. Suurkeittiöt. Ateriapalvelut
References: Julkiset huvit
References: Yleinen kulttuurihistoria
type: YKL-luokka
alternative label: Barnbjudningar, arrangerande (30.81) @sv
alternative label: Begravning, anordnande (30.81) @sv
alternative label: Begravningsbyråer (30.81) @sv
alternative label: Begravningstjänster, begravningsbyråer (30.81) @sv
alternative label: Bjudningar, arrangerande (30.81) @sv
alternative label: Bröllop, anordnande av fester (30.81) @sv
alternative label: Evenemang för allmänheten, ordnande (30.81) @sv
alternative label: Familjefester, anordnande av fester (30.81) @sv
alternative label: Fester, anordnande (30.81) @sv
alternative label: Fester, tal (30.81) @sv
alternative label: Födelsedagsfester, anordnande av fester (30.81) @sv
alternative label: Första maj, anordnande av fester (30.81) @sv
alternative label: Hautajaiset, järjestäminen (30.81)
alternative label: Hautauspalvelut, hautaustoimistot (30.81)
alternative label: Hautaustoimistot (30.81)
alternative label: Hemmets fester, anordande (30.81) @sv
alternative label: Häät, juhlien järjestäminen (30.81)
alternative label: Joulu, juhlien järjestäminen (30.81)
alternative label: Juhannus, juhlien järjestäminen (30.81)
alternative label: Juhlat, järjestäminen (30.81)
alternative label: Juhlat, puheet (30.81)
alternative label: Jul, anordnande av fester (30.81) @sv
alternative label: Järjestötoiminta, juhlatilaisuuksien järjestäminen (30.81)
alternative label: Kotijuhlat, järjestäminen (30.81)
alternative label: Kutsut, järjestäminen (30.81)
alternative label: Lastenkutsut, järjestäminen (30.81)
alternative label: Lillajul, anordnande av fester (30.81) @sv
alternative label: Midsommar, anordnande av fester (30.81) @sv
alternative label: Mors dag, anordnande av fester (30.81) @sv
alternative label: Namnsdagsfester, anordnande (30.81) @sv
alternative label: Nimipäiväjuhlat, juhlien järjestäminen (30.81)
alternative label: Nyår, anordnande av fester (30.81) @sv
alternative label: Organisationsverksamhet, anordnande av fester (30.81) @sv
alternative label: Perhejuhlat, juhlien järjestäminen (30.81)
alternative label: Pikkujoulu, juhlien järjestäminen (30.81)
alternative label: Pääsiäinen, juhlien järjestäminen (30.81)
alternative label: Påsk, anordnande av fester (30.81) @sv
alternative label: Syntymäpäiväjuhlat, juhlien järjestäminen (30.81)
alternative label: Uusi vuosi, juhlien järjestäminen (30.81)
alternative label: Vappu, juhlien järjestäminen (30.81)
alternative label: Yleisötilaisuudet, järjestäminen (30.81)
alternative label: Äitienpäivä, juhlien järjestäminen (30.81)
broader: Käytös- ja tapatieto
in scheme: YKL - Yleisten kirjastojen luokitusjärjestelmä
notation: 30.81
preferred label: Anordnande av fester @sv
preferred label: Arranging parties and celebrations @en
scope note: Hit verk om hur man ordnar fester i hemmet, familje- och barnfester och fester i anslutning till t.ex. organisationsverksamhet @sv
scope note: Tähän koti-, perhe- ja lastenjuhlien sekä esim. järjestötoimintaan liittyvien juhlatilaisuuksien järjestämisoppaat

TILASTOTIEDE
type: Concept
References: Todennäköisyyslaskenta
type: YKL-luokka
alternative label: Matemaattinen tilastotiede (31+)
alternative label: Matematiikka, tilastomatematiikka (31+)
alternative label: Matematik, statistisk matematik (31+) @sv
alternative label: Matematisk statistik (31+) @sv
alternative label: Statistik (31+) @sv
alternative label: Statistiker, uppgörande (31+) @sv
alternative label: Statistisk matematik (31+) @sv
alternative label: Tilastomatematiikka (31+)
alternative label: Tilastot, laatiminen (31+)
alternative label: Tilastotiede (31+)
broader: YHTEISKUNTA
in scheme: YKL - Yleisten kirjastojen luokitusjärjestelmä
narrower: Yleiset tilastot
narrower: Väestötiede. Väestöpolitiikka
notation: 31
preferred label: STATISTICS @en
preferred label: STATISTIK @sv
scope note: Hit allmänna verk om statistik och matematisk statistik samt allmänna handledningar i statistik Handledningar i och metodologi av statistik inom specialområden klassificeras enligt område Statistikens filosofi, teori och undersökningsmetodik i allmänhet 31.01 Statistikklassifikationer och statistikstandarder i allmänhet 31.081 @sv
scope note: Tähän tilastotieteen ja matemaattisen tilastotieteen yleisteokset sekä yleiset tilasto-oppaat Erikoisaloja koskevat tilasto-oppaat sekä erikoisalojen tilastolliset tutkimusmenetelmät luokitetaan alan mukaan Tilastotieteen filosofia, teoria ja tutkimusmenetelmät yleensä 31.01 Tilastoluokitukset ja -standardit yleensä 31.081

Yleiset tilastot
type: Concept
References: Suomen yleiset tilastot
References: Väestötilastot
type: YKL-luokka
alternative label: FN, statistik (31.3) @sv
alternative label: Förenta Nationerna, statistik (31.3) @sv
alternative label: Statistiker (31.3+) @sv
alternative label: Statistiker, internationella (31.3) @sv
alternative label: Statistiker, övriga länder (31.3) @sv
alternative label: Tilastot (31.3+)
alternative label: Tilastot, kansainväliset (31.3)
alternative label: Tilastot, muiden maiden (31.3)
alternative label: YK, tilastot (31.3)
alternative label: Yhdistyneet Kansakunnat, tilastot (31.3)
broader: TILASTOTIEDE
in scheme: YKL - Yleisten kirjastojen luokitusjärjestelmä
narrower: Suomen yleiset tilastot
notation: 31.3
preferred label: Allmän statistik @sv
preferred label: General statistics @en
scope note: Hit allmän internationell statistik Hit också allmän statistik över bestämda världsdelar, länder eller områden Statistik inom specialområden klassificeras enligt område Formtillägget 08 används inte i samband med klassen 31.3 Allmänna statistiska seriella publikationer 31.3052 Allmänna statistiska årsböcker 31.3053 @sv
scope note: Tähän kansainväliset yleiset tilastot Tähän myös tiettyä maanosaa, maata tai aluetta koskevat yleiset tilastot Erikoisalojen tilastot luokitetaan alan mukaan Muotoluokkaa 08 ei käytetä luokan 31.3 yhteydessä Yleiset tilastolliset sarjajulkaisut 31.3052 Yleiset tilastolliset vuosikirjat 31.3053

Suomen yleiset tilastot
type: Concept
References: Väestötilastot
type: YKL-luokka
alternative label: Finlands officiella statistik (31.32) @sv
alternative label: Statistiker, Finland (31.32) @sv
alternative label: Suomen virallinen tilasto (31.32)
alternative label: Tilastot, Suomen (31.32)
broader: Yleiset tilastot
in scheme: YKL - Yleisten kirjastojen luokitusjärjestelmä
notation: 31.32
preferred label: Allmän finländsk statistik @sv
preferred label: General Finnish statistics @en
scope note: Finländsk statistik för olika specialområden klassificeras enligt område Allmänna statistiska seriella publikationer i Finland 31.32052 Allmänna statistiska årsböcker i Finland 31.32053 Formtillägget 08 används inte i samband med klassen 31.32 @sv
scope note: Suomen erikoisalojen tilastot luokitetaan alan mukaan Suomen yleiset tilastolliset sarjajulkaisut 31.32052 Suomen yleiset tilastolliset vuosikirjat 31.32053 Muotoluokkaa 08 ei käytetä luokan 31.32 yhteydessä

Väestötiede. Väestöpolitiikka
type: Concept
References: Alueellinen sosiologia
References: Siirtolaiset. Pakolaiset
References: Perhepolitiikka
type: YKL-luokka
alternative label: Ammatillinen jakautuminen, väestötiede (31.5)
alternative label: Asutusmaantiede (31.5)
alternative label: Befolkning, struktur och fördelning (31.5) @sv
alternative label: Befolkningsforskning (31.5) @sv
alternative label: Befolkningsförändringar, demografi (31.5) @sv
alternative label: Befolkningsgeografi (31.5) @sv
alternative label: Befolkningspolitik (31.5) @sv
alternative label: Befolkningstillväxt (31.5) @sv
alternative label: Bosättningsgeografi (31.5) @sv
alternative label: Demografi (31.5) @sv
alternative label: Demografi, biologisk (31.5) @sv
alternative label: Demografi, social och ekonomisk (31.5) @sv
alternative label: Demografia (31.5)
alternative label: Dödlighet, demografi (31.5) @sv
alternative label: Familjeplanering, demografisk politik (31.5) @sv
alternative label: Flyttningsrörelse, demografi (31.5) @sv
alternative label: Folkräkningar (31.5) @sv
alternative label: Födelsekontroll, befolkningspolitik (31.5) @sv
alternative label: Försörjningskvot, befolkningspolitik (31.5) @sv
alternative label: Geografi, demografisk geografi (31.5) @sv
alternative label: Huoltosuhde, väestöpolitiikka (31.5)
alternative label: Invandring, demografi (31.5) @sv
alternative label: Kuolleisuus, väestötiede (31.5)
alternative label: Maahanmuutto, väestötiede (31.5)
alternative label: Maantiede, väestömaantiede (31.5)
alternative label: Maassamuutto, väestötiede (31.5)
alternative label: Maastamuutto, väestötiede (31.5)
alternative label: Migration, demografi (31.5) @sv
alternative label: Muuttoliike, väestötiede (31.5)
alternative label: Nativitet, demografi (31.5) @sv
alternative label: Perhesuunnittelu, väestöpolitiikka (31.5)
alternative label: Syntyvyyden säännöstely, väestöpolitiikka (31.5)
alternative label: Syntyvyys, väestötiede (31.5)
alternative label: Utvandring, demografi (31.5) @sv
alternative label: Väestö, rakenne ja jakautuminen (31.5)
alternative label: Väestömaantiede (31.5)
alternative label: Väestönkasvu (31.5)
alternative label: Väestönlaskennat (31.5)
alternative label: Väestönmuutokset, väestötiede (31.5)
alternative label: Väestöntutkimus (31.5)
alternative label: Väestöpolitiikka (31.5)
alternative label: Väestötiede (31.5)
alternative label: Väestötiede, biologinen (31.5)
alternative label: Väestötiede, sosiaalinen ja taloudellinen (31.5)
alternative label: Yrkesmässig fördelning, demografi (31.5) @sv
broader: TILASTOTIEDE
in scheme: YKL - Yleisten kirjastojen luokitusjärjestelmä
narrower: Väestötilastot
notation: 31.5
preferred label: Demografi. Befolkningspolitik @sv
preferred label: Demography. Population policy @en
scope note: Befolkningsundersökningar. Demografi. Folkräkning Hit biologisk, social och ekonomisk demografi Nativitet. Dödlighet. Befolkningsförändringar Familjeplanering och barnbegränsning ur befolkningspolitisk synvinkel Migration ur demografisk synvinkel Befolkningsstruktur. Demografisk geografi Befolkningsstatistik och folkräkningsstatistik 31.508 Historisk demografi 31.509 @sv
scope note: Väestöntutkimus. Demografia. Väestönlaskennat Tähän biologinen, sosiaalinen ja taloudellinen väestötiede Syntyvyys. Kuolleisuus. Väestönmuutokset Perhesuunnittelu ja syntyvyyden säätely väestöpolitiikan kannalta Muuttoliikkeet väestötieteen kannalta Väestön rakenne. Väestön jakautuminen. Väestömaantiede Väestötilastot ja väestönlaskentatilastot 31.508 Historiallinen väestötiede 31.509

Väestötilastot
type: Concept
type: YKL-luokka
alternative label: Befolkningsförändringar, statistik (31.508) @sv
alternative label: Befolkningsstatistik (31.508) @sv
alternative label: Flyttningsrörelse, befolkningsstatistik (31.508) @sv
alternative label: Folkräkningsstatistik (31.508) @sv
alternative label: Invandringsstatistik (31.508) @sv
alternative label: Maahanmuuttotilastot (31.508)
alternative label: Maassamuuttotilastot (31.508)
alternative label: Maastamuuttotilastot (31.508)
alternative label: Migrationsstatistik (31.508) @sv
alternative label: Muuttoliike, väestötilastot (31.508)
alternative label: Statistiker, befolkningsstatistiker (31.508) @sv
alternative label: Tilastot, väestötilastot (31.508)
alternative label: Utvandringsstatistik (31.508) @sv
alternative label: Väestönlaskentatilastot (31.508)
alternative label: Väestönmuutostilastot (31.508)
alternative label: Väestötilastot (31.508)
broader: Väestötiede. Väestöpolitiikka
in scheme: YKL - Yleisten kirjastojen luokitusjärjestelmä
notation: 31.508
preferred label: Befolkningsstatistik @sv
preferred label: Demographic statistics @en
scope note: Hit allmän befolkningsstatistik, statistik över befolkningsförändringar och folkräkningsstatistik Hit också befolkningsstatistik över bestämda världsdelar, länder eller områden Hit också statistik över hur befolkningen fördelar sig enligt socioekonomiska eller kulturella egenskaper @sv
scope note: Tähän yleiset väestötilastot, väestönmuutostilastot ja väestönlaskentatilastot Tähän myös tiettyä maanosaa, maata tai aluetta koskevat väestötilastot Tähän myös tilastot, jotka koskevat väestön jakautumista taloudellis-sosiaalisten tai kulttuuriominaisuuksien mukaan

VALTIO-OPPI. POLITIIKKA
type: Concept
References: YLEINEN KULTTUURIPOLITIIKKA
References: Tiedepolitiikka
References: Valtiosääntöoikeus
References: ALUESUUNNITTELU. ALUEPOLITIIKKA
References: Kunnallishallinto. Paikallishallinto
References: Talouspolitiikka. Taloudelliset rakenteet
References: SOSIAALIPOLITIIKKA
References: KASVATUS. OPETUS. KASVATUSTIEDE
References: MAANPUOLUSTUS
References: Taidepsykologia. Taidesosiologia. Taidepolitiikka
References: MAAILMANHISTORIA. EUROOPAN HISTORIA
References: SUOMEN HISTORIA
References: POHJOISMAIDEN HISTORIA
References: KESKI-EUROOPAN HISTORIA
References: BRITTEINSAARTEN HISTORIA
References: ETELÄ-EUROOPAN HISTORIA
References: ITÄ-EUROOPAN HISTORIA
References: MUIDEN MAANOSIEN HISTORIA
type: YKL-luokka
alternative label: Inrikespolitik, politisk forskning, allm. (32) @sv
alternative label: Poliittinen kasvatus, yl. (32)
alternative label: Politiikan tutkimus (32+)
alternative label: Politiikantutkimus (32+)
alternative label: Politiikka (32+)
alternative label: Politiikka, tutkimus (32+)
alternative label: Politik (32+) @sv
alternative label: Politik, forskning, allm. (32+) @sv
alternative label: Politisk fostran (32) @sv
alternative label: Politologi (32+) @sv
alternative label: Politologia (32+)
alternative label: Sisäpolitiikka, politiikantutkimus, yl. (32)
alternative label: Statslära, allm. (32) @sv
alternative label: Statsvetenskap, allm. (32) @sv
alternative label: Vaalikoneet, yl. (32+ )
alternative label: Valkompasser, allm. (32+) @sv
alternative label: Valtio-oppi, yl. (32)
alternative label: Valtiotiede, yl. (32)
broader: YHTEISKUNTA
in scheme: YKL - Yleisten kirjastojen luokitusjärjestelmä
narrower: Valtiofilosofia. Poliittiset ideologiat
narrower: Poliittiset järjestelmät
narrower: Ihmisoikeudet. Kansalaisen asema yhteiskunnassa
narrower: Sukupuolten ja seksuaalisten ryhmien asema yhteiskunnassa
narrower: Ikäryhmien asema yhteiskunnassa
narrower: Kansainvälinen politiikka
narrower: Kansainvälinen yhteistyö
narrower: Rauhankysymys. Rauhantutkimus
notation: 32
preferred label: POLITICAL SCIENCE. POLITICS @en
preferred label: STATSLÄRA. POLITIK @sv
scope note: Hit allmänna verk om statslära, politik och politologi Hit och till underklasserna också politisk fostran Politik inom specialområden klassificeras enligt område @sv
scope note: Tähän valtio-opin, politiikan ja politiikantutkimuksen yleisteokset Tähän ja alaluokkiin myös poliittinen kasvatus Erikoisalojen politiikka luokitetaan alan mukaan

Valtiofilosofia. Poliittiset ideologiat
type: Concept
References: Etiikka. Moraalifilosofia
References: Sosiaaliset järjestelmät
References: Poliittiset järjestelmät
References: Ihmisoikeudet. Kansalaisen asema yhteiskunnassa
alternative label: Alternativrörelser, politiska ideologier (32.01) @sv
alternative label: Anarkism (32.01) @sv
alternative label: Anarkism, samhälleliga idéinriktningar (32.01) @sv
alternative label: Anarkismi (32.01)
alternative label: Anarkismi, yhteiskunnalliset aatesuunnat (32.01)
alternative label: Autonomi, statsfilosofi (32.01) @sv
alternative label: Autonomia, valtiofilosofia (32.01)
alternative label: Bolsevismi, yhteiskunnalliset aatesuunnat (32.01)
alternative label: Bolsjevism, samhälleliga idéinriktningar (32.01) @sv
alternative label: Dialektinen materialismi, yhteiskunnalliset aatesuunnat (32.01)
alternative label: Dialektisk materialism, samhälleliga idéinriktningar (32.01) @sv
alternative label: Dystopiat, poliittiset ideologiat (32.01)
alternative label: Dystopiat, valtiofilosofia (32.01)
alternative label: Dystopier, politiska ideologier (32.01) @sv
alternative label: Dystopier, statsfilosofi (32.01) @sv
alternative label: Etiikka, poliittinen (32.01)
alternative label: Etik, politisk (32.01) @sv
alternative label: Fascism, samhälleliga idéinriktningar (32.01) @sv
alternative label: Fasismi, yhteiskunnalliset aatesuunnat (32.01)
alternative label: Gröna, politisk ideologi (32.01) @sv
alternative label: Historiallinen materialismi, yhteisk. aatesuunnat (32.01)
alternative label: Historisk materialism, samhälleliga idéinriktningar (32.01) @sv
alternative label: Inrikespolitik, samhälleliga idéinriktningar (32.01) @sv
alternative label: Islamismi, yhteiskunnalliset aatesuunnat (32.01)
alternative label: Kansallinen identiteetti, nationalismi (32.01)
alternative label: Kansallissosialismi, yhteiskunnalliset aatesuunnat (32.01)
alternative label: Kansallisvaltio, valtiofilosofia (32.01)
alternative label: Kommunismi, yhteiskunnalliset aatesuunnat (32.01)
alternative label: Konservatismi, yhteiskunnalliset aatesuunnat (32.01)
alternative label: Kristillinen sosialismi, yhteiskunnalliset aatesuunnat (32.01)
alternative label: Liberalismi, yhteiskunnalliset aatesuunnat (32.01)
alternative label: Maolaisuus, yhteiskunnalliset aatesuunnat (32.01)
alternative label: Marxismi, yhteiskunnalliset aatesuunnat (32.01)
alternative label: Nationalismi, yhteiskunnalliset aatesuunnat (32.01)
alternative label: Natsismi, yhteiskunnalliset aatesuunnat (32.01)
alternative label: Nihilismi, yhteiskunnalliset aatesuunnat (32.01)
alternative label: Oikeusvaltio, valtiofilosofia (32.01)
alternative label: Poliittinen etiikka (32.01)
alternative label: Poliittinen filosofia (32.01)
alternative label: Poliittinen islam (32.01)
alternative label: Poliittinen valta (32.01)
alternative label: Poliittiset aatesuunnat (32.01)
alternative label: Poliittiset ideologiat (32.01)
alternative label: Poliittiset ääriliikkeet (32.01)
alternative label: Politiikka, filosofia (32.01)
alternative label: Politiikka, teoria (32.01)
alternative label: Politiikka, tutkimusmenetelmät (32.01)
alternative label: Populismi, ideologiat (32.01)
alternative label: Propaganda, poliittinen etiikka (32.01)
alternative label: Radikalismi, yhteiskunnalliset aatesuunnat (32.01)
alternative label: Sisäpolitiikka, yhteiskunnalliset aatesuunnat (32.01)
alternative label: Sosiaalidemokratia, yhteiskunnalliset aatesuunnat (32.01)
alternative label: Sosialidemokratia, yhteiskunnalliset aatesuunnat (32.01)
alternative label: Sosialismi, yhteiskunnalliset aatesuunnat (32.01)
alternative label: Stalinismi, yhteiskunnalliset aatesuunnat (32.01)
alternative label: Syndikalismi, yhteiskunnalliset aatesuunnat (32.01)
alternative label: Utopiat, poliittiset ideologiat (32.01)
alternative label: Utopiat, valtiofilosofia (32.01)
alternative label: Uusvasemmisto, yhteiskunnalliset aatesuunnat (32.01)
alternative label: Vaihtoehtoliikkeet, poliittiset ideologiat (32.01)
alternative label: Vallankumousliikkeet, valtiofilosofia (32.01)
alternative label: Valta, valtiofilosofia (32.01)
alternative label: Valtiofilosofia (32.01)
alternative label: Valtiososialismi, yhteiskunnalliset aatesuunnat (32.01)
alternative label: Valtioteoriat (32.01)
alternative label: Vihreät, poliittinen ideologia (32.01)
alternative label: Yhteiskunnalliset aatesuunnat (32.01)
alternative label: Yhteiskuntakritiikki, poliittiset ideologiat (32.01)
alternative label: Äänioikeus, valtiofilosofia (32.01)
alternative label: Ääriliikkeet, poliittiset (32.01)
broader: VALTIO-OPPI. POLITIIKKA
in scheme: YKL - Yleisten kirjastojen luokitusjärjestelmä
notation: 32.01
scope note: Politiikan filosofia. Politiikan teoria Poliittinen valta. Poliittinen etiikka Poliittiset ideologiat ja aatesuunnat Anarkismi. Fasismi. Kansallissosialismi. Kommunismi. Konservatismi. Liberalismi. Marxismi. Nationalismi. Sosialidemokratia. Sosialismi. Vihreä ideologia Tähän myös yhteiskunnallisten vaihtoehtoliikkeiden ja vallankumousliikkeiden valtiofilosofiset ja poliittiset ideologiat Tähän myös valtiotieteiden ja politiikantutkimuksen filosofia, teoria ja tutkimusmenetelmät yleensä
scope note: Politisk filosofi. Politisk teori Politisk makt. Politisk etik Politiska ideologier och idéinriktningar Konservatism. Liberalism. Kommunism. Marxism. Socialdemokrati. Socialism. Nationalism. Fascism. Nationalsocialism. Anarkism. Gröna ideologier Hit också politiska och statsfilosofiska idéer hos samhälleliga alternativrörelser och revolutionära rörelser Hit också statsvetenskapernas och politologins filosofi, teori och forskningsmetoder i allmänhet @sv

Poliittiset järjestelmät
type: Concept
References: Sosiaaliset järjestelmät
References: Valtiofilosofia. Poliittiset ideologiat
References: Valtiosääntöoikeus
References: Työmarkkinajärjestöt
alternative label: Alternativrörelser (32.1) @sv
alternative label: Arbetarrörelsen (32.1) @sv
alternative label: Demokrati, politiska system (32.1) @sv
alternative label: Demokratia, poliittiset järjestelmät (32.1)
alternative label: Diktatur, politiska system (32.1) @sv
alternative label: Diktatuuri, poliittiset järjestelmät (32.1)
alternative label: Envälde, politiska system (32.1+) @sv
alternative label: Federalism (32.1) @sv
alternative label: Federalismi (32.1)
alternative label: Folkdemokrati, politiska system (32.1+) @sv
alternative label: Folkomröstningar (32.1+) @sv
alternative label: Folkrepresentation (32.1) @sv
alternative label: Folkrörelser, politiska (32.1) @sv
alternative label: Förbundsstater, politiska system (32.1+) @sv
alternative label: Gröna (32.1) @sv
alternative label: Hallitusmuodot (32.1)
alternative label: Inrikespolitik, politiska system (32.1) @sv
alternative label: Islamism, politiska system (32.1+) @sv
alternative label: Islamismi, poliittiset järjestelmät (32.1+)
alternative label: Kansandemokratia, poliittiset järjestelmät (32.1+)
alternative label: Kansanedustuslaitokset (32.1)
alternative label: Kansanliikkeet, poliittiset (32.1)
alternative label: Kansanäänestykset (32.1+)
alternative label: Liittovaltiot, poliittiset järjestelmät (32.1+)
alternative label: Monarki, politiska system (32.1+) @sv
alternative label: Monarkia, poliittiset järjestelmät (32.1+)
alternative label: Parlamentarism, politiska system (32.1) @sv
alternative label: Parlamentarismi, poliittiset järjestelmät (32.1)
alternative label: Partier (32.1) @sv
alternative label: Partiprogram (32.1) @sv
alternative label: Partisystem (32.1) @sv
alternative label: Poliittiset järjestelmät (32.1)
alternative label: Poliittiset järjestöt (32.1)
alternative label: Poliittiset kansanliikkeet (32.1)
alternative label: Poliittiset liikkeet (32.1)
alternative label: Poliittiset nuorisojärjestöt (32.1)
alternative label: Poliittiset opiskelijaliikkeet (32.1)
alternative label: Poliittiset puolueet (32.1)
alternative label: Poliittiset vaihtoehtoliikkeet (32.1)
alternative label: Politiska alternativrörelser (32.1) @sv
alternative label: Politiska folkrörelser (32.1) @sv
alternative label: Politiska organisationer (32.1) @sv
alternative label: Politiska partier (32.1) @sv
alternative label: Politiska rörelser (32.1) @sv
alternative label: Politiska studentrörelser (32.1) @sv
alternative label: Politiska system (32.1) @sv
alternative label: Politiska ungdomsorganisationer (32.1) @sv
alternative label: Presidentinvaalit (32.1)
alternative label: Presidentti, valtiomuodot (32.1)
alternative label: Presidentval (32.1) @sv
alternative label: Presidentämbetet, statsskick (32.1) @sv
alternative label: Puolueet (32.1)
alternative label: Puoluejärjestelmät (32.1)
alternative label: Puolueohjelmat (32.1)
alternative label: Regeringsformer (32.1) @sv
alternative label: Republik, statsskick (32.1) @sv
alternative label: Sisäpolitiikka, poliittiset järjestelmät (32.1)
alternative label: Tasavalta, valtiomuodot (32.1)
alternative label: Teledemokratia (32.1)
alternative label: Työväenliike (32.1)
alternative label: Vaalikoneet, valtiolliset (32.1+)
alternative label: Vaalit, valtiolliset (32.1)
alternative label: Vaihtoehtoliikkeet (32.1)
alternative label: Valtiomuodot (32.1)
alternative label: Valtiosäännöt, valtio-oppi (32.1)
alternative label: Vihreät (32.1)
alternative label: Yksinvalta, poliittiset järjestelmät (32.1+)
alternative label: Äänestäminen, valtiolliset vaalit (32.1)
alternative label: Äänioikeus, vaalijärjestelmät (32.1)
broader: VALTIO-OPPI. POLITIIKKA
in scheme: YKL - Yleisten kirjastojen luokitusjärjestelmä
narrower: Eri maiden poliittiset järjestelmät ja sisäpolitiikka
notation: 32.1
scope note: Hit allmänna verk om politiska system Regeringsformer. Statsskick Författning. Folkrepresentation Partisystem. Valsystem Politiska folkrörelser och alternativrörelser Arbetarrörelsen i allmänhet Republik, demokrati, parlamentarism, monarki och diktatur som politiska system Verk om ett bestämt lands politiska system 32.18+ @sv
scope note: Tähän poliittisia järjestelmiä koskevat yleisteokset Hallitusmuodot. Valtiomuodot Valtiosäännöt. Kansanedustuslaitokset Puoluejärjestelmät. Vaalijärjestelmät Poliittiset kansanliikkeet ja vaihtoehtoliikkeet Työväenliike yleensä Tasavalta, demokratia, parlamentarismi, monarkia ja diktatuuri poliittisina järjestelminä Tietyn maan poliittista järjestelmää koskevat teokset 32.18+

Eri maiden poliittiset järjestelmät ja sisäpolitiikka
type: Concept
References: Sosiaaliset järjestelmät
References: Valtiofilosofia. Poliittiset ideologiat
References: Ihmisoikeudet. Kansalaisen asema yhteiskunnassa
References: Kansainvälinen politiikka
References: Valtiosääntöoikeus
References: Kunnallishallinto. Paikallishallinto
References: Työmarkkinajärjestöt
References: MAAILMANHISTORIA. EUROOPAN HISTORIA
References: SUOMEN HISTORIA
References: POHJOISMAIDEN HISTORIA
References: KESKI-EUROOPAN HISTORIA
References: BRITTEINSAARTEN HISTORIA
References: ETELÄ-EUROOPAN HISTORIA
References: ITÄ-EUROOPAN HISTORIA
References: MUIDEN MAANOSIEN HISTORIA
alternative label: Alternativrörelser, övriga länder (32.18) @sv
alternative label: Arbetarpartier, övriga länder (32.18) @sv
alternative label: Arbetarrörelsen, övriga länder (32.18) @sv
alternative label: Folkrepresentation, övriga länder (32.18) @sv
alternative label: Folkrörelser, politiska, övriga länder (32.18) @sv
alternative label: Första maj, arbetarrörelsen (32.18+) @sv
alternative label: Gröna, övriga länder (32.18) @sv
alternative label: Hallitusmuoto, muut maat (32.18)
alternative label: Inrikespolitik, övriga länder (32.18) @sv
alternative label: Kansallinen identiteetti, muut maat (32.18)
alternative label: Kansanedustuslaitokset, muut maat (32.18)
alternative label: Kansanliikkeet, poliittiset, muut maat (32.18)
alternative label: Kommunistiset puolueet, muut maat (32.18)
alternative label: Kommunistiska partier, övriga länder (32.18) @sv
alternative label: Liberaaliset puolueet, muut maat (32.18)
alternative label: Liberala partier, övriga länder (32.18) @sv
alternative label: Nationell identitet, övriga länder (32.18) @sv
alternative label: Parlamentarism, andra länder (32.18) @sv
alternative label: Parlamentarismi, muut maat (32.18)
alternative label: Partier, övriga länder (32.18) @sv
alternative label: Partiprogram, övriga länder (32.18) @sv
alternative label: Partistöd (32.18+) @sv
alternative label: Partisystem, övriga länder (32.18) @sv
alternative label: Poliittiset järjestelmät, muut maat (32.18)
alternative label: Poliittiset järjestöt, muut maat (32.18)
alternative label: Poliittiset kansanliikkeet, muut maat (32.18)
alternative label: Poliittiset kriisit, sisäpolitiikka (32.18+)
alternative label: Poliittiset nuorisojärjestöt, muut maat (32.18)
alternative label: Poliittiset opiskelijaliikkeet, muut maat (32.18)
alternative label: Poliittiset puolueet, muut maat (32.18)
alternative label: Poliittiset vaihtoehtoliikkeet, muut maat (32.18)
alternative label: Politiska alternativrörelser, övriga länder (32.18) @sv
alternative label: Politiska folkrörelser, övriga länder (32.18) @sv
alternative label: Politiska kriser, inrikespolitik (32.18+) @sv
alternative label: Politiska organisationer, övriga länder (32.18) @sv
alternative label: Politiska partier, övriga länder (32.18) @sv
alternative label: Politiska studentrörelser, övriga länder (32.18) @sv
alternative label: Presidentinvaalit, muut maat (32.18)
alternative label: Presidentti, muiden maiden valtiomuodot (32.18)
alternative label: Puolueet, muut maat (32.18)
alternative label: Puoluejärjestelmät, muut maat (32.18)
alternative label: Puolueohjelmat, muut maat (32.18)
alternative label: Puoluetuki (32.18+)
alternative label: Sisäpolitiikka, muut maat (32.18)
alternative label: Sosialidemokraattiset puolueet, muut maat (32.18)
alternative label: Sosialistiset puolueet, muut maat (32.18)
alternative label: Työväenliike, muut maat (32.18)
alternative label: Työväenpuolueet, muut maat (32.18)
alternative label: Vaalit, valtiolliset, muut maat (32.18)
alternative label: Vaihtoehtoliikkeet, muut maat (32.18)
alternative label: Valtiomuoto, muut maat (32.18)
alternative label: Valtiopäiväasiakirjat, muut maat (32.18)
alternative label: Valtiopäivät, muut maat (32.18)
alternative label: Valtiosääntö, muut maat (32.18)
alternative label: Vappu, työväenliike (32.18+)
alternative label: Vihreät, muut maat (32.18)
alternative label: Äänestäminen, valtiolliset vaalit, muut maat (32.18)
alternative label: Äänioikeus, muut maat (32.18)
broader: Poliittiset järjestelmät
in scheme: YKL - Yleisten kirjastojen luokitusjärjestelmä
narrower: Suomen poliittinen järjestelmä ja sisäpolitiikka
notation: 32.18
scope note: Hit verk som behandlar ett enskilt lands politiska system eller inrikespolitik Hit enskilda länders regeringsform, statsskick, författning, folkrepresentation, partisystem, valsystem, partier och deras program, politiska folkrörelser och alternativrörelser samt deras program Hit också allmänna verk om arbetarrörelsen i ett enskilt land De politiska systemens historia i olika länder 32.1809 Finlands politiska system och inrikespolitik 32.182+ @sv
scope note: Tähän teokset, jotka koskevat jonkin tietyn maan poliittista järjestelmää tai sisäpolitiikkaa Tähän tietyn maan hallitusmuoto, valtiomuoto, valtiosääntö, kansanedustuslaitos, puoluejärjestelmä, vaalijärjestelmä, puolueet ja niiden ohjelmat, poliittiset kansanliikkeet ja vaihtoehtoliikkeet sekä niiden ohjelmat Tähän myös tietyn maan työväenliikettä koskevat yleisteokset Eri maiden poliittisten järjestelmien historia 32.1809 Suomen poliittinen järjestelmä ja sisäpolitiikka 32.182+

Suomen poliittinen järjestelmä ja sisäpolitiikka
type: Concept
References: Sosiaaliset järjestelmät
References: Suomen ulkopolitiikka
References: Kunnallishallinto. Paikallishallinto
References: Työmarkkinajärjestöt
References: SUOMEN HISTORIA
type: YKL-luokka
alternative label: Alternativrörelser, Finland (32.182+) @sv
alternative label: Arbetarrörelsen, Finland (32.182+) @sv
alternative label: Folkrörelser, politiska, Finland (32.182+) @sv
alternative label: Gröna, Finland (32.182+) @sv
alternative label: Inrikespolitik, Finland (32.182+) @sv
alternative label: Kansallinen identiteetti, Suomi (32.182+)
alternative label: Kansanliikkeet, poliittiset, Suomi (32.182+)
alternative label: Korporativism, inrikespolitik allm. (32.182) @sv
alternative label: Korporativismi, sisäpolitiikka yl. (32.182)
alternative label: Nationell identitet, Finland (32.182+) @sv
alternative label: Parlamentarism, Finland (32.182+) @sv
alternative label: Parlamentarismi, Suomi (32.182+)
alternative label: Poliittiset järjestelmät, Suomi (32.182+)
alternative label: Poliittiset kansanliikkeet, Suomi (32.182+)
alternative label: Poliittiset opiskelijaliikkeet, Suomi (32.182+)
alternative label: Poliittiset vaihtoehtoliikkeet, Suomi (32.182+)
alternative label: Politiska alternativrörelser, Finland (32.182+) @sv
alternative label: Politiska folkrörelser, Finland (32.182+) @sv
alternative label: Politiska studentrörelser, Finland (32.182+) @sv
alternative label: Politiska system, Finland (32.182+) @sv
alternative label: Samhällskritik, inrikespolitik, Finland (32.182+) @sv
alternative label: Sisäpolitiikka, Suomi (32.182+)
alternative label: Työväenliike, Suomi (32.182+)
alternative label: Vaihtoehtoliikkeet, Suomi (32.182+)
alternative label: Vihreät, Suomi (32.182+)
alternative label: Yhteiskuntakritiikki, sisäpolitiikka, Suomi (32.182+)
broader: Eri maiden poliittiset järjestelmät ja sisäpolitiikka
in scheme: YKL - Yleisten kirjastojen luokitusjärjestelmä
narrower: Suomen hallitusmuoto ja valtiosääntö
narrower: Suomen valtiopäiväasiakirjat
narrower: Suomen puolueet
notation: 32.182
preferred label: Finland's political system and domestic politics @en
preferred label: Finlands politiska system och inrikespolitik @sv
scope note: Hit allmänna verk om Finlands politiska system Inrikespolitik. Inrikespolitiska debattböcker Allmänna verk om arbetarrörelsen. Hit också politiska rörelser som inte är organiserade till partier. Det finländska politiska systemets historia i allmänhet 32.18209. Den finländska arbetarrörelsens historia och de övriga politiska rörelsernas historia i allmänhet 32.18209. Folkets hus, historia, Finland 32.18209 @sv
scope note: Tähän Suomen poliittista järjestelmää koskevat yleisteokset . Sisäpolitiikka. Sisäpoliittinen mielipidekirjallisuus. Työväenliikettä koskevat yleisteokset . Tähän myös puolueiksi järjestäytymättömät poliittiset liikkeet. Suomen poliittisen järjestelmän historia yleensä 32.18209. Suomen työväenliikkeen ja muiden poliittisten liikkeiden historia 32.18209. Työväentalot, historia, Suomi 32.18209. Tähän myös puolueiksi järjestäytymättömät poliittiset liikkeet, kuten Lapuanliike.

Suomen hallitusmuoto ja valtiosääntö
type: Concept
References: Suomen valtiopäiväasiakirjat
References: OIKEUSTIEDE
References: Kansainvälinen oikeus
References: Valtiosääntöoikeus
References: Keskushallinto
References: Kunnallishallinto. Paikallishallinto
type: YKL-luokka
alternative label: Ahvenanmaa, itsehallinto, yl. (32.1821)
alternative label: Eduskunta, Suomi (32.1821)
alternative label: Eduskuntavaalit, Suomi (32.1821)
alternative label: Folkrepresentation, Finland (32.1821) @sv
alternative label: Hallitusmuoto, Suomi (32.1821)
alternative label: Kansanedustuslaitos, Suomi (32.1821)
alternative label: Lagstiftningsorgan, Finland (32.1821) @sv
alternative label: Lainsäädäntöelimet, Suomi (32.1821)
alternative label: Presidentinvaalit, Suomi (32.1821)
alternative label: Presidentti, Suomen valtiomuoto (32.1821)
alternative label: Presidentval, Finland (32.1821) @sv
alternative label: Presidentämbetet, Finlands statsskick (32.1821) @sv
alternative label: Regeringsform, Finland (32.1821) @sv
alternative label: Riksdag, Finland (32.1821) @sv
alternative label: Riksdagsval, Finland (32.1821) @sv
alternative label: Rösträtt, Finland (32.1821) @sv
alternative label: Statsförfattning, Finland (32.1821) @sv
alternative label: Statsskick, Finland (32.1821) @sv
alternative label: Vaalit, valtiolliset, Suomi (32.1821)
alternative label: Val, politiska, Finland (32.1821) @sv
alternative label: Valdeltagande, politiska val, Finland (32.1821) @sv
alternative label: Valtiomuoto, Suomi (32.1821)
alternative label: Valtiopäivät, Suomi (32.1821)
alternative label: Valtiosääntö, Suomi (32.1821)
alternative label: Äänestäminen, valtiolliset vaalit, Suomi (32.1821)
alternative label: Äänioikeus, Suomi (32.1821)
alternative label: Åland, självstyre, allm. (32.1821) @sv
broader: Suomen poliittinen järjestelmä ja sisäpolitiikka
in scheme: YKL - Yleisten kirjastojen luokitusjärjestelmä
notation: 32.1821
preferred label: Finland's form of government and constitution @en
preferred label: Finlands regeringsform och författning @sv
scope note: Eduskunta. Presidentti. Äänioikeus. Valtiolliset vaalit. Suomen hallitusmuodon, eduskunnan, presidentti-instituution, äänioikeuden ja valtiollisten vaalien historia 32.182109
scope note: Riksdagen. Presidenten Rösträtt. Politiska val Regeringsformens, riksdagens, presidentinstitutionens, rösträttens och de politiska valens historia i Finland 32.182109 @sv

Suomen valtiopäiväasiakirjat
type: Concept
References: Suomen hallitusmuoto ja valtiosääntö
type: YKL-luokka
alternative label: Riksdagshandlingar, Finland (32.1826) @sv
alternative label: Valtiopäiväasiakirjat, Suomi (32.1826)
broader: Suomen poliittinen järjestelmä ja sisäpolitiikka
in scheme: YKL - Yleisten kirjastojen luokitusjärjestelmä
notation: 32.1826
preferred label: Finland's parliamentary proceedings @en
preferred label: Finlands riksdagshandlingar @sv
scope note: . @sv

Suomen puolueet
type: Concept
References: Suomen poliittinen järjestelmä ja sisäpolitiikka
type: YKL-luokka
alternative label: Agrarförbundet (32.1828) @sv
alternative label: Arbetarpartier, Finland (32.1828) @sv
alternative label: Centerpartiet, Finland (32.1828) @sv
alternative label: Finska landsbygdspartiet (32.1828) @sv
alternative label: Gröna förbundet, Finland (32.1828) @sv
alternative label: Kansallinen Kokoomus, Suomi (32.1828)
alternative label: Keskustapuolue, Suomi (32.1828)
alternative label: Kokoomuspuolue, Suomi (32.1828)
alternative label: Kommunistinen puolue, Suomi (32.1828)
alternative label: Kommunistiska partiet, Finland (32.1828) @sv
alternative label: Konstitutionella högerpartiet, Finland (32.1828) @sv
alternative label: Kristdemokraterna i Finland (32.1828) @sv
alternative label: Kristillisdemokraatit, Suomi (32.1828)
alternative label: Kvinnoorganisationer, politiska, Finland (32.1828) @sv
alternative label: Liberaalinen kansanpuolue, Suomi (32.1828)
alternative label: Liberala folkpartiet, Finland (32.1828) @sv
alternative label: Maalaisliitto (32.1828)
alternative label: Naisjärjestöt, poliittiset, Suomi (32.1828)
alternative label: Nationella Samlingspartiet, Finland (32.1828) @sv
alternative label: Nuorisojärjestöt, poliittiset, Suomi (32.1828)
alternative label: Opiskelijajärjestöt, poliittiset, Suomi (32.1828)
alternative label: Partier, Finland (32.1828) @sv
alternative label: Partiprogram, Finland (32.1828) @sv
alternative label: Partisystem, Finland (32.1828) @sv
alternative label: Perussuomalaiset, puolue (32.1828)
alternative label: Perustuslaillinen oikeistopuolue, Suomi (32.1828)
alternative label: Poliittiset järjestöt, Suomi (32.1828)
alternative label: Poliittiset nuorisojärjestöt, Suomi (32.1828)
alternative label: Poliittiset puolueet, Suomi (32.1828)
alternative label: Politiska organisationer, Finland (32.1828) @sv
alternative label: Politiska partier, Finland (32.1828) @sv
alternative label: Politiska ungdomsorganisationer, Finland (32.1828) @sv
alternative label: Puolueet, Suomi (32.1828)
alternative label: Puoluejärjestelmät, Suomi (32.1828)
alternative label: Puolueohjelmat, Suomi (32.1828)
alternative label: Ruotsalainen kansanpuolue, Suomi (32.1828)
alternative label: Samlingspartiet, Finland (32.1828) @sv
alternative label: Sannfinländarna, partien (32.1828) @sv
alternative label: Socialdemokratiska partiet, Finland (32.1828) @sv
alternative label: Socialistiska arbetarpartiet, Finland (32.1828) @sv
alternative label: Sosialidemokraattinen puolue, Suomi (32.1828)
alternative label: Sosialistinen työväenpuolue, Suomi (32.1828)
alternative label: Studentorganisationer, politiska, Finland (32.1828) @sv
alternative label: Suomen kristillisdemokraatit, puolue (32.1828)
alternative label: Suomen maaseudun puolue (32.1828)
alternative label: Svenska Folkpartiet, Finland (32.1828) @sv
alternative label: Työväenpuolueet, Suomi (32.1828)
alternative label: Ungdomsorganisationer, politiska, Finland (32.1828) @sv
alternative label: Vasemmistoliitto, Suomi (32.1828)
alternative label: Vihreä liitto, Suomi (32.1828)
alternative label: Vänsterförbundet, Finland (32.1828) @sv
broader: Suomen poliittinen järjestelmä ja sisäpolitiikka
in scheme: YKL - Yleisten kirjastojen luokitusjärjestelmä
notation: 32.1828
preferred label: Finland's parties @en
preferred label: Finlands partier @sv
scope note: Hit de politiska partierna i Finland och deras program Hit också partiernas kvinno-, ungdoms- och studentorganisationer samt deras program Partiernas historia i Finland 32.182809 @sv
scope note: Tähän Suomen poliittiset puolueet ja niiden ohjelmat Tähän myös puolueiden nais-, nuoriso- ja opiskelija- järjestöt sekä niiden ohjelmat Suomen puolueiden historiat 32.182809

Ihmisoikeudet. Kansalaisen asema yhteiskunnassa
type: Concept
References: Tiedepolitiikka
References: USKONNONFILOSOFIA
References: Elämäntapojen sosiologia. Kulttuurisosiologia
References: Eri maiden poliittiset järjestelmät ja sisäpolitiikka
References: Kansainvälinen oikeus
References: Työ. Työelämä
References: Taidepsykologia. Taidesosiologia. Taidepolitiikka
References: KIRJALLISUUSTIEDE
References: MAAILMANHISTORIA. EUROOPAN HISTORIA
References: SUOMEN HISTORIA
References: POHJOISMAIDEN HISTORIA
References: KESKI-EUROOPAN HISTORIA
References: BRITTEINSAARTEN HISTORIA
References: ETELÄ-EUROOPAN HISTORIA
References: ITÄ-EUROOPAN HISTORIA
References: MUIDEN MAANOSIEN HISTORIA
References: Elämäkerrat. Muistelmat, sotamuistelmat
alternative label: Aatteelliset vähemmistöt, asema yhteiskunnassa, yl. (32.2+)
alternative label: Aivopesu, ihmisoikeudet (32.2+)
alternative label: Ajatuksenvapaus (32.2+)
alternative label: Antisemitismi (32.2+)
alternative label: Apartheid (32.2+)
alternative label: Etninen identiteetti, ihmisoikeudet (32.2+)
alternative label: Etniset vähemmistöt, asema yhteiskunnassa (32.2+)
alternative label: Identiteettisuoja (32.2+)
alternative label: Ihmisoikeudet (32.2+)
alternative label: Ihmisoikeuksien loukkaukset (32.2+)
alternative label: Intiaanit, vähemmistökysymys (32.2)
alternative label: Intimiteettisuoja (32.2+)
alternative label: Juutalaiset, antisemitismi (32.2+)
alternative label: Juutalaisvainot (32.2+)
alternative label: Kansalaisen asema yhteiskunnassa (32.2+)
alternative label: Kansalaisoikeudet, ihmisoikeudet (32.2+)
alternative label: Kansalaistottelemattomuus (32.2+)
alternative label: Kansallinen identiteetti, ihmisoikeudet (32.2+)
alternative label: Kansalliset vähemmistöt, asema yhteiskunnassa (32.2+)
alternative label: Kansallisuuskysymykset, ihmisoikeudet (32.2+)
alternative label: Keskitysleirit (32.2+)
alternative label: Kidutus, ihmisoikeudet (32.2+)
alternative label: Kielellinen identiteetti, ihmisoikeudet (32.2+)
alternative label: Kielelliset vähemmistöt, asema yhteiskunnassa (32.2+)
alternative label: Kokoontumisvapaus, ihmisoikeudet (32.2+)
alternative label: Kotipaikka, ihmisoikeudet (32.2+)
alternative label: Kulttuuri-identiteetti, ihmisoikeudet (32.2+)
alternative label: Kuolemanrangaistus, ihmisoikeudet (32.2+)
alternative label: Kurdit, vähemmistöjen asema (32.2+)
alternative label: Maastakarkotus, ihmisoikeudet (32.2+)
alternative label: Mielenosoitukset, ihmisoikeudet (32.2+)
alternative label: Mielipidevangit (32.2+)
alternative label: Mustat pantterit, rotukysymys (32.2)
alternative label: Oikeusturva, ihmisoikeudet (32.2+)
alternative label: Orjuus (32.2)
alternative label: Painovapaus (32.2+)
alternative label: Perusoikeudet, ihmisoikeudet (32.2+)
alternative label: Poliittiset vangit (32.2+)
alternative label: Poliittiset vähemmistöt, asema yhteiskunnassa (32.2+)
alternative label: Rasismi (32.2+)
alternative label: Rasismi, antisemitismi (32.2+)
alternative label: Rasismi, apartheid (32.2+)
alternative label: Romanit, vähemmistökysymys (32.2+)
alternative label: Rotuongelmat, ihmisoikeudet (32.2+)
alternative label: Rotusyrjintä (32.2+)
alternative label: Rotusyrjintä, rotuvähemmistöt (32.2+)
alternative label: Saamelaiset, vähemmistökysymys (32.2+)
alternative label: Sananvapaus, ihmisoikeudet (32.2+)
alternative label: Sensuuri (32.2+)
alternative label: Sikhit, vähemmistöjen asema (32.2+)
alternative label: Solvaaminen (32.2) {@fi}
alternative label: Suomenruotsalaiset, asema yhteiskunnassa (32.2)
alternative label: Suomenruotsalaisuus, vähemmistökysymys (32.2)
alternative label: Syrjintä (32.2)
alternative label: Syrjintä, etniset vähemmistöt (32.2+)
alternative label: Syrjintä, kielelliset vähemmistöt (32.2+)
broader: VALTIO-OPPI. POLITIIKKA
in scheme: YKL - Yleisten kirjastojen luokitusjärjestelmä
narrower: Siirtolaiset. Pakolaiset
notation: 32.2
scope note: Hit allmänna verk om medborgarens ställning, mänskliga rättigheter och brott mot mänskliga rättigheter i olika länder. Tanke-, förenings-, tryck- och yttrandefrihet samt brott mot dem och censur i olika länder. Nationella, etniska, religiösa, språkliga, ideella, politiska minoritetens ställning i olika länder. Apartheid, etniskt förtryck, antisemitism, dissidenter, politiska fångar och åsiktsfångar, koncentrations- och fångläger samt tortyr i olika länder. Hit också slaveri i olika länder. Hit också civil olydnad i olika länder. Människorättsfrågor inom olika områden klassificeras enligt område. Amnesty International 32.206. De mänskliga rättigheternas historia, brotten mot mänskliga rättigheter och medborgarnas ställning i olika länder 32.209. Holocaust 32.209 @sv
scope note: Tähän kansalaisen asemaa, ihmisoikeuksia ja ihmisoikeuksien loukkauksia eri maissa koskevat yleisteokset. Ajatuksen-, yhdistymis-, paino- ja sananvapaus sekä niiden loukkaukset ja sensuuri eri maissa. Kansallisten, etnisten, rodullisten, uskonnollisten, kielellisten, aatteellisten ja poliittisten vähemmistöjen asema eri maissa. Apartheid, rotusyrjintä, antisemitismi, toisinajattelijat, poliittiset ja mielipidevangit, keskitys- ja vankileirit sekä kidutus eri maissa. Tähän myös orjuus eri maissa. Tähän myös kansalaistottelemattomuus eri maissa. Eri aloja koskevat ihmisoikeuskysymykset luokitetaan alan mukaan. Amnesty International 32.206. Ihmisoikeuksien, ihmisoikeuksien loukkausten ja kansalaisen aseman historia eri maissa 32.209. Holokausti 32.209

Siirtolaiset. Pakolaiset
type: Concept
References: Alueellinen sosiologia
References: Väestötiede. Väestöpolitiikka
References: Työ. Työelämä
References: SOSIAALIPOLITIIKKA
References: KASVATUS. OPETUS. KASVATUSTIEDE
type: YKL-luokka
alternative label: Amerikafinländare, utvandring (32.21) @sv
alternative label: Amerikanruotsalaiset, siirtolaisuus (32.21)
alternative label: Amerikansuomalaiset, siirtolaisuus (32.21)
alternative label: Asylpolitik (32.21) @sv
alternative label: Asylsökande (32.21) @sv
alternative label: Australiansuomalaiset, siirtolaisuus (32.21)
alternative label: Australienfinländare, utvandring (32.21) @sv
alternative label: Befolkningsomflyttningar, mänskliga rättigheter (32.21) @sv
alternative label: Flyktingar, ställning i samhället (32.21) @sv
alternative label: Flyktingarbete (32.21) @sv
alternative label: Flyktingpolitik (32.21) @sv
alternative label: Flyttningsrörelse, utvandring (32.21) @sv
alternative label: Gästarbetare, ställning i samhället (32.21) @sv
alternative label: Integrationsfrämjande (32.21) @sv
alternative label: Invandrararbete (32.21) @sv
alternative label: Invandrare, ställning i samhället (32.21) @sv
alternative label: Invandrarpolitik (32.21) @sv
alternative label: Invandring, flyktingfrågan (32.21) @sv
alternative label: Invandring, immigration (32.21) @sv
alternative label: Kanadafinländare, utvandring (32.21) @sv
alternative label: Kanadansuomalaiset, siirtolaisuus (32.21)
alternative label: Kansalaisen asema, siirtolaiset ja pakolaiset (32.21)
alternative label: Kotouttaminen (32.21)
alternative label: Kotoutuminen (32.21)
alternative label: Krigsflyktingar (32.21) @sv
alternative label: Krigstid, flyktingar (32.21) @sv
alternative label: Maahanmuuttajat, asema yhteiskunnassa (32.21)
alternative label: Maahanmuuttajatyö (32.21)
alternative label: Maahanmuutto, pakolaiskysymys (32.21)
alternative label: Maahanmuutto, siirtolaisuus (32.21)
alternative label: Maahanmuuttopolitiikka (32.21)
alternative label: Maastamuutto, pakolaiskysymys (32.21)
alternative label: Maastamuutto, siirtolaisuus (32.21)
alternative label: Medborgarens ställning, invandrare och flyktingar (32.21) @sv
alternative label: Monikulttuurisuus, maahanmuuttajat (32.21)
alternative label: Muuttoliike, siirtolaisuus (32.21)
alternative label: Mångkulturalism, invandrare (32.21) @sv
alternative label: Norgefinnar, utvandring (32.21) @sv
alternative label: Norjansuomalaiset, siirtolaisuus (32.21)
alternative label: Pakolaiset, asema yhteiskunnassa (32.21)
alternative label: Pakolaispolitiikka (32.21)
alternative label: Pakolaistyö (32.21)
alternative label: Poliittiset pakolaiset (32.21)
alternative label: Politiska flyktingar (32.21) @sv
alternative label: Ruotsinsuomalaiset, siirtolaisuus (32.21)
alternative label: Siirtolaiset, asema yhteiskunnassa (32.21)
alternative label: Siirtolaisuus (32.21)
alternative label: Social anpassning (32.21) @sv
alternative label: Sota-aika, pakolaiset (32.21)
alternative label: Sotapakolaiset (32.21)
alternative label: Svenskamerikaner, utvandring (32.21) @sv
alternative label: Sverigefinländare, utvandring (32.21) @sv
alternative label: Turvapaikanhakijat (32.21)
alternative label: Turvapaikkapolitiikka (32.21)
alternative label: Utvandring (32.21) @sv
alternative label: Utvandring, emigration (32.21) @sv
alternative label: Utvandring, flyktingfrågan (32.21) @sv
alternative label: Vierastyöläiset, asema yhteiskunnassa (32.21)
alternative label: Väestönsiirrot, ihmisoikeudet (32.21)
broader: Ihmisoikeudet. Kansalaisen asema yhteiskunnassa
in scheme: YKL - Yleisten kirjastojen luokitusjärjestelmä
notation: 32.21
preferred label: Emigrants and immigrants. Refugees @en
preferred label: Invandrare. Flyktingar @sv
scope note: Invandring, emigration och immigration i allmänhet. Politiska flyktingar och krigsflyktingar i olika länder. Invandrar-, flykting- och asylpolitik i olika länder. Invandrarnas och flyktingarnas ställning i olika länder. Integrationsfrämjande. Social anpassning. Verk om invandrares och flyktingars ställning inom vissa områden i samhällslivet klassificeras enligt område. Invandringens historia i olika länder 32.2109. Krigsbarn, historia 32.2109 @sv
scope note: Siirtolaisuus, maahanmuutto ja maastamuutto yleensä . Poliittiset pakolaiset ja sotapakolaiset eri maissa. Siirtolais-, maahanmuutto-, pakolais- ja turvapaikkapolitiikka eri maissa. Siirtolaisten ja pakolaisten asema eri maissa. Kotouttaminen. Kotoutuminen. Siirtolaisten ja pakolaisten asemaa tietyllä elämänalueella koskevat teokset luokitetaan alan mukaan. Siirtolaisuuden historia eri maissa 32.2109. Sotalapset, historia 32.2109

Sukupuolten ja seksuaalisten ryhmien asema yhteiskunnassa
type: Concept
modified: 2026-05-06T13:12:25
References: Persoonallisuuden psykologia
References: Tiedepolitiikka
References: Perhesosiologia
References: Julkis- ja hallinto-oikeus
References: Työ. Työelämä
References: Perhepolitiikka
References: KASVATUS. OPETUS. KASVATUSTIEDE
type: YKL-luokka
alternative label: Diskriminering, köndiskriminering (32.3+) @sv
alternative label: Grundrättigheter, ur ett könsperspektiv (32.3+) @sv
alternative label: Intersektionaalinen feminismi (32.3+)
alternative label: Intersektionell feminism (32.3+) @sv
alternative label: Jämställdhet, mellan könen (32.3+) @sv
alternative label: Kansalaisen asema, sukupuolten tasa-arvo (32.3)
alternative label: Könsdiskriminering (32.3+) @sv
alternative label: Könsidentitet, mänskliga rättigheter (32.3+) @sv
alternative label: Medborgarens ställning, jämställdhet mellan könen (32.3) @sv
alternative label: Perusoikeudet, sukupuolten kannalta (32.3+)
alternative label: Rollfrågan (32.3) @sv
alternative label: Roolikysymys (32.3)
alternative label: Seksuaalinen identiteetti, ihmisoikeudet (32.3+)
alternative label: Sexuell identitet, mänskliga rättigheter (32.3+) @sv
alternative label: Sukupuoli-identiteetti, ihmisoikeudet (32.3+)
alternative label: Sukupuolisyrjintä (32.3+)
alternative label: Syrjintä, sukupuolisyrjintä (32.3+)
alternative label: Tasa-arvo, sukupuolten välinen (32.3+)
broader: VALTIO-OPPI. POLITIIKKA
in scheme: YKL - Yleisten kirjastojen luokitusjärjestelmä
narrower: Naisen ja miehen asema yhteiskunnassa
narrower: Sukupuoli- ja seksuaalivähemmistöjen asema yhteiskunnassa
notation: 32.3
preferred label: Gender and sexuality in society @en
preferred label: Ställning i samhället beroende på kön och sexuell läggning @sv
scope note: Hit allmänna verk om jämställdheten mellan könen eller könsdiskriminering i olika länder. Hit också mänskliga rättigheter och medborgarens ställning med tanke på jämställdheten mellan könen. Intersektionell feminism 32.3+. Feminism ur ett perspektiv av kvinnors status 32.31. @sv
scope note: Tähän sukupuolten tasa-arvoa tai eriarvoisuutta eri maissa koskevat yleisteokset. Tähän myös ihmisoikeudet ja kansalaisen asema sukupuolten tasa-arvon kannalta. Intersektionaalinen feminismi 32.3+. Feminismi naisen aseman kannalta 32.31

Naisen ja miehen asema yhteiskunnassa
type: Concept
References: Persoonallisuuden psykologia
References: Tiedepolitiikka
References: Perhesosiologia
References: Julkis- ja hallinto-oikeus
References: Työ. Työelämä
References: Perhepolitiikka
References: KASVATUS. OPETUS. KASVATUSTIEDE
type: YKL-luokka
alternative label: Feminism (32.31) @sv
alternative label: Feminismi (32.31)
alternative label: Heteroseksuaalisuus, asema yhteiskunnassa (32.31)
alternative label: Heterosexualitet, ställning i samhället (32.31) @sv
alternative label: Kvinnokultur (32.31) @sv
alternative label: Kvinnor, sociala roller (32.31) @sv
alternative label: Kvinnor, ställning i samhället (32.31) @sv
alternative label: Kvinnosaksrörelsen (32.31) @sv
alternative label: Könsroller, kvinnans och mannens ställning (32.31) @sv
alternative label: Mansrörelser (32.31) @sv
alternative label: Miehet, asema yhteiskunnassa (32.31)
alternative label: Miehet, sosiaaliset roolit (32.31)
alternative label: Miesasialiikkeet (32.31)
alternative label: Män, sociala roller (32.31) @sv
alternative label: Män, ställning i samhället (32.31) @sv
alternative label: Naisasialiike (32.31)
alternative label: Naiset, asema yhteiskunnassa (32.31)
alternative label: Naiset, sosiaaliset roolit (32.31)
alternative label: Naiskulttuuri (32.31)
alternative label: Omskärelse, kvinnans och mannens ställning (32.31) @sv
alternative label: Sociala roller, mannen och kvinnan (32.31) @sv
alternative label: Sosiaaliset roolit, nainen ja mies (32.31)
alternative label: Sukupuoliroolit, naisen ja miehen asema (32.31)
alternative label: Ympärileikkaus, naisen ja miehen asema (32.31)
broader: Sukupuolten ja seksuaalisten ryhmien asema yhteiskunnassa
in scheme: YKL - Yleisten kirjastojen luokitusjärjestelmä
notation: 32.31
preferred label: Kvinnans och mannens ställning i samhället @sv
preferred label: Woman and man in society @en
scope note: Hit allmänna verk om kvinnans och mannens ställning i olika länder. Mannens och kvinnans sociala roller. Verk om kvinnans eller mannens ställning inom enskilda områden i samhällslivet klassificeras enligt område. Kvinnans och mannens ställning i olika länder ur historisk eller kulturhistorisk synvinkel 32.3109. Suffragetter. Feminism ur kvinnors ställningsperspektiv. Intersektionell feminism 32.2+. @sv
scope note: Tähän naisen ja miehen asemaa eri maissa koskevat yleisteokset. Nais- ja miesasialiikkeet. Naisen ja miehen sosiaaliset roolit. Naisen tai miehen asemaa tietyllä elämänalueella koskevat teokset luokitetaan alan mukaan. Naisen ja miehen asema eri maissa historialliselta tai kulttuurihistorialliselta kannalta 32.3109. Suffragetit. Feminismi naisen aseman kannalta. Intersektionaalinen feminismi 32.2+

Sukupuoli- ja seksuaalivähemmistöjen asema yhteiskunnassa
type: Concept
References: Persoonallisuuden psykologia
References: Tiedepolitiikka
References: Perhesosiologia
References: Julkis- ja hallinto-oikeus
References: Työ. Työelämä
References: Perhepolitiikka
References: KASVATUS. OPETUS. KASVATUSTIEDE
type: YKL-luokka
alternative label: Diskriminering, sexuella minoriteter (32.32) @sv
alternative label: Homoseksuaalisuus, asema yhteiskunnassa (32.32)
alternative label: Homosexualitet, ställning i samhället (32.32) @sv
alternative label: Icke-binära identitet (32.32) @sv
alternative label: Könsminoriteter, ställning i samhället (32.32) @sv
alternative label: Könsöverskridande identitet (32.32) @sv
alternative label: Lesbiskhet, ställning i samhället (32.32) @sv
alternative label: Lesbous, asema yhteiskunnassa (32.32)
alternative label: Muunsukupuoliset, asema yhteiskunnassa (32.32)
alternative label: Seksuaalivähemmistöt, asema yhteiskunnassa (32.32)
alternative label: Sexuella minoriteter, ställning i samhället (32.32) @sv
alternative label: Sukupuoliset vähemmistöt, asema yhteiskunnassa (32.32)
alternative label: Sukupuolivähemmistöt, asema yhteiskunnassa (32.32)
alternative label: Syrjintä, seksuaaliset vähemmistöt (32.32)
alternative label: Transsexualism, minoriteternas ställning (32.32) @sv
alternative label: Transsukupuolisuus, asema yhteiskunnassa (32.32)
broader: Sukupuolten ja seksuaalisten ryhmien asema yhteiskunnassa
in scheme: YKL - Yleisten kirjastojen luokitusjärjestelmä
notation: 32.32
preferred label: Gender minorities and sexual minorities in society @en
preferred label: Könsminoriteternas och de sexuella minoriteternas ställning i samhället @sv
scope note: Hit allmänna verk som rör könsminoriteters och sexuella minoriteters ställning, jämlikhet eller ojämlikhet i olika länder. Hit även mänskliga rättigheter och medborgarens ställning i avseende på jämställdhet mellan könen. Verk som behandlar könsminoriteternas och de sexuella minoriteterna ställning inom speciella livsområden klassificeras enligt dessa områden. Könsminoriteternas och de sexuella minoriteternas ställning i olika länder ur historiskt eller kulturhistoriskt perspektiv till klass 32.3209. @sv
scope note: Tähän sukupuoli- ja seksuaalivähemmistöjen asema, tasa-arvoa tai eriarvoisuutta eri maissa koskevat yleisteokset. Tähän myös ihmisoikeudet ja kansalaisen asema sukupuoli- ja seksuaalivähemmistöjen tasa-arvon kannalta. Sukupuoli- ja seksuaalivähemmistöjen asemaa tietyllä elämänalueella koskevat teokset luokitetaan alan mukaan. Sukupuoli- ja seksuaalivähemmistöjen asema eri maissa historialliselta tai kulttuurihistorialliselta kannalta luokkaan 32.3209.

Ikäryhmien asema yhteiskunnassa
type: Concept
References: Lasten ja nuorten kulttuuritoiminta
References: Elämäntapojen sosiologia. Kulttuurisosiologia
References: Perhesosiologia
References: Työ. Työelämä
References: Toimeentuloturva
References: Vanhuspalvelut
References: Perhepolitiikka
References: Nuorisotyö. Lapsityö
type: YKL-luokka
alternative label: Aikuiset, asema yhteiskunnassa, yl. (32.4)
alternative label: Aktiiviväestö, asema yhteiskunnassa (32.4)
alternative label: Arbetsför ålder, personer i arbetsför ålder, ställning i samhället (32.4) @sv
alternative label: Barn, ställning i samhället (32.4) @sv
alternative label: Barnets rättigeter, barnets ställning i samhället (32.4) @sv
alternative label: Barnets ställning (32.4) @sv
alternative label: Diskriminering, åldersdiskriminering (32.4) @sv
alternative label: Eläkeläiset, asema yhteiskunnassa (32.4)
alternative label: Grundrättigheter, olika åldergruppers ställning (32.4) @sv
alternative label: Ikäryhmät, asema yhteiskunnassa (32.4)
alternative label: Ikäsyrjintä (32.4)
alternative label: Kansalaisen asema, eri ikäryhmät (32.4)
alternative label: Lapsen asema (32.4)
alternative label: Lapsen oikeudet, lapsen asema yhteiskunnassa (32.4)
alternative label: Lapset, asema yhteiskunnassa (32.4)
alternative label: Medborgarens ställning, olika åldersgrupper (32.4) @sv
alternative label: Nuoret, asema yhteiskunnassa (32.4)
alternative label: Nuorisopolitiikka (32.4)
alternative label: Nuorten asema (32.4)
alternative label: Pensionärer, ställning i samhället (32.4) @sv
alternative label: Perusoikeudet, ikäryhmien kannalta (32.4)
alternative label: Syrjintä, ikäsyrjintä (32.4)
alternative label: Työikäiset, asema yhteiskunnassa (32.4)
alternative label: Unga, ställning i samhället (32.4) @sv
alternative label: Ungdomens ställning (32.4) @sv
alternative label: Ungdomspolitik (32.4) @sv
alternative label: Vanhukset, asema yhteiskunnassa (32.4)
alternative label: Vanhuspolitiikka (32.4)
alternative label: Vanhusten asema (32.4)
alternative label: Vuxna, ställning i samhället, allm. (32.4) @sv
alternative label: Yrkesaktiv befolkning, ställning i samhället (32.4) @sv
alternative label: Äldres ställning (32.4) @sv
alternative label: Åldersdiskriminering (32.4) @sv
alternative label: Åldersgrupper, ställning i samhället (32.4) @sv
alternative label: Åldringar, ställning i samhället (32.4) @sv
alternative label: Åldringspolitik (32.4) @sv
broader: VALTIO-OPPI. POLITIIKKA
in scheme: YKL - Yleisten kirjastojen luokitusjärjestelmä
notation: 32.4
preferred label: Different age groups in society @en
preferred label: Åldersgruppernas ställning i samhället @sv
scope note: Hit allmänna verk om barnens, de ungas, de vuxnas och de gamlas ställning i olika länder Hit också allmänna verk om den arbetsföra befolkningens och pensionärernas ställning i olika länder Hit också ungdomspolitik i olika länder Hit också mänskliga rättigheter och medborgarens ställning ur de olika åldersgruppernas synvinkel Verk som behandlar åldersgruppernas ställning inom ett enskilt område i samhällslivet klassificeras enligt område Åldersgruppernas ställning i olika länder ur historisk eller kulturhistorisk synvinkel 32.409 @sv
scope note: Tähän lasten, nuorten, aikuisten, työikäisten, vanhusten tai eläkeikäisten asemaa eri maissa koskevat yleisteokset Tähän myös nuorisopolitiikka eri maissa Tähän myös ihmisoikeudet ja kansalaisen asema eri ikäryhmien kannalta Ikäryhmien asemaa tietyllä elämänalueella koskevat teokset luokitetaan alan mukaan Ikäryhmien asema eri maissa historialliselta tai kulttuurihistorialliselta kannalta 32.409

Kansainvälinen politiikka
type: Concept
References: Eri maiden poliittiset järjestelmät ja sisäpolitiikka
References: Kansainvälinen yhteistyö
References: Rauhankysymys. Rauhantutkimus
References: MAANPUOLUSTUS
References: MAAILMANHISTORIA. EUROOPAN HISTORIA
References: SUOMEN HISTORIA
References: POHJOISMAIDEN HISTORIA
References: KESKI-EUROOPAN HISTORIA
References: BRITTEINSAARTEN HISTORIA
References: ETELÄ-EUROOPAN HISTORIA
References: ITÄ-EUROOPAN HISTORIA
References: MUIDEN MAANOSIEN HISTORIA
alternative label: Alliansfria stater, internationell politik (32.5+) @sv
alternative label: Ambassader (32.5+) @sv
alternative label: Atlantförbundet (32.5) @sv
alternative label: Atlantin liitto (32.5)
alternative label: Avspänning (32.5) @sv
alternative label: Beskickningar utomlands (32.5+) @sv
alternative label: CIA (32.5)
alternative label: Civilkrishantering (32.5+) @sv
alternative label: Diplomati (32.5+) @sv
alternative label: Diplomatia (32.5+)
alternative label: Geopolitiikka (32.5+)
alternative label: Globalisaatio, kansainvälinen politiikka (32.5+)
alternative label: Imperialismi, kansainvälinen politiikka (32.5)
alternative label: Integraatio (32.5+)
alternative label: Integraatio, poliittinen (32.5+)
alternative label: KGB (32.5)
alternative label: Kansainvälinen politiikka (32.5+)
alternative label: Kansainvälinen turvallisuuspolitiikka (32.5+)
alternative label: Kansainväliset sopimukset (32.5+)
alternative label: Kansainväliset sopimukset, kansainvälinen politiikka (32.5+)
alternative label: Kansainväliset suhteet, politiikka (32.5+)
alternative label: Kolonialismi, kansainvälinen politiikka (32.5)
alternative label: Konsulaatit (32.5+)
alternative label: Konsulitoimi (32.5+)
alternative label: Kriisinhallinta, kansainvälinen politiikka (32.5+)
alternative label: Kriisinhallinta, siviilikriisinhallinta (32.5+)
alternative label: Kriisit, kansainvälinen politiikka (32.5+)
alternative label: Kylmä sota (32.5)
alternative label: Liennytys (32.5)
alternative label: Lähetystöt (32.5+)
alternative label: Maanpetos, vakoilu (32.5+)
alternative label: Maantiede, poliittinen (32.5+)
alternative label: NATO (32.5)
alternative label: Pohjois-Atlantin liitto (32.5)
alternative label: Poliittinen maantiede (32.5+)
alternative label: Poliittinen vakoilu (32.5+)
alternative label: Poliittiset kriisit, kansainvälinen politiikka (32.5+)
alternative label: Poliittiset suhteet, valtioiden väliset (32.5+)
alternative label: Puolueettomuus, kansainvälinen politiikka (32.5+)
alternative label: Rauhanneuvottelut (32.5+)
alternative label: Rauhansopimukset (32.5+)
alternative label: Rauhanvälitys (32.5+)
alternative label: Siirtomaapolitiikka (32.5)
alternative label: Sitoutumattomat valtiot, kansainvälinen politiikka (32.5+)
alternative label: Siviilikriisinhallinta (32.5+)
alternative label: Sotilaallinen vakoilu (32.5+)
alternative label: Sotilasliitot (32.5+)
alternative label: Suojelupoliisi, kansainvälinen toiminta (32.5+)
alternative label: Suurlähetystöt (32.5+)
alternative label: Tiedustelupalvelut (32.5+)
alternative label: Turvallisuuspolitiikka, kansainvälinen (32.5+)
alternative label: Ulkomaanedustustot (32.5+)
alternative label: Ulkopolitiikka (32.5+)
alternative label: Vakoilu, poliittinen ja sotilaallinen (32.5+)
alternative label: Valtioiden väliset poliittiset suhteet (32.5+)
alternative label: Valtioliitot (32.5+)
alternative label: Varsovan liitto (32.5)
alternative label: WEU (32.5)
alternative label: YK, turvallisuusneuvosto (32.5)
alternative label: Yhteistyö, kansainvälinen politiikka (32.5+)
broader: VALTIO-OPPI. POLITIIKKA
in scheme: YKL - Yleisten kirjastojen luokitusjärjestelmä
narrower: Euroopan unioni
narrower: Suomen ulkopolitiikka
notation: 32.5
scope note: Diplomati. Internationell säkerhetspolitik Politiska relationer stater emellan Olika länders utrikes- och säkerhetspolitik Militära allianser. NATO. WEU. Statsförbund Obundna stater. Neutrala stater FN:s säkerhetsråd Politisk geografi. Kolonialpolitik Militärt och politiskt spionage Underrättelsetjänst i olika länder Hit också verk som behandlar både internationell politik och internationellt samarbete KSSE 32.5065 Finlands utrikes- och säkerhetspolitik 32.52 @sv
scope note: Diplomatia. Kansainvälinen turvallisuuspolitiikka Valtioiden väliset poliittiset suhteet Eri maiden ulko- ja turvallisuuspolitiikka Sotilasliitot. Valtioliitot. NATO. WEU Sitoutumattomat valtiot. Puolueettomat valtiot YK:n turvallisuusneuvosto Poliittinen maantiede. Siirtomaapolitiikka Sotilaallinen ja poliittinen vakoilu Eri maiden tiedustelupalvelut Tähän myös teokset, jotka koskevat sekä kansainvälistä politiikkaa että kansainvälistä yhteistyötä ETYK 32.5065 Suomen ulko- ja turvallisuuspolitiikka 32.52

Euroopan unioni
type: Concept
References: Kansainvälinen yhteistyö
References: OIKEUSTIEDE
References: Oikeusoppaat
References: Laki- ja säädöskokoelmat. Oikeustapauskokoelmat
References: Komiteanmietinnöt
References: Kansainvälinen oikeus
References: Julkis- ja hallinto-oikeus
References: Valtiosääntöoikeus
References: Virkamiesoikeus
References: Asemakaava- ja rakentamislainsäädäntö
References: Sosiaalioikeus
References: Vero-oikeus
References: Kunnallisoikeus
References: Kirkko-oikeus
References: Siviili- ja kauppaoikeus
References: Perhe- ja holhousoikeus
References: Perintö- ja testamenttioikeus
References: Esine- ja velvoiteoikeus
References: Asunto- ja kiinteistönkauppaoikeus
References: Immateriaalioikeudet
References: Huoneen- ja maanvuokralainsäädäntö
References: Kauppaoikeus
References: Kirjanpito- ja tilintarkastuslainsäädäntö
References: Yhtiölainsäädäntö
References: Pankkilainsäädäntö
References: Vakuutuslainsäädäntö
References: Talousoikeus
References: Maa- ja vesioikeus
References: Maa- ja metsätalouslainsäädäntö
References: Elinkeino-oikeus
References: Työoikeus
References: Liikennelainsäädäntö
References: Rikosoikeus
References: Kriminaalipolitiikka. Vankeinhoito
References: Prosessioikeus. Oikeushallinto
References: Ulosotto- ja konkurssilainsäädäntö
References: ALUESUUNNITTELU. ALUEPOLITIIKKA
References: Valtakunnallinen suunnittelu
References: Seutusuunnittelu
References: Yhdyskuntasuunnittelu. Kaupunkisuunnittelu. Ympäristönsuunnittelu
References: Asuinalueiden suunnittelu
References: Liikennesuunnittelu
References: Viheralueiden suunnittelu
References: Kansainväliset talousjärjestöt
References: Maatalouspolitiikka
type: YKL-luokka
alternative label: EU (32.51)
alternative label: EU-politiikka, Suomi (32.51)
alternative label: EU-politik, Finland (32.51) @sv
alternative label: Euroopan parlamentti (32.51)
alternative label: Euroopan unioni (32.51)
alternative label: Europaparlamentet (32.51) @sv
alternative label: Europarlamentsval (32.51) @sv
alternative label: Europarlamenttivaalit (32.51)
alternative label: Europeiska unionen (32.51) @sv
alternative label: Integraatio, Eurooppa (32.51)
alternative label: Integration, Europa (32.51) @sv
alternative label: Vaalikoneet, europarlamenttivaalit (32.51)
alternative label: Vaalit, europarlementtivaalit (32.51)
alternative label: Val, europarlamentsval (32.51) @sv
alternative label: Valdeltagande, europarlamentsval (32.51) @sv
alternative label: Valkompasser, Europaparlamentsval (32.51) @sv
alternative label: Äänestäminen, europarlamenttivaalit (32.51)
broader: Kansainvälinen politiikka
in scheme: YKL - Yleisten kirjastojen luokitusjärjestelmä
notation: 32.51
preferred label: European Union @en
preferred label: Europeiska unionen @sv
scope note: Allmänna verk om Europeiska unionen Europeiska unionens utrikes- och säkerhetspolitik Europeiska unionens organisation, förvaltning och organ Ministerrådet. Kommissionen. Parlamentet Europarlamentsval Verk om Europeiska unionen och dess verksamhet inom olika områden klassificeras efter område @sv
scope note: Euroopan unionia koskevat yleisteokset Euroopan unionin ulko- ja turvallisuuspolitiikka Euroopan unionin organisaatio, hallinto ja toimielimet Ministerineuvosto. Komissio. Parlamentti Europarlamenttivaalit Euroopan unionia ja sen toimintaa eri aloilla koskevat teokset luokitetaan alan mukaan

Suomen ulkopolitiikka
type: Concept
References: URN:NBN:fi:au:ykl:32.5065
References: Kansainvälinen yhteistyö
References: Rauhankysymys. Rauhantutkimus
References: MAANPUOLUSTUS
References: SUOMEN HISTORIA
type: YKL-luokka
alternative label: Ambassader, Finland (32.52) @sv
alternative label: Ambassader, Finlands (32.52) @sv
alternative label: Beskickningar utomlands, Finlands (32.52) @sv
alternative label: Konsulaatit, Suomen (32.52)
alternative label: Konsulat, Finlands (32.52) @sv
alternative label: Lähetystöt, Suomen (32.52)
alternative label: Puolueettomuus, Suomi (32.52)
alternative label: Självständighet, Finland (32.52) @sv
alternative label: Suurlähetystöt, Suomi (32.52)
alternative label: Säkerhetspolitik, Finland (32.52) @sv
alternative label: Turvallisuuspolitiikka, Suomi (32.52)
alternative label: Ulkomaanedustustot, Suomen (32.52)
alternative label: Ulkopolitiikka, Suomi (32.52)
alternative label: Utrikespolitik, Finland (32.52) @sv
broader: Kansainvälinen politiikka
in scheme: YKL - Yleisten kirjastojen luokitusjärjestelmä
notation: 32.52
preferred label: Finland's foreign policy @en
preferred label: Finlands utrikespolitik @sv
scope note: Hit också Finlands säkerhetspolitik Finlands neutralitetspolitik Finlands förhållande till militärallianser och statsförbund Finlands ambassaden och konsulat Hit också verk som behandlar både utrikes- och säkerhetspolitik i Finland och det internationella samarbete som Finland bedriver @sv
scope note: Tähän myös Suomen turvallisuuspolitiikka Suomen puolueettomuuspolitiikka Suomen suhteet sotilas- ja valtioliittoihin Suomen suurlähetystöt ja konsulaatit Tähän myös teokset, jotka koskevat sekä Suomen ulko- tai turvallisuuspolitiikkaa että Suomen harjoittamaa kansainvälistä yhteistyötä

Kansainvälinen yhteistyö
type: Concept
References: Kansainvälinen politiikka
References: Rauhankysymys. Rauhantutkimus
References: Kansainvälinen talous. Maailmankauppa
References: Kehitysmaiden taloudelliset olot
type: YKL-luokka
alternative label: EU, kulttuuri- ja tiet.-tekn. yhteistyö (32.6)
alternative label: EU, kultur- och tekniskt-vetenskapligt samarbete (32.6) @sv
alternative label: Euroopan unioni, kulttuuri- ja tiet.-tekn. yhteistyö (32.6)
alternative label: Europeiska unionen, kultur- och tekniskt-vetenskapligt samarbete (32.6) @sv
alternative label: Fadderortsverksamhet (32.6) @sv
alternative label: Fostran till internationalism (32.6) @sv
alternative label: Internationella överenskommelser, internationellt samarbete (32.6+) @sv
alternative label: Internationellt kultursamarbete (32.6+) @sv
alternative label: Internationellt samarbete (32.6+) @sv
alternative label: Internationellt tekniskt-vetenskapligt samarbete (32.6+) @sv
alternative label: Kansainvälinen kulttuuriyhteistyö (32.6+)
alternative label: Kansainvälinen tieteellistekninen yhteistyö (32.6+)
alternative label: Kansainvälinen yhteistyö (32.6+)
alternative label: Kansainväliset sopimukset, kansainvälinen yhteistyö (32.6+)
alternative label: Kansainvälisyyskasvatus (32.6)
alternative label: Katastrofhjälp, internationellt samarbete (32.6+) @sv
alternative label: Katastrofiapu, kansainvälinen yhteistyö (32.6+)
alternative label: Kommuner, internationellt samarbete (32.6) @sv
alternative label: Kulttuuriyhteistyö, kansainvälinen (32.6+)
alternative label: Kultursamarbete, internationell (32.6+) @sv
alternative label: Kummikuntatoiminta (32.6)
alternative label: Kunnat, kansainvälinen yhteistyö (32.6)
alternative label: Lähialueyhteistyö (32.6+)
alternative label: Monikulttuurisuus, kansainvälisyyskasvatus (32.6)
alternative label: Mångkulturalism, fostran till internationalism (32.6) @sv
alternative label: Nordiskt samarbete (32.6+) @sv
alternative label: Närområdessamarbete (32.6+) @sv
alternative label: Pohjoismainen yhteistyö (32.6+)
alternative label: Samarbete, internationellt (32.6+) @sv
alternative label: Tekniskt-vetenskapligt samarbete, internationellt (32.6+) @sv
alternative label: Tieteellis-tekninen yhteistyö, kansainvälinen (32.6+)
alternative label: Vänorter (32.6) @sv
alternative label: Yhteistyö, kansainvälinen (32.6+)
alternative label: Ystävyyskaupunkitoiminta (32.6)
broader: VALTIO-OPPI. POLITIIKKA
in scheme: YKL - Yleisten kirjastojen luokitusjärjestelmä
narrower: Kansainväliset järjestöt
notation: 32.6
preferred label: International cooperation @en
preferred label: Internationellt samarbete @sv
scope note: Hit allmänna verk om samarbete inom kultur, vetenskap och teknik Hit också internationellt samarbete ur ett enskilt lands, t.ex. Finlands, synvinkel Fostran till internationalism Vän- och fadderorter Om verket behandlar både internationellt samarbete och internationell politik, ges företräde åt klass 32.5+ Internationellt samarbete inom specialområden klassificeras enligt område Vänskapsföreningar 32.606 @sv
scope note: Tähän kansainvälisen kulttuuri- ja tieteellis- teknisen yhteistyön yleisteokset Tähän myös kansainvälinen yhteistyö tietyn maan, esim. Suomen, kannalta Kansainvälisyyskasvatus Ystävyyskaupunki- ja kummikuntatoiminta Jos teos koskee sekä kansainvälistä yhteistyötä että kansainvälistä politiikkaa, annetaan etusija luokalle 32.5+ Erikoisalojen kansainvälinen yhteistyö luokitetaan alan mukaan Ystävyysseurat 32.606

Kansainväliset järjestöt
type: Concept
References: URN:NBN:fi:au:ykl:32.206
References: Kansainvälinen politiikka
References: Kansainväliset talousjärjestöt
References: URN:NBN:fi:au:ykl:37.706
type: YKL-luokka
alternative label: Euroopan neuvosto (32.68)
alternative label: Europarådet (32.68) @sv
alternative label: FN (32.68) @sv
alternative label: FN, generalförsamlingen (32.68) @sv
alternative label: Förenta Nationerna (32.68) @sv
alternative label: Internationella organisationer (32.68) @sv
alternative label: Kansainväliset järjestöt (32.68)
alternative label: Katastrofhjälp, internationella organisationer (32.68) @sv
alternative label: Katastrofiapu, kansainväliset järjestöt (32.68)
alternative label: Nordiska rådet (32.68) @sv
alternative label: OAU (32.68)
alternative label: Pohjoismaiden neuvosto (32.68)
alternative label: UNESCO (32.68)
alternative label: YK (32.68)
alternative label: YK, yleiskokous (32.68)
alternative label: Yhdistyneet Kansakunnat (32.68)
broader: Kansainvälinen yhteistyö
in scheme: YKL - Yleisten kirjastojen luokitusjärjestelmä
notation: 32.68
preferred label: International organisations @en
preferred label: Internationella organisationer @sv
scope note: Hit allmänna verk om internationella organisationer Hit också sådana internationella organisationer som inte kanklassificeras enligt område Europarådet. Nordiska rådet. Europeiska unionen samt EG ur politisk synvinkel Nationernas förbund. Förenta nationerna i allmänhet Hit också sådana underorganisationer och organ till FN som inte klassificeras enligt område (t.ex. generalförsamlingen och Unesco) Internationella organisationer inom specialområden och FN:s underorganisationer klassificeras enligt område @sv
scope note: Tähän kansainvälisiä järjestöjä koskevat yleisteokset Tähän myös sellaiset kansainväliset järjestöt, joita ei voi luokittaa alan mukaan Euroopan neuvosto. Pohjoismaiden neuvosto Kansainliitto. Yhdistyneet kansakunnat yleensä Tähän myös sellaiset YK:n alajärjestöt ja elimet, joita ei voi luokittaa alan mukaan, esim. Yleiskokous ja Unesco Erikoisalojen kansainväliset järjestöt ja YK:n alajärjestöt luokitetaan alan mukaan

Rauhankysymys. Rauhantutkimus
type: Concept
References: Kansainvälinen politiikka
References: Kansainvälinen yhteistyö
References: Palo- ja pelastustoimi
References: MAANPUOLUSTUS
References: Aseistus. Asevarustelu. Asekauppa
type: YKL-luokka
alternative label: Antimilitarism (32.7) @sv
alternative label: Antimilitarismi (32.7)
alternative label: Aseeton vastarinta (32.7)
alternative label: Aseidenriisunta (32.7)
alternative label: Aseistakieltäytyminen (32.7)
alternative label: Aseistariisuminen (32.7)
alternative label: Aseistariisunta (32.7)
alternative label: Asekauppa, rauhankysymys (32.7)
alternative label: Aserajoitukset, rauhankysymys (32.7)
alternative label: Aseriisunta (32.7)
alternative label: Asevarustelu, rauhankysymys (32.7)
alternative label: Atomiaseet, aseistariisunta (32.7)
alternative label: Atomvapen, nedrustning (32.7) @sv
alternative label: Avrustning (32.7) @sv
alternative label: Avväpning (32.7) @sv
alternative label: Civilmotstånd (32.7) @sv
alternative label: Civiltjänst (32.7) @sv
alternative label: Eirenologi (32.7) @sv
alternative label: Eirenologia (32.7)
alternative label: Fredsforskning (32.7) @sv
alternative label: Fredsfostran (32.7) @sv
alternative label: Fredsfrågan (32.7) @sv
alternative label: Fredsrörelsen (32.7) @sv
alternative label: Konfliktforskning (32.7) @sv
alternative label: Konfliktintutkimus (32.7)
alternative label: Kärnvapen, övervakning och begränsning (32.7) @sv
alternative label: Kärnvapenfria zoner (32.7) @sv
alternative label: Kärnvapenfritt Norden (32.7) @sv
alternative label: Nedrustning (32.7) @sv
alternative label: Obeväpnat motstånd (32.7) @sv
alternative label: Pacifism (32.7) @sv
alternative label: Pasifismi (32.7)
alternative label: Passiivinen vastarinta (32.7)
alternative label: Passivt motstånd (32.7) @sv
alternative label: Rauhankasvatus (32.7)
alternative label: Rauhankysymys (32.7)
alternative label: Rauhanliike (32.7)
alternative label: Rauhantutkimus (32.7)
alternative label: Siviilipalvelu (32.7)
alternative label: Siviilivastarinta (32.7)
alternative label: Totaalikieltäytyminen (32.7)
alternative label: Totalvägran (32.7) @sv
alternative label: Upprustning, fredsfrågan (32.7) @sv
alternative label: Vapenbegränsningar, fredsfrågan (32.7) @sv
alternative label: Vapenhandel, fredsfrågan (32.7) @sv
alternative label: Vapennedrustning (32.7) @sv
alternative label: Vapenvägran (32.7) @sv
alternative label: Ydinaseet, valvonta ja rajoitus (32.7)
alternative label: Ydinaseeton Pohjola (32.7)
alternative label: Ydinaseettomat alueet (32.7)
broader: VALTIO-OPPI. POLITIIKKA
in scheme: YKL - Yleisten kirjastojen luokitusjärjestelmä
notation: 32.7
preferred label: Fredsfrågan. Fredsforskning @sv
preferred label: The peace issue. Peace research @en
scope note: Pacifism. Fredsfostran. Fredsrörelsen Vapenvägran. Civiltjänst. Totalvägran Vapenlöst motstånd. Civilt motstånd Fredsforskning. Konfliktforskning Nedrustning Vapenbegränsning, upprustning och vapenhandel sedda ur fredsfrågans och den internationella politikens synvinkel Fredsfilosofi 32.701 Fredsorganisationer 32.706 @sv
scope note: Pasifismi. Rauhankasvatus. Rauhanliike Aseistakieltäytyminen. Siviilipalvelu. Totaalikieltäytyminen Aseeton vastarinta. Siviilivastarinta Rauhantutkimus. Konfliktintutkimus Aseistariisunta Aserajoitukset, asevarustelu ja asekauppa rauhankysymyksen ja kansainvälisen politiikan kannalta Rauhanfilosofia 32.701 Rauhanjärjestöt 32.706

OIKEUSTIEDE
type: Concept
type: YKL-luokka
alternative label: Direktiivit (33+)
alternative label: Direktiv (33+) @sv
alternative label: EU, direktiivit (33+)
alternative label: EU, direktiv (33+) @sv
alternative label: EU-oikeus (33+)
alternative label: EU-rätt (33+) @sv
alternative label: Esteellisyys, lainsäädäntö (33+)
alternative label: Esteettömyys, lainsäädäntö (33+)
alternative label: Euroopan unioni, direktiivit (33+)
alternative label: Eurooppaoikeus (33+)
alternative label: Europarätt (33+) @sv
alternative label: Europeiska unionen, direktiv (33+) @sv
alternative label: Företagsrätt (33+) @sv
alternative label: Generationsskifte, lagstiftning (33+) @sv
alternative label: Idrottsjuridik (33+) @sv
alternative label: Juridiikka (33+)
alternative label: Juridik (33+) @sv
alternative label: Jämförande rättsvetenskap, allm. (33) @sv
alternative label: Jäv, lagstiftning (33+) @sv
alternative label: Jääviys, lainsäädäntö (33+)
alternative label: Lagberedning (33+) @sv
alternative label: Laglighetsfostran (33+) @sv
alternative label: Lagpropositioner (33+) @sv
alternative label: Lagstiftning (33+) @sv
alternative label: Laillisuuskasvatus (33+)
alternative label: Lainsäädäntö (33+)
alternative label: Lainvalmistelu (33+)
alternative label: Lakiesitykset (33+)
alternative label: Lakitiede (33+)
alternative label: Luonnonoikeus, oikeusfilosofia (33+)
alternative label: Naturrätt, rättsfilosofi (33+) @sv
alternative label: Oikeusjärjestelmät, yl. (33)
alternative label: Oikeuslaitokset, yl. (33)
alternative label: Oikeuspolitiikka, yl. (33)
alternative label: Oikeuspsykologia, yl. (33)
alternative label: Oikeussosiologia, yl. (33)
alternative label: Oikeustaloustiede (33+)
alternative label: Oikeusteoriat, oikeustiede (33+) @sv
alternative label: Oikeustiede (33+)
alternative label: Ojävlighet, lagstiftning (33+) @sv
alternative label: Romersk rätt (33+) @sv
alternative label: Roomalainen oikeus (33+)
alternative label: Rättsekonomi (33+) @sv
alternative label: Rättspolitik, allm. (33) @sv
alternative label: Rättspsykologi, allm. (33) @sv
alternative label: Rättssociologi (33) @sv
alternative label: Rättssystem, allm. (33) @sv
alternative label: Rättsteorier, juridik (33+) @sv
alternative label: Rättsvetenskap (33+) @sv
alternative label: Rättsväsen, allm. (33) @sv
alternative label: Sukupolvenvaihdos, lainsäädäntö (33+)
alternative label: Säädösvalmistelu (33+)
alternative label: Urheiluoikeus (33+)
alternative label: Vertaileva oikeustiede, yl. (33)
alternative label: Viktimologi, allm. (33) @sv
alternative label: Viktimologia, yl. (33)
alternative label: Yritysoikeus (33+)
broader: YHTEISKUNTA
in scheme: YKL - Yleisten kirjastojen luokitusjärjestelmä
narrower: Oikeusoppaat
narrower: Laki- ja säädöskokoelmat. Oikeustapauskokoelmat
narrower: Kansainvälinen oikeus
narrower: Julkis- ja hallinto-oikeus
narrower: Siviili- ja kauppaoikeus
narrower: Talousoikeus
narrower: Rikosoikeus
narrower: Prosessioikeus. Oikeushallinto
notation: 33
preferred label: JURISPRUDENCE @en
preferred label: RÄTTSVETENSKAP @sv
scope note: Hit allmänna verk om rättsvetenskap och jämförande rättsvetenskap. Rättspolitik, rättssociologi och rättspsykologi i allmänhet. Hit också Finlands och övriga länders rättssystem, rättssociologi, rättspolitik och lagberedning. Hit och till underklasserna också Finlands och övriga länders lagstiftning. Hit och till underklasserna också laglighetsfostran. Rättsfilosofi 33.01. Romersk rätt 33.09 @sv
scope note: Tähän oikeustieteen ja vertailevan oikeustieteen yleisteokset. Oikeuspolitiikka, oikeussosiologia ja oikeuspsykologia yleensä. Tähän myös Suomen, Euroopan unionin ja muiden maiden oikeusjärjestelmiä, oikeussosiologiaa, oikeuspolitiikkaa ja lainvalmistelua koskevat yleisteokset. Tähän ja alaluokkiin myös Suomen, Euroopan unionin ja muiden maiden lainsäädäntö Tähän ja alaluokkiin myös laillisuuskasvatus. Oikeusfilosofia 33.01. Roomalainen oikeus 33.09{ @fi}

Oikeusoppaat
type: Concept
References: Laki- ja säädöskokoelmat. Oikeustapauskokoelmat
type: YKL-luokka
alternative label: Asiakirjakaavat (33.03)
alternative label: Asiakirjaoppaat (33.03)
alternative label: Blanketter, formulärhandböcker (33.03) @sv
alternative label: Dokumentformulär (33.03) @sv
alternative label: Elektroniska blanketter, rättshandböcker (33.03) @sv
alternative label: Formulär, formulärhandböcker (33.03) @sv
alternative label: Formulärhandböcker (33.03) @sv
alternative label: Kaavakkeet, asiakirjaoppaat (33.03)
alternative label: Kommenterade lagsamlingar (33.03) @sv
alternative label: Lagsamlingar, kommenterade (33.03) @sv
alternative label: Lakikokoelmat, selitetyt (33.03)
alternative label: Lomakkeet, asiakirjaoppaat (33.03)
alternative label: Oikeusoppaat (33.03)
alternative label: Rättshandböcker (33.03) @sv
alternative label: Rättshandböcker med förklaringar (33.03) @sv
alternative label: Selitetyt lakikokoelmat (33.03)
alternative label: Selitetyt oikeusoppaat (33.03)
alternative label: Sähköiset lomakkeet, oikeusoppaat (33.03)
broader: OIKEUSTIEDE
in scheme: YKL - Yleisten kirjastojen luokitusjärjestelmä
notation: 33.03
preferred label: Legal handbooks @en
preferred label: Rättshandböcker @sv
scope note: Hit allmänna lagsamlingar med förklaringar och juridiska handböcker Hit också allmänna samlingar med dokumentformulär och formulärhandböcker Juridiska handböcker och dokumentformulär inom specialområden klassificeras enligt område i klasserna 33.1-33.6+ @sv
scope note: Tähän yleiset selitetyt lakiteokset ja oikeusoppaat Tähän myös yleiset asiakirjakaavakokoelmat ja -oppaat Erikoisalojen oikeusoppaat ja asiakirjakaavat luokitetaan alan mukaan luokkiin 33.1-33.6+

Laki- ja säädöskokoelmat. Oikeustapauskokoelmat
type: Concept
References: Oikeusoppaat
References: Julkis- ja hallinto-oikeus
References: Prosessioikeus. Oikeushallinto
type: YKL-luokka
alternative label: Asetuskokoelmat (33.04)
alternative label: Finlands författningssamling (33.04) @sv
alternative label: Finlands lag (33.04) @sv
alternative label: Författningssamlingar (33.04) @sv
alternative label: Högsta domstolen, årsböcker (33.04) @sv
alternative label: Högsta förvaltningsdomstolen, årsböcker (33.04) @sv
alternative label: Korkein hallinto-oikeus, vuosikirjat (33.04)
alternative label: Korkein oikeus, vuosikirjat (33.04)
alternative label: Lagsamlingar (33.04) @sv
alternative label: Lakikokoelmat (33.04)
alternative label: Oikeustapauskokoelmat (33.04)
alternative label: Rättsfallssamlingar (33.04) @sv
alternative label: Suomen asetuskokoelma (33.04)
alternative label: Suomen laki (33.04)
alternative label: Suomen säädöskokoelma (33.04)
alternative label: Säädöskokoelmat (33.04)
broader: OIKEUSTIEDE
in scheme: YKL - Yleisten kirjastojen luokitusjärjestelmä
narrower: Komiteanmietinnöt
notation: 33.04
preferred label: Bodies of laws and directives. Compilations of judicial cases @en
preferred label: Lag- och författningssamlingar. Rättsfallssamlingar @sv
scope note: Hit allmänna lag- och författningssamlingar samt allmänna rättsfallssamlingar såsom HD:s och HFD:s årsböcker Lag-, författnings- och rättsfallssamlingar inom specialområden klassificeras enligt område i klasserna 33.1-33.6+ @sv
scope note: Tähän yleiset laki- ja säädöskokoelmat sekä yleiset oikeustapauskokoelmat, kuten KO:n ja KHO:n vuosikirjat Erikoisalojen laki-, säädös- ja oikeustapauskokoelmat luokitetaan alan mukaan luokkiin 33.1-33.6+

Komiteanmietinnöt
type: Concept
type: YKL-luokka
alternative label: Komiteanmietinnöt, yhtenäisenä sarjana (33.041)
alternative label: Kommittébetänkanden, som enhetliga serier (33.041) @sv
broader: Laki- ja säädöskokoelmat. Oikeustapauskokoelmat
in scheme: YKL - Yleisten kirjastojen luokitusjärjestelmä
notation: 33.041
preferred label: Committee reports @en
preferred label: Kommittébetänkanden @sv
scope note: Hit kommittébetänkanden om man vill klassificera dem som en enhetlig serie. Annars klassificeras kommittébetänkanden enligt område @sv
scope note: Tähän komiteanmietinnöt, jos ne halutaan luokittaa yhtenäisenä sarjana. Muuten komiteanmietinnöt luokitetaan alan mukaan

Kansainvälinen oikeus
type: Concept
References: Ihmisoikeudet. Kansalaisen asema yhteiskunnassa
References: Kansainväliset järjestöt
References: OIKEUSTIEDE
References: Valtiosääntöoikeus
type: YKL-luokka
alternative label: Ahvenanmaa, kansainvälisoikeudellinen asema (33.1)
alternative label: Diplomatiaoikeus (33.1)
alternative label: Diplomatirätt (33.1) @sv
alternative label: Domstolar, internationella (33.1) @sv
alternative label: Haagdomstolen (33.1) @sv
alternative label: Haagin tuomioistuin (33.1)
alternative label: Ihmisoikeudet, kansainvälinen lainsäädäntö (33.1)
alternative label: Ilmatila, kansainvälinen oikeus (33.1)
alternative label: Internationell privaträtt (33.1) @sv
alternative label: Internationell rätt (33.1) @sv
alternative label: Internationella domstolar (33.1) @sv
alternative label: Internationella organisationer, lagstiftning (33.1) @sv
alternative label: Kansainvälinen oikeus (33.1)
alternative label: Kansainvälinen yksityisoikeus (33.1)
alternative label: Kansainväliset järjestöt, lainsäädäntö (33.1)
alternative label: Kansainväliset tuomioistuimet (33.1)
alternative label: Kansalaisoikeudet, kansainvälinen lainsäädäntö (33.1)
alternative label: Konsulioikeus (33.1)
alternative label: Konsulärrätt (33.1) @sv
alternative label: Krigsförbrytelser, internationell rätt (33.1) @sv
alternative label: Krigslagar (33.1) @sv
alternative label: Luftrum, internationell rätt (33.1) @sv
alternative label: Medborgerliga rättigheter, internationell lagstiftning (33.1) @sv
alternative label: Mänskliga rättigheter, internationell lagstiftning (33.1) @sv
alternative label: Privaträtt, internationell (33.1) @sv
alternative label: Sotalait (33.1)
alternative label: Sotarikokset, kansainvälinen oikeus (33.1)
alternative label: Tuomioistuimet, kansainväliset (33.1)
alternative label: Yksityisoikeus, kansainvälinen (33.1)
alternative label: Åland, internationellrättslig ställning (33.1) @sv
broader: OIKEUSTIEDE
in scheme: YKL - Yleisten kirjastojen luokitusjärjestelmä
notation: 33.1
preferred label: International law @en
preferred label: Internationell rätt @sv
scope note: Internationella domstolar Diplomat- och konsulärrätt. Krigslagar Lagstiftning om internationella organisationer Internationell lagstiftning om mänskliga rättigheter Hit också Ålands rättsliga ställning Hit också allmänna verk om internationell privaträtt Frågor om internationell rätt och internationell privaträtt inom specialområden klassificeras enligt område i klasserna 33.2-33.6+ @sv
scope note: Kansainväliset tuomioistuimet Diplomatia- ja konsulioikeus. Sotalait Kansainvälisiä järjestöjä koskeva lainsäädäntö Ihmisoikeuksia koskeva kansainvälinen lainsäädäntö Tähän myös Ahvenanmaan oikeudellinen asema Tähän myös kansainvälisen yksityisoikeuden yleisteokset Kansainvälisen oikeuden ja kansainvälisen yksityisoikeuden erikoisaloja koskevat kysymykset sijoitetaan alan mukaan luokkiin 33.2-33.6+

Julkis- ja hallinto-oikeus
type: Concept
References: Siviili- ja kauppaoikeus
References: Talousoikeus
References: Elinkeino-oikeus
References: Liikennelainsäädäntö
alternative label: Aluelainsäädäntö (33.2)
alternative label: Aluepoliittinen lainsäädäntö (33.2)
alternative label: Arkistot, lainsäädäntö (33.2)
alternative label: Aseet, lainsäädäntö (33.2)
alternative label: Asevelvollisuuslainsäädäntö (33.2)
alternative label: Asiakirjain julkisuus (33.2)
alternative label: Avoin lähdekoodi, julkis- ja hallinto-oikeus (33.2)
alternative label: Avoin verkkojulkaiseminen, julkis- ja hallinto-oikeus (33.2)
alternative label: Finanssioikeus (33.2)
alternative label: Hallinto-oikeudellinen lainkäyttö (33.2+)
alternative label: Hallinto-oikeus (33.2+)
alternative label: Hallintomenettelylaki (33.2)
alternative label: Henkilörekisterilaki (33.2)
alternative label: Ikärajat, lainsäädäntö (33.2)
alternative label: Informaatio-oikeus (33.2)
alternative label: Intimiteettisuojalainsäädäntö (33.2)
alternative label: Joukkoviestintä, lainsäädäntö (33.2)
alternative label: Julkiset hankinnat, hallinto-oikeus (33.2)
alternative label: Julkisoikeus (33.2+)
alternative label: Kameravalvonta, lainsäädäntö (33.2)
alternative label: Kielilainsäädäntö (33.2)
alternative label: Kilpailuttaminen, hallinto-oikeus (33.2)
alternative label: Korkein hallinto-oikeus (33.2+)
alternative label: Kotipaikka, lainsäädäntö (33.2)
alternative label: Kotirauha, lainsäädäntö (33.2)
alternative label: Kutsunnat, lainsäädäntö (33.2)
alternative label: Lainkäyttö, hallinto-oikeudellinen (33.2+)
alternative label: Lupalainsäädäntö (33.2)
alternative label: Maastakarkotus, hallinto-oikeus (33.2)
alternative label: OA, julkis- ja hallinto-oikeus (33.2)
alternative label: Open Access, julkis- ja hallinto-oikeus (33.2)
alternative label: Open source, julkis- ja hallinto-oikeus (33.2)
alternative label: Painovapaus, lainsäädäntö (33.2)
alternative label: Pakolaisoikeus (33.2)
alternative label: Palolainsäädäntö (33.2)
alternative label: Pandemiat, lainsäädäntö (33.2+)
alternative label: Pelastuslainsäädäntö (33.2)
alternative label: Perinnönjako, julkis- ja hallinto-oikeus (33.2)
alternative label: Perinnöt, julkis- ja hallinto-oikeus (33.2)
alternative label: Poikkeusajan lait (33.2)
alternative label: Poliisi, lainsäädäntö (33.2)
alternative label: Postilainsäädäntö (33.2)
alternative label: Potilaan asema, hallinto-oikeus (33.2+)
alternative label: Puhelinsalaisuus, julkis- ja hallinto-oikeus (33.2)
alternative label: Puolustusvoimat, lainsäädäntö (33.2)
alternative label: Salassapitovelvollisuus, hallinto-oikeus (33.2)
alternative label: Salassapitovelvollisuus, intimiteettisuojalainsäädäntö (33.2)
alternative label: Sähköinen allekirjoitus, julkis- ja hallinto-oikeus (33.2)
alternative label: Sähköinen asiointi, julkis- ja hallinto-oikeus (33.2)
alternative label: Sähköinen tunnistaminen, julkis- ja hallinto-oikeus (33.2)
alternative label: Tasa-arvolaki (33.2)
alternative label: Tekninen tarkkailu, lainsäädäntö (33.2)
alternative label: Televalvonta, lainsäädäntö (33.2)
alternative label: Tietoliikennelainsäädäntö (33.2)
alternative label: Tietosuoja, julkis- ja hallinto-oikeus (33.2)
alternative label: Tietotekniikkaoikeus (33.2)
alternative label: Tietoturva, julkis- ja hallinto-oikeus (33.2)
alternative label: Turvallisuuslainsäädäntö (33.2)
alternative label: Turvapaikkaoikeus (33.2)
alternative label: Ulkomaalaisoikeus (33.2)
alternative label: Vaitiolovelvollisuus, hallinto-oikeus (33.2)
alternative label: Vaitiolovelvollisuus, intimiteettisuojalainsäädäntö (33.2)
alternative label: Vapaa koodi, julkis- ja hallinto-oikeus (33.2)
broader: OIKEUSTIEDE
in scheme: YKL - Yleisten kirjastojen luokitusjärjestelmä
narrower: Valtiosääntöoikeus
narrower: Virkamiesoikeus
narrower: Asemakaava- ja rakentamislainsäädäntö
narrower: Sosiaalioikeus
narrower: Vero-oikeus
narrower: Kunnallisoikeus
narrower: Kirkko-oikeus
notation: 33.2
scope note: Hallintomenettelylaki. Korkein hallinto-oikeus Finanssioikeus Lupalainsäädäntö yleensä Yhdistymisvapautta koskeva lainsäädäntö Asiakirjain julkisuus. Henkilörekisterilaki Intimiteetti- ja tietosuojaa koskeva lainsäädäntö Informaatio-oikeus. Viestintäoikeus Tietoliikennelainsäädäntö yleensä Joukkotiedotusta koskeva lainsäädäntö Kielilainsäädäntö. Tasa-arvolaki Yleiseen järjestykseen ja turvallisuuteen liittyvä lainsäädäntö. Poikkeusajan lait Puolustuslaitosta koskeva lainsäädäntö Ulkomaalaisoikeus. Pakolaisoikeus Palo- ja pelastuslainsäädäntö Aluelainsäädäntö. Aluepoliittinen lainsäädäntö Tähän ja alaluokkiin myös hallinto-oikeudellinen lainkäyttö
scope note: Lagen om förvaltningsförfarande. Högsta förvaltningsdomstolen Finansrätt Tillståndslagstiftning i allmänhet Lagstiftning om föreningsfrihet Handlingars offentlighet. Personregisterlagen Lagstiftning om integritetsskydd och datasekretess Informationsrätt. Kommunikationsrätt Lagstiftning om telekommunikation i allmänhet Lagstiftning om masskommunikation i allmänhet Språklagstiftning. Jämställdhetslagen Lagstiftning om allmän ordning och säkerhet. Lagar för undantagstider Lagstiftning om försvarsmakten Lagstiftning om utlänningar och flyktingar Brand- och räddningslagstiftning Regionallagstiftning. Regionalpolitisk lagstiftning Hit och till underklasserna också förvaltningsrättslig rättstillämpning @sv

Valtiosääntöoikeus
type: Concept
References: Valtiofilosofia. Poliittiset ideologiat
References: Poliittiset järjestelmät
References: Ihmisoikeudet. Kansalaisen asema yhteiskunnassa
References: Kansainvälinen oikeus
type: YKL-luokka
alternative label: Demonstrationer, lagstiftning om medborgerliga rättigheter (33.21) @sv
alternative label: Författningsrätt (33.21) @sv
alternative label: Församlingsfrihet, lagstiftning (33.21) @sv
alternative label: Grundlagar, författningsrätt (33.21) @sv
alternative label: Grundrättigheter, lagstiftning (33.21) @sv
alternative label: Identiteettisuojalainsäädäntö (33.21)
alternative label: Ihmisoikeudet, lainsäädäntö (33.21)
alternative label: Integritetsskyddslagstiftning (33.21) @sv
alternative label: Kansalaisoikeudet, valtiosääntöoikeus (33.21)
alternative label: Kansalaisuus, valtiosääntöoikeus (33.21)
alternative label: Kansalaisvelvollisuudet, valtiosääntöoikeus (33.21)
alternative label: Kokoontumisvapaus, lainsäädäntö (33.21)
alternative label: Medborgarskap, författningsrätt (33.21) @sv
alternative label: Medborgerliga rättigheter, författningsrätt (33.21) @sv
alternative label: Medborgerliga skyldigheter, författningsrätt (33.21) @sv
alternative label: Mielenosoitukset, kansalaisoikeuslainsäädäntö (33.21)
alternative label: Mänskliga rättigheter, lagstiftning (33.21) @sv
alternative label: Perusoikeudet, lainsäädäntö (33.21)
alternative label: Perustuslait, valtiosääntöoikeus (33.21)
alternative label: Rösträtt, vallagstiftning (33.21) @sv
alternative label: Sananvapaus, valtiosääntöoikeus (33.21)
alternative label: Statsförfattningstexter (33.21) @sv
alternative label: Statsrätt (33.21) @sv
alternative label: Vaalilainsäädäntö (33.21)
alternative label: Vallagstiftning (33.21) @sv
alternative label: Valtio-oikeus (33.21)
alternative label: Valtiosääntöoikeus (33.21)
alternative label: Valtiosääntötekstit (33.21)
alternative label: Yttrandefrihet, författningsrätt (33.21) @sv
alternative label: Äänioikeus, vaalilainsäädäntö (33.21)
broader: Julkis- ja hallinto-oikeus
in scheme: YKL - Yleisten kirjastojen luokitusjärjestelmä
notation: 33.21
preferred label: Constitutional law @en
preferred label: Statsförfattningsrätt @sv
scope note: Statsförfattningstexter. Grundlagar Medborgerliga rättigheter. Medborgerliga plikter Vallagstiftning @sv
scope note: Valtiosääntötekstit. Perustuslait Kansalaisoikeudet. Kansalaisvelvollisuudet Vaalilainsäädäntö

Virkamiesoikeus
type: Concept
References: Työoikeus
References: Rikosoikeus
References: Palkkapolitiikka. Tulopolitiikka
References: Henkilöstöpolitiikka
type: YKL-luokka
alternative label: Tjänsteansvar, lagstiftning (33.22) @sv
alternative label: Tjänstemannarätt (33.22) @sv
alternative label: Virkamiesoikeus (33.22)
alternative label: Virkavastuu, lainsäädäntö (33.22)
broader: Julkis- ja hallinto-oikeus
in scheme: YKL - Yleisten kirjastojen luokitusjärjestelmä
notation: 33.22
preferred label: Legislation on civil servants @en
preferred label: Tjänstemannarätt @sv
scope note: Hit lagstiftning om statliga och kommunala tjänstemän i allmänhet @sv
scope note: Tähän valtioiden ja kuntien virkamiehiä yleensä koskeva lainsäädäntö

Asemakaava- ja rakentamislainsäädäntö
type: Concept
References: Esine- ja velvoiteoikeus
References: Maa- ja vesioikeus
References: ALUESUUNNITTELU. ALUEPOLITIIKKA
References: Asuntopolitiikka
type: YKL-luokka
alternative label: Aravalagar (33.23) @sv
alternative label: Aravalait (33.23)
alternative label: Asemakaavalainsäädäntö (33.23)
alternative label: Asuntotuotanto, lainsäädäntö (33.23)
alternative label: Bostadsproduktion, lagstiftning (33.23) @sv
alternative label: Byggnadslagstiftning (33.23) @sv
alternative label: Byggnadsordning (33.23) @sv
alternative label: Byggnadstillstånd, lagstiftning (33.23) @sv
alternative label: Kaavoitus, lainsäädäntö (33.23)
alternative label: Planläggning, lagstiftning (33.23) @sv
alternative label: Rakennusjärjestys (33.23)
alternative label: Rakennuslainsäädäntö (33.23)
alternative label: Rakennusluvat, lainsäädäntö (33.23)
alternative label: Rakentamislainsäädäntö (33.23)
alternative label: Stadsplanelagstiftning (33.23) @sv
broader: Julkis- ja hallinto-oikeus
in scheme: YKL - Yleisten kirjastojen luokitusjärjestelmä
notation: 33.23
preferred label: City planning and building legislation @en
preferred label: Plan- och bygglagstiftning @sv
scope note: Hit lagstiftning om fysisk planering och dess rättsliga inverkan samt om byggnadslov och bostadsproduktion Hit också aravalagarna @sv
scope note: Tähän kaavoitusta ja sen oikeudellisia vaikutuksia, rakennuslupia sekä asuntotuotantoa koskeva lainsäädäntö Tähän myös aravalait

Sosiaalioikeus
type: Concept
References: Työoikeus
References: SOSIAALIPOLITIIKKA
type: YKL-luokka
alternative label: Abortlagstiftning (33.24) @sv
alternative label: Aborttilainsäädäntö (33.24)
alternative label: Barnskydd, lagstiftning (33.24) @sv
alternative label: Bio-oikeus (33.24)
alternative label: Biorätt (33.24) @sv
alternative label: Eläketurvalainsäädäntö (33.24)
alternative label: Eläkkeet, lainsäädäntö (33.24)
alternative label: Familjepensioner, lagstiftning (33.24) @sv
alternative label: Folkhälsovetenskap, lagstiftning (33.24) @sv
alternative label: Folkpensionslagstiftning (33.24) @sv
alternative label: Fortsatt förvärvsarbete, pensionsskyddslagstiftning (33.24) @sv
alternative label: Geenitestit, lainsäädäntö (33.24)
alternative label: Gentest, lagstiftning (33.24) @sv
alternative label: Handikappade, lagstiftning (33.24) @sv
alternative label: Huoltolainsäädäntö (33.24)
alternative label: Hälso- och sjukvård, lagstiftning (33.24) @sv
alternative label: Hälsorätt (33.24) @sv
alternative label: Hälsovård, lagstiftning (33.24) @sv
alternative label: Kansaneläkelainsäädäntö (33.24)
alternative label: Kansanterveystyö, lainsäädäntö (33.24)
alternative label: Lastensuojelu, lainsäädäntö (33.24)
alternative label: Lääkintäoikeus (33.24)
alternative label: Medicinsk rätt (33.24) @sv
alternative label: Mielisairaanhoito, lainsäädäntö (33.24)
alternative label: Nuorten suojelu, lainsäädäntö (33.24)
alternative label: Pensioner, lagstiftning (33.24) @sv
alternative label: Pensionskyddslagstiftning (33.24) @sv
alternative label: Perhe-eläkkeet, lainsäädäntö (33.24)
alternative label: Psykiatrisk vård, lagstiftning (33.24) @sv
alternative label: Sairausvakuutus, lainsäädäntö (33.24)
alternative label: Sjukförsäkring, lagstiftning (33.24) @sv
alternative label: Sociallagstiftning (33.24) @sv
alternative label: Socialpolitiska bidrag, lagstiftning (33.24) @sv
alternative label: Socialrätt (33.24) @sv
alternative label: Socialskyddslagstiftning (33.24) @sv
alternative label: Sosiaalilainsäädäntö (33.24)
alternative label: Sosiaalioikeus (33.24)
alternative label: Sosiaalipoliittinen avustuslainsäädäntö (33.24)
alternative label: Sosiaaliturvalainsäädäntö (33.24)
alternative label: Terveydenhoito, lainsäädäntö (33.24)
alternative label: Terveydenhuolto, lainsäädäntö (33.24)
alternative label: Terveysoikeus (33.24)
alternative label: Työssä jatkaminen, eläketurvalainsäädäntö (33.24)
alternative label: Työssäjatkaminen, eläketurvalainsäädäntö (33.24)
alternative label: Unga, skydd av unga, lagstiftning (33.24) @sv
alternative label: Vammaiset, lainsäädäntö (33.24)
alternative label: Vårdlagstiftning (33.24) @sv
broader: Julkis- ja hallinto-oikeus
in scheme: YKL - Yleisten kirjastojen luokitusjärjestelmä
notation: 33.24
preferred label: Social law @en
preferred label: Sociallagstiftning @sv
scope note: Lagstiftning om socialpolitiskt understöd Hälsovårdslagstiftning och sjukförsäkringslagstiftning Lagstiftning om social omsorg Lagstiftning om skydd av barn och unga Abortlagstiftning Pensionslagstiftning i allmänhet Lagstiftning om folkpension och familjepensioner @sv
scope note: Sosiaalipoliittinen avustuslainsäädäntö Terveydenhuolto- ja sairausvakuutuslainsäädäntö Huoltolainsäädäntö Lasten ja nuorten suojelua koskeva lainsäädäntö Aborttilainsäädäntö Eläketurvalainsäädäntö yleensä Kansaneläke- ja perhe-eläkelainsäädäntö

Vero-oikeus
type: Concept
References: Kirkko-oikeus
References: Rikosoikeus
References: Poliisitoimi. Yleinen turvallisuus
References: Verotus. Veropolitiikka
References: Kansainvälinen talous. Maailmankauppa
type: YKL-luokka
alternative label: Arvsskatt, lagstiftning (33.25) @sv
alternative label: Beskattning av gårdsbruk, lagstiftning (33.25) @sv
alternative label: Beskattning, lagstiftning (33.25) @sv
alternative label: Elinkeinoverolaki (33.25)
alternative label: Ennakkoperintä, lainsäädäntö (33.25)
alternative label: Företagsbeskattning, lagstiftning (33.25) @sv
alternative label: Förmögenhetsskatt, lagstiftning (33.25) @sv
alternative label: Förskottsuppbörd, lagstiftning (33.25) @sv
alternative label: Gåvoskatt, lagstiftning (33.25) @sv
alternative label: Inkomst- och förmögenhetsskatt, lagstiftning (33.25) @sv
alternative label: Kommunalbeskattning, lagstiftning (33.25) @sv
alternative label: Kunnallisverotus, lainsäädäntö (33.25)
alternative label: Lahjavero, lainsäädäntö (33.25)
alternative label: Leimavero, lainsäädäntö (33.25)
alternative label: Liikevaihtovero, lainsäädäntö (33.25)
alternative label: Liikeverotus, lainsäädäntö (33.25)
alternative label: Maatalousverotus, lainsäädäntö (33.25)
alternative label: Näringsskattelagen (33.25) @sv
alternative label: Omaisuusvero, lainsäädäntö (33.25)
alternative label: Omsättningsskatt, lagstiftning (33.25) @sv
alternative label: Perintövero, lainsäädäntö (33.25)
alternative label: Skatterätt (33.25) @sv
alternative label: Statsbeskattning, lagstiftning (33.25) @sv
alternative label: Stämpelskatt, lagstiftning (33.25) @sv
alternative label: Tullioikeus (33.25)
alternative label: Tullrätt (33.25) @sv
alternative label: Tulo- ja omaisuusvero, lainsäädäntö (33.25)
alternative label: Valtionverotus, lainsäädäntö (33.25)
alternative label: Varallisuusveroa koskeva lainsäädäntö (33.25)
alternative label: Vero-oikeus (33.25)
alternative label: Verotus, lainsäädäntö (33.25)
broader: Julkis- ja hallinto-oikeus
in scheme: YKL - Yleisten kirjastojen luokitusjärjestelmä
notation: 33.25
preferred label: Skatterätt @sv
preferred label: Tax law @en
scope note: Hit lagstiftning om stats- och kommunalbeskattning Lagstiftning om inkomst- och förmögenhetsskatt, förskottsuppbörd, arvs- och gåvoskatt samt om omsättnings- och stämpelskatt Tullrätt @sv
scope note: Tähän valtion- ja kunnallisverotusta koskeva lainsäädäntö Tulo- ja varallisuusveroa, ennakkoperintää, perintö- ja lahjaveroa sekä liikevaihto- ja leimaveroa koskeva lainsäädäntö Tullioikeus

Kunnallisoikeus
type: Concept
References: Virkamiesoikeus
References: Vero-oikeus
References: Kunnallishallinto. Paikallishallinto
type: YKL-luokka
alternative label: Kommunal lagstiftning (33.26) @sv
alternative label: Kommunalrätt (33.26) @sv
alternative label: Kunnallinen lainsäädäntö (33.26)
alternative label: Kunnallisoikeus (33.26)
broader: Julkis- ja hallinto-oikeus
in scheme: YKL - Yleisten kirjastojen luokitusjärjestelmä
notation: 33.26
preferred label: Kommunalrätt @sv
preferred label: Local government law @en
scope note: Hit allmänna verk om kommunalrätt @sv
scope note: Tähän kunnallisoikeuden yleisteokset

Kirkko-oikeus
type: Concept
References: KRISTILLISET KIRKOT JA YHTEISÖT. KIRKKOHISTORIA
type: YKL-luokka
alternative label: Kanoninen oikeus (33.27)
alternative label: Kanonisk rätt (33.27) @sv
alternative label: Kirkko-oikeus (33.27)
alternative label: Kirkkolainsäädäntö (33.27)
alternative label: Kirkollisverotus, lainsäädäntö (33.27)
alternative label: Kirkosta eroaminen, lainsäädäntö (33.27)
alternative label: Kyrkobeskattning, lagstiftning (33.27) @sv
alternative label: Kyrkolagstiftning (33.27) @sv
alternative label: Kyrkorätt (33.27) @sv
alternative label: Religionsfrihet, lagstiftning (33.27) @sv
alternative label: Uskonnonvapauslainsäädäntö (33.27)
alternative label: Utträde ur kyrkan, lagstiftning (33.27) @sv
broader: Julkis- ja hallinto-oikeus
in scheme: YKL - Yleisten kirjastojen luokitusjärjestelmä
notation: 33.27
preferred label: Church law @en
preferred label: Kyrkorätt @sv
scope note: Hit allmänna verk om kyrkorätt Hit också lagstiftning om kyrkoskatt @sv
scope note: Tähän kirkko-oikeuden yleisteokset Tähän myös kirkollisverotusta koskeva lainsäädäntö

Siviili- ja kauppaoikeus
type: Concept
References: Kauppaoikeus
type: YKL-luokka
alternative label: Civilrätt (33.3+) @sv
alternative label: Dödförklaring, lagstiftning (33.3) @sv
alternative label: Föreningar, lagstiftning (33.3) @sv
alternative label: Föreningslagstiftning (33.3) @sv
alternative label: Kuolleeksijulistaminen, lainsäädäntö (33.3)
alternative label: Privaträtt (33.3+) @sv
alternative label: Siviilioikeus (33.3+)
alternative label: Yhdistykset, lainsäädäntö (33.3)
alternative label: Yhdistyslainsäädäntö (33.3)
alternative label: Yksityisoikeus (33.3+)
broader: OIKEUSTIEDE
in scheme: YKL - Yleisten kirjastojen luokitusjärjestelmä
narrower: Perhe- ja holhousoikeus
narrower: Perintö- ja testamenttioikeus
narrower: Esine- ja velvoiteoikeus
narrower: Immateriaalioikeudet
narrower: Huoneen- ja maanvuokralainsäädäntö
narrower: Kauppaoikeus
notation: 33.3
preferred label: Civil and commercial law @en
preferred label: Civil- och handelsrätt @sv
scope note: Hit allmänna verk om privat- och civilrätt samt verk som behandlar både civil- och handelsrätt Hit också föreningslagstiftning @sv
scope note: Tähän yksityis- ja siviilioikeuden yleisteokset sekä teokset, jotka koskevat sekä siviili- että kauppaoikeutta Tähän myös yhdistyslainsäädäntö

Perhe- ja holhousoikeus
type: Concept
References: Perhesosiologia
References: Sosiaalioikeus
References: Perhepolitiikka
References: Lasten ja nuorten huolto ja suojelu
type: YKL-luokka
alternative label: Adoptio, lainsäädäntö (33.31)
alternative label: Adoption, lagstiftning (33.31) @sv
alternative label: Adoptivbarn, lagstiftning (33.31) @sv
alternative label: Asumusero, lainsäädäntö (33.31)
alternative label: Avioero, lainsäädäntö (33.31)
alternative label: Avioliitto, lainsäädäntö (33.31)
alternative label: Aviottomat lapset, lainsäädäntö (33.31)
alternative label: Avoliitto, lainsäädäntö (33.31)
alternative label: Barnets rättigeter, familje- och förmynderskapsrätt (33.31) @sv
alternative label: Barnomsorg, lagstiftning (33.31) @sv
alternative label: Boskifte (33.31) @sv
alternative label: Elatuslainsäädäntö (33.31)
alternative label: Faderskap, lagstiftning (33.31) @sv
alternative label: Familjelagstiftning (33.31) @sv
alternative label: Familjerätt (33.31) @sv
alternative label: Förlovning, lagstiftning (33.31) @sv
alternative label: Förmynderskapsrätt (33.31) @sv
alternative label: Gemensam vårdnad, lagstiftning (33.31) @sv
alternative label: Hemskillnad, lagstiftning (33.31) @sv
alternative label: Holhousoikeus (33.31)
alternative label: Huoltajuus, lapsenhuoltolainsäädäntö (33.31)
alternative label: Isyys, lainsäädäntö (33.31)
alternative label: Kihlaus, lainsäädäntö (33.31)
alternative label: Lapsen oikeudet, perhe- ja holhousoikeus (33.31)
alternative label: Lastenhuolto, lainsäädäntö (33.31)
alternative label: Namnlagstiftning (33.31) @sv
alternative label: Nimilainsäädäntö (33.31)
alternative label: Ottolapset, lainsäädäntö (33.31)
alternative label: Perhelainsäädäntö (33.31)
alternative label: Perheoikeus (33.31)
alternative label: Pesänjako (33.31)
alternative label: Registrerat parförhållande, lagstiftning (33.31) @sv
alternative label: Rekisteröity parisuhde, lainsäädäntö (33.31)
alternative label: Sammanboende, lagstiftning (33.31) @sv
alternative label: Siviilivihkiminen (33.31)
alternative label: Skilsmässa, lagstiftning (33.31) @sv
alternative label: Släktnamnslagstiftning (33.31) @sv
alternative label: Sukunimilainsäädäntö (33.31)
alternative label: Tapaamisoikeus, lasten, lainsäädäntö (33.31)
alternative label: Umgängesrätt, barn, lagstiftning (33.31) @sv
alternative label: Underhållslagstiftning (33.31) @sv
alternative label: Utomäktenskapliga barn, lagstiftning (33.31) @sv
alternative label: Vigsel, borgerlig (33.31) @sv
alternative label: Vårdnad om barn, lagstiftning (33.31) @sv
alternative label: Yhteishuolto, lapsenhuoltolainsäädäntö (33.31)
alternative label: Äktenskap, lagstiftning (33.31) @sv
broader: Siviili- ja kauppaoikeus
in scheme: YKL - Yleisten kirjastojen luokitusjärjestelmä
notation: 33.31
preferred label: Familje- och förmynderskapsrätt @sv
preferred label: Family and guardianship law @en
scope note: Avioliittoa, avoliittoa ja rekisteröityä parisuhdetta sekä avioeroa koskeva lainsäädäntö Lapsen asemaa koskeva lainsäädäntö Isyys-, ottolapsi-, elatus- ja lapsenhuoltolainsäädäntö Tähän myös nimilainsäädäntö
scope note: Lagstiftning om äktenskap, samboende, registrerat parförhållande och äktenskapsskillnad Lagstiftning om barnets ställning Faderskapslagstiftning, adoptionslagstiftning, lagstiftning om underhåll och vårdnad Hit också namnlagstiftning @sv

Perintö- ja testamenttioikeus
type: Concept
References: Vero-oikeus
type: YKL-luokka
alternative label: Arv, arvs- och testamentsrätt (33.32) @sv
alternative label: Arvsrätt (33.32) @sv
alternative label: Bodelning, arvs- och testamentsrätt (33.32) @sv
alternative label: Bouppteckning (33.32) @sv
alternative label: Jäämistöoikeus (33.32)
alternative label: Kvarlåtenskapsrätt (33.32) @sv
alternative label: Ositus, perintö- ja testamenttioikeus (33.32)
alternative label: Perinnöt, perintö- ja testamenttioikeus (33.32)
alternative label: Perintöoikeus (33.32)
alternative label: Perunkirjoitus (33.32)
alternative label: Testamentsrätt (33.32) @sv
alternative label: Testamenttioikeus (33.32)
alternative label: arvskifte, arvs- och testamentsrätt (33.32) @sv
alternative label: perinnönjako, perintö- ja testamenttioikeus (33.32)
broader: Siviili- ja kauppaoikeus
in scheme: YKL - Yleisten kirjastojen luokitusjärjestelmä
notation: 33.32
preferred label: Arvs- och testamentsrätt @sv
preferred label: Inheritance and succession law @en
scope note: Jäämistöoikeus. Perunkirjoitus
scope note: Kvarlåtenskapsrätt. Bouppteckning @sv

Esine- ja velvoiteoikeus
type: Concept
References: Asemakaava- ja rakentamislainsäädäntö
References: Immateriaalioikeudet
References: Kauppaoikeus
References: Maa- ja vesioikeus
References: Rikosoikeus
type: YKL-luokka
alternative label: Agenturavtal, sak- och obligationsrätt (33.33) @sv
alternative label: Arvopaperit, lainsäädäntö (33.33)
alternative label: Avtalsrätt, sak- och obligationsrätt (33.33) @sv
alternative label: Borgen, lagstiftning (33.33) @sv
alternative label: Byggnadsavtal, lagstiftning (33.33) @sv
alternative label: Edustussopimukset, esine- ja velvoiteoikeus (33.33)
alternative label: Entreprenadavtal, lagstiftning (33.33) @sv
alternative label: Esineoikeus (33.33)
alternative label: Etuosto-oikeus (33.33)
alternative label: Exekutiv auktion, lagstiftning (33.33) @sv
alternative label: Febelbehandling, lagstiftning (33.33) @sv
alternative label: Finansieringsformer, lagstiftning (33.33) @sv
alternative label: Fordringsrätt (33.33) @sv
alternative label: Förköpsrätt (33.33) @sv
alternative label: Förmögenhetsrätt (33.33) @sv
alternative label: Handelsavtal, lagstiftning (33.33+) @sv
alternative label: Hoitovirheet, lainsäädäntö (33.33)
alternative label: Jordförvärv, lagstiftning (33.33) @sv
alternative label: Jordförvärvstillstånd, lagstiftning (33.33) @sv
alternative label: Kauppakirjat, lainsäädäntö (33.33+)
alternative label: Kauppasopimukset, lainsäädäntö (33.33+)
alternative label: Korkolainsäädäntö (33.33)
alternative label: Kreditlagstiftning (33.33) @sv
alternative label: Käyttöoikeus (33.33)
alternative label: Köpebrev, lagstiftning (33.33+) @sv
alternative label: Luottolainsäädäntö (33.33)
alternative label: Maanhankinta, lainsäädäntö (33.33)
alternative label: Maanhankintalupa, lainsäädäntö (33.33)
alternative label: Obligaatio-oikeus (33.33)
alternative label: Obligationsrätt (33.33) @sv
alternative label: Omistusoikeuslainsäädäntö (33.33)
alternative label: Pakkohuutokauppa, lainsäädäntö (33.33)
alternative label: Pakkolunastusoikeus (33.33)
alternative label: Panträtt (33.33) @sv
alternative label: Panttioikeus (33.33)
alternative label: Patientens ställning, skadeståndsrätt (33.33) @sv
alternative label: Patientskadelagstiftning (33.33) @sv
alternative label: Patientskador, lagstiftning (33.33) @sv
alternative label: Potilaan asema, vahingonkorvauslainsäädäntö (33.33)
alternative label: Potilasvahingot, lainsäädäntö (33.33)
alternative label: Potilasvahinkolainsäädäntö (33.33)
alternative label: Rahoitusmuodot, lainsäädäntö (33.33)
alternative label: Rakennussopimuksia koskeva lainsäädäntö (33.33)
alternative label: Räntelagstiftning (33.33) @sv
alternative label: Saamisoikeus (33.33)
alternative label: Sakrätt (33.33) @sv
alternative label: Samägo, lagstiftning (33.33) @sv
alternative label: Skadeersättningsrätt (33.33) @sv
alternative label: Skuldebrev, sak- och obligationsrätt (33.33) @sv
alternative label: Sopimusoikeus, esine- ja velvoiteoikeus (33.33)
alternative label: Standardavtal, sak- och obligationsrätt (33.33) @sv
alternative label: Takaus, lainsäädäntö (33.33)
alternative label: Tvångsinlösning, rätt att tvångsinlösa (33.33) @sv
alternative label: Urakkasopimukset, lainsäädäntö (33.33)
alternative label: Utnyttjanderätt (33.33) @sv
alternative label: Vahingonkorvausoikeus (33.33)
alternative label: Vakiosopimukset, esine- ja velvoiteoikeus (33.33)
alternative label: Varallisuusoikeus (33.33)
alternative label: Velkakirja, esine- ja velvoiteoikeus (33.33)
alternative label: Velvoiteoikeus (33.33)
alternative label: Värdepapper, lagstiftning (33.33) @sv
alternative label: Yhteisomistus, lainsäädäntö (33.33)
alternative label: Äganderättslagstiftning (33.33) @sv
broader: Siviili- ja kauppaoikeus
in scheme: YKL - Yleisten kirjastojen luokitusjärjestelmä
narrower: Asunto- ja kiinteistönkauppaoikeus
notation: 33.33
preferred label: Law of property and obligations @en
preferred label: Sak- och obligationsrätt @sv
scope note: Lagstiftning om äganderätt Lagstiftning om gemensamt ägande Förmögenhetsrätt Nyttjanderätt. Expropriationsrätt Jordanskaffningsrätt och jordanskaffningstillstånd. Förköpsrätt Avtalsrätt Lagstiftning om byggnads- och entreprenadavtal Skadeståndsrätt Kredit- och räntelagstiftning Lagstiftning om finansieringsformer Lagstiftning om köp mellan privatpersoner eller mellan näringsidkare Köpebrev. Skuldebrev Standardkontrakt. Agenturavtal @sv
scope note: Omistusoikeutta koskeva lainsäädäntö Yhteisomistusta koskeva lainsäädäntö Varallisuusoikeus Käyttöoikeus. Pakkolunastusoikeus Maanhankintalait ja -lupa. Etuosto-oikeus Sopimusoikeus Rakennus- ja urakkasopimuksia koskeva lainsäädäntö Vahingonkorvausoikeus Luotto- ja korkolainsäädäntö Rahoitusmuotoja koskeva lainsäädäntö Yksityishenkilöiden välistä tai elinkeinonharjoittajien välistä kauppaa koskeva lainsäädäntö Kauppakirja. Velkakirja Vakiosopimukset. Edustussopimukset

Asunto- ja kiinteistönkauppaoikeus
type: Concept
References: Asemakaava- ja rakentamislainsäädäntö
References: Kauppaoikeus
References: Yhtiölainsäädäntö
References: Maa- ja vesioikeus
References: Maa. Kiinteistöt. Tontit
References: Asuntopolitiikka
References: Rakennuksen kunnossapito
type: YKL-luokka
alternative label: Asunnonvälitys, lainsäädäntö (33.331)
alternative label: Asunto-osakkeet, asuntokauppaoikeus (33.331)
alternative label: Asuntokauppaoikeus (33.331)
alternative label: Bostadsaktier, bostadsköpsrätt (33.331) @sv
alternative label: Bostadsförmedling, lagstiftning (33.331) @sv
alternative label: Bostadsköpsrätt (33.331) @sv
alternative label: Fastighetsförmedling, lagstiftning (33.331) @sv
alternative label: Fastighetshandelsrätt (33.331) @sv
alternative label: Fastighetsrätt (33.331) @sv
alternative label: Inteckning, lagstiftning (33.331) @sv
alternative label: Kiinnitys, lainsäädäntö (33.331)
alternative label: Kiinteistönkauppaoikeus (33.331)
alternative label: Kiinteistönvälitys, lainsäädäntö (33.331)
alternative label: Kiinteistöoikeus (33.331)
alternative label: Lagfart, bostads- och fastighetshandelsrätt (33.331) @sv
alternative label: Lainhuudatus, asunto- ja kiinteistökauppaoik. (33.331)
alternative label: Tomtköp, lagstiftning (33.331) @sv
alternative label: Tonttikauppa, lainsäädäntö (33.331)
broader: Esine- ja velvoiteoikeus
in scheme: YKL - Yleisten kirjastojen luokitusjärjestelmä
notation: 33.331
preferred label: Bostads- och fastighetsköpsrätt @sv
preferred label: Legislation on house purchases and real estate deals @en
scope note: Asunnon- ja kiinteistönvälitykseen sekä asunto-osakkeiden ja kiinteistöjen hankintaan ja myymiseen liittyvä lainsäädäntö Lainhuudatus. Kiinnitys
scope note: Lagstiftning om bostads- och fastighetsförmedling samt om försäljning och köp av bostadsaktier och fastigheter Lagfart. Inteckning @sv

Immateriaalioikeudet
type: Concept
References: Julkis- ja hallinto-oikeus
References: Esine- ja velvoiteoikeus
type: YKL-luokka
alternative label: Copyright-lagstiftning (33.34) @sv
alternative label: Copyright-lainsäädäntö (33.34)
alternative label: Friexemplarrätt, immaterialrätt (33.34) @sv
alternative label: Förlag, lagstiftning (33.34) @sv
alternative label: Immateriaalioikeudet (33.34)
alternative label: Immaterialrätt (33.34) @sv
alternative label: Keksijänoikeus (33.34)
alternative label: Kustannuslainsäädäntö (33.34)
alternative label: Liikemerkit, lainsäädäntö (33.34)
alternative label: Logoer, lagstiftning (33.34) @sv
alternative label: Mallilainsäädäntö, immateriaalioikeus (33.34)
alternative label: Modellagstiftning, immaterialrätt (33.34) @sv
alternative label: Patentlagstiftning (33.34) @sv
alternative label: Patenttilainsäädäntö (33.34)
alternative label: Piraattituotteet, tekijänoikeudet (33.34)
alternative label: Piratism, upphovsrätt (33.34) @sv
alternative label: Piratismi, tekijänoikeudet (33.34)
alternative label: Piratprodukter, upphovsrätt (33.34) @sv
alternative label: Plagiaatit, tekijänoikeudet (33.34)
alternative label: Plagiat, upphovsrätt (33.34) @sv
alternative label: Plagiering, upphovsrätt (33.34) @sv
alternative label: Plagiointi, tekijänoikeudet (33.34)
alternative label: Tavaramerkkilainsäädäntö (33.34)
alternative label: Tekijänoikeuslainsäädäntö (33.34)
alternative label: Uppfinnarrätt (33.34) @sv
alternative label: Upphovsrättslagstiftning (33.34) @sv
alternative label: Vapaakappaleoikeus, immateriaalioikeudet (33.34)
alternative label: Varumärkeslagstiftning (33.34) @sv
broader: Siviili- ja kauppaoikeus
in scheme: YKL - Yleisten kirjastojen luokitusjärjestelmä
notation: 33.34
preferred label: Immaterialrätt @sv
preferred label: Incorporeal rights @en
scope note: Lagstiftning om upphovsrätt och varumärke Patent-, förlags-, copyright- och modellagstiftning Lagstiftning om friexemplar @sv
scope note: Tekijänoikeus-, patentti-, tavaramerkki-, malli-, kustannus- ja copyright-lainsäädäntö Vapaakappaleoikeus

Huoneen- ja maanvuokralainsäädäntö
type: Concept
References: Asuntopolitiikka
type: YKL-luokka
alternative label: Arrende, lagstiftning (33.35) @sv
alternative label: Huoneenvuokralainsäädäntö (33.35)
alternative label: Hyreslagstiftning (33.35) @sv
alternative label: Hyresrätt (33.35) @sv
alternative label: Maanvuokralainsäädäntö (33.35)
alternative label: Vuokraoikeus (33.35)
broader: Siviili- ja kauppaoikeus
in scheme: YKL - Yleisten kirjastojen luokitusjärjestelmä
notation: 33.35
preferred label: Hyres- och arrendelagstiftning @sv
preferred label: Tenancy legislation @en

Kauppaoikeus
type: Concept
References: Esine- ja velvoiteoikeus
References: Asunto- ja kiinteistönkauppaoikeus
References: Kuluttajapolitiikka
References: Markkinointi. Kauppa
type: YKL-luokka
alternative label: Arvopaperikauppa, lainsäädäntö (33.36)
alternative label: Arvopaperimarkkinat, lainsäädäntö (33.36)
alternative label: Avbetalningsköp, lagstiftning (33.36) @sv
alternative label: Firma, lagstiftning (33.36) @sv
alternative label: Frakträtt (33.36) @sv
alternative label: Handelsregister, handelsrätt (33.36) @sv
alternative label: Handelsrätt (33.36+) @sv
alternative label: Irtaimen kauppa, lainsäädäntö (33.36)
alternative label: Julkiset hankinnat, markkinaoaikeus (33.36)
alternative label: Kauppaoikeus (33.36+)
alternative label: Kaupparekisteri, kauppaoikeus (33.36)
alternative label: Kilpailuoikeus (33.36)
alternative label: Konkurrensrätt (33.36) @sv
alternative label: Konsumentskydd, lagstiftning (33.36) @sv
alternative label: Kuljetusoikeus (33.36)
alternative label: Kuluttajansuoja, lainsäädäntö (33.36)
alternative label: Lösöreshandel, lagstiftning (33.36) @sv
alternative label: Markkinaoikeus (33.36)
alternative label: Markkinatuomioistuin (33.36)
alternative label: Marknadsdomstol (33.36) @sv
alternative label: Marknadsrätt (33.36) @sv
alternative label: Offentlig upphandling, marknadsrätt (33.36) @sv
alternative label: Osamaksukauppa, lainsäädäntö (33.36)
alternative label: Produktansvarighetslagstiftning (33.36) @sv
alternative label: Produktsäkerhet, lagstiftning (33.36) @sv
alternative label: Prokura, handelsrätt (33.36) @sv
alternative label: Prokura, kauppaoikeus (33.36)
alternative label: Rahtausoikeus (33.36)
alternative label: Toiminimi, lainsäädäntö (33.36)
alternative label: Transporträtt (33.36) @sv
alternative label: Tuoteturvallisuus, lainsäädäntö (33.36)
alternative label: Tuotevastuulainsäädäntö (33.36)
alternative label: Värdepappershandel, lagstiftning (33.36) @sv
alternative label: Värdepappersmarknaden, lagstiftning (33.36) @sv
broader: Siviili- ja kauppaoikeus
in scheme: YKL - Yleisten kirjastojen luokitusjärjestelmä
narrower: Kirjanpito- ja tilintarkastuslainsäädäntö
narrower: Yhtiölainsäädäntö
narrower: Pankkilainsäädäntö
narrower: Vakuutuslainsäädäntö
notation: 33.36
preferred label: Commercial law @en
preferred label: Handelsrätt @sv
scope note: Hit verk om handelsrätt i allmänhet Handelsregistret. Firma. Prokura. Marknadsrätt Lagstiftning om köp mellan näringsidkare och konsument Lagstiftning om köp av lös egendom och om avbetalningsköp Konsumentskyddslagstiftning Lagstiftning om produktansvar och produktsäkerhet Transporträtt @sv
scope note: Tähän kauppaoikeutta yleensä koskevat teokset Kaupparekisteri. Toiminimi. Prokura. Markkinaoikeus Elinkeinonharjoittajan ja kuluttajan välistä kauppaa koskeva lainsäädäntö Irtaimen kauppaa ja osamaksukauppaa koskeva lainsäädäntö Kuluttajansuojalainsäädäntö Tuotevastuu- ja tuoteturvallisuuslainsäädäntö Kuljetusoikeus

Kirjanpito- ja tilintarkastuslainsäädäntö
type: Concept
References: Julkistaloudellinen kirjanpito ja tilintarkastus
References: Liiketaloudellinen kirjanpito ja tilintarkastus
type: YKL-luokka
alternative label: Bokföringslagstiftning (33.362) @sv
alternative label: Kirjanpitolainsäädäntö (33.362)
alternative label: Revision, lagstiftning (33.362) @sv
alternative label: Tilintarkastus, lainsäädäntö (33.362)
broader: Kauppaoikeus
in scheme: YKL - Yleisten kirjastojen luokitusjärjestelmä
notation: 33.362
preferred label: Bokförings- och revisionslagstiftning @sv
preferred label: Bookkeeping and auditing legislation @en
scope note: Hit bokförings- och revisionslagstiftning både från den offentliga ekonomins och företagsekonomins synvinkel @sv
scope note: Tähän julkis- ja liiketaloudellinen kirjanpito- ja tilintarkastuslainsäädäntö

Yhtiölainsäädäntö
type: Concept
References: Kansalaistoiminta ja –aktivismi. Järjestötoiminta. Kokoustekniikka.
References: Asunto- ja kiinteistönkauppaoikeus
References: Rakennuksen kunnossapito
type: YKL-luokka
alternative label: Aktiebolag, bolagslagstiftning (33.364) @sv
alternative label: Andelslag, lagstiftning (33.364) @sv
alternative label: Asunto-osakeyhtiöt, lainsäädäntö (33.364)
alternative label: Avoin yhtiö, yhtiölainsäädäntö (33.364)
alternative label: Bolagslagstiftning (33.364) @sv
alternative label: Bolagsrätt (33.364) @sv
alternative label: Bolagsstämma, bolagslagstiftning (33.364) @sv
alternative label: Bolagsstämmor, bolagslagstiftning (33.364) @sv
alternative label: Bostadsaktiebolag, lagstiftning (33.364) @sv
alternative label: Disponentskap, lagstiftning (33.364) @sv
alternative label: Energiatodistukset, lainsäädäntö (33.364)
alternative label: Energicertificat, lagstiftning (33.364) @sv
alternative label: Henkilöyhtiöt, yhtiölainsäädäntö (33.364)
alternative label: Isännöinti, lainsäädäntö (33.364)
alternative label: Kommandiittiyhtiöt, yhtiölainsäädäntö (33.364)
alternative label: Kommanditbolag, bolagslagstiftning (33.364) @sv
alternative label: Osakeyhtiöt, yhtiölainsäädäntö (33.364)
alternative label: Osuuskuntalainsäädäntö (33.364)
alternative label: Personbolag, bolagslagstiftning (33.364) @sv
alternative label: Stiftelser, lagstiftning (33.364) @sv
alternative label: Säätiöt, lainsäädäntö (33.364)
alternative label: Yhtiökokoukset, yhtiölainsäädäntö (33.364)
alternative label: Yhtiökokous, yhtiölainsäädäntö (33.364)
alternative label: Yhtiölainsäädäntö (33.364)
alternative label: Yhtiöoikeus (33.364)
alternative label: Öppet bolag, bolagslagstiftning (33.364) @sv
broader: Kauppaoikeus
in scheme: YKL - Yleisten kirjastojen luokitusjärjestelmä
notation: 33.364
preferred label: Bolagslagstiftning @sv
preferred label: Company legislation @en
scope note: Lagstiftning om aktiebolag, bostadsaktiebolag, personbolag, kommanditbolag, öppna bolag och andelslag. Bolagsrätt. Bolagsstämma @sv
scope note: Osakeyhtiöitä, asunto-osakeyhtiöitä, henkilöyhtiöitä, kommandiittiyhtiöitä, avoimia yhtiöitä ja osuuskuntia koskeva lainsäädäntö. Yhtiöoikeus. Yhtiökokous

Pankkilainsäädäntö
type: Concept
References: Esine- ja velvoiteoikeus
References: Pankkitoimi. Pörssitoimi. Sijoitustoiminta
type: YKL-luokka
alternative label: Banklagstiftning (33.367) @sv
alternative label: Banksekretess (33.367) @sv
alternative label: Checkrätt (33.367) @sv
alternative label: Pankkilainsäädäntö (33.367)
alternative label: Pankkisalaisuus (33.367)
alternative label: Sekkioikeus (33.367)
alternative label: Shekkioikeus (33.367)
alternative label: Vekselioikeus (33.367)
alternative label: Växelrätt (33.367) @sv
broader: Kauppaoikeus
in scheme: YKL - Yleisten kirjastojen luokitusjärjestelmä
notation: 33.367
preferred label: Banking legislation @en
preferred label: Banklagstiftning @sv
scope note: Hit också växel- och checkrätt @sv
scope note: Tähän myös vekseli- ja shekkioikeus

Vakuutuslainsäädäntö
type: Concept
References: Sosiaalioikeus
References: Vakuutustoimi
type: YKL-luokka
alternative label: Försäkringslagstiftning (33.368) @sv
alternative label: Haaksirikot, vakuutuslainsäädäntö (33.368)
alternative label: Liikennevakuutukset, lainsäädäntö (33.368)
alternative label: Olycksfallsförsäkring, lagstiftning (33.368) @sv
alternative label: Skeppsbrott, försäkringslagstiftning (33.368) @sv
alternative label: Tapaturmavakuutus, lainsäädäntö (33.368)
alternative label: Trafikförsäkringar, lagstiftning (33.368) @sv
alternative label: Vakuutuslainsäädäntö (33.368)
broader: Kauppaoikeus
in scheme: YKL - Yleisten kirjastojen luokitusjärjestelmä
notation: 33.368
preferred label: Försäkringslagstiftning @sv
preferred label: Insurance legislation @en
scope note: Hit också trafikförsäkringslagstiftning @sv
scope note: Tähän myös liikennevakuutuslainsäädäntö

Talousoikeus
type: Concept
References: Työoikeus
References: ALUESUUNNITTELU. ALUEPOLITIIKKA
References: Ympäristönsuojelu. Luonnonsuojelu
References: Kunnallistekninen ympäristönhuolto
type: YKL-luokka
alternative label: Asemakaavalainsäädäntö, ympäristöoikeus (33.4+)
alternative label: Avfallshantering, lagstiftning (33.4) @sv
alternative label: Djurskyddslagstiftning (33.4) @sv
alternative label: Ekonomisk rätt (33.4) @sv
alternative label: Eläinsuojelulainsäädäntö (33.4)
alternative label: Farliga ämnen, lagstiftning (33.4) @sv
alternative label: Ilmansuojelulainsäädäntö (33.4)
alternative label: Ilmaoikeus (33.4)
alternative label: Jätehuolto, lainsäädäntö (33.4)
alternative label: Kemikaalilainsäädäntö (33.4)
alternative label: Kemikaalit, lainsäädäntö (33.4)
alternative label: Kemikalielagstiftning (33.4) @sv
alternative label: Kemikalier, lagstiftning (33.4) @sv
alternative label: Lufträtt (33.4) @sv
alternative label: Luftvårdslagstiftning (33.4) @sv
alternative label: Luonnonsuojelulainsäädäntö (33.4)
alternative label: Miljörätt (33.4+) @sv
alternative label: Miljövård, lagstiftning (33.4+) @sv
alternative label: Naturskyddslagstiftning (33.4) @sv
alternative label: Ongelmajätteet, lainsäädäntö (33.4)
alternative label: Problemavfall, lagstiftning (33.4) @sv
alternative label: Stadsplanelagstiftning, miljörätt (33.4+) @sv
alternative label: Talousoikeus (33.4)
alternative label: Vaaralliset aineet, lainsäädäntö (33.4)
alternative label: Ympäristönsuojelu, lainsäädäntö (33.4+)
alternative label: Ympäristöoikeus (33.4+)
broader: OIKEUSTIEDE
in scheme: YKL - Yleisten kirjastojen luokitusjärjestelmä
narrower: Maa- ja vesioikeus
narrower: Maa- ja metsätalouslainsäädäntö
narrower: Elinkeino-oikeus
narrower: Työoikeus
narrower: Liikennelainsäädäntö
notation: 33.4
preferred label: Economic law @en
preferred label: Ekonomisk rätt @sv
scope note: Hit verk om ekonomisk rätt i allmänhet Miljörätt. Naturskyddslagstiftning Lagstiftning om avfallshantering Lagstiftning om farliga ämnen Djurskyddslagstiftning @sv
scope note: Tähän talousoikeuden yleisteokset Ympäristöoikeus. Luonnonsuojelulainsäädäntö Jätehuoltolainsäädäntö Vaarallisia aineita koskeva lainsäädäntö Eläinsuojelulainsäädäntö

Maa- ja vesioikeus
type: Concept
References: Asemakaava- ja rakentamislainsäädäntö
References: Liikennelainsäädäntö
References: ALUESUUNNITTELU. ALUEPOLITIIKKA
References: Maa. Kiinteistöt. Tontit
type: YKL-luokka
alternative label: Allemansrätt (33.41) @sv
alternative label: Allmänning, jordrätt (33.41) @sv
alternative label: Fastighetsbildningsrätt (33.41) @sv
alternative label: Flottningslagstiftning (33.41) @sv
alternative label: Jakolaitos, lainsäädäntö (33.41)
alternative label: Jokamiehenoikeudet (33.41)
alternative label: Jordrätt (33.41) @sv
alternative label: Jordskifteslagstiftning (33.41) @sv
alternative label: Kiinteistönmuodostamisoikeus (33.41)
alternative label: Maanjakolainsäädäntö (33.41)
alternative label: Maaoikeus (33.41)
alternative label: Maapoliittinen lainsäädäntö (33.41)
alternative label: Markpolitisk lagstiftning (33.41) @sv
alternative label: Pakkolunastus, maaoikeus (33.41)
alternative label: Rantaoikeus (33.41)
alternative label: Rantojensuojelu, lainsäädäntö (33.41)
alternative label: Skiftesväsen, lagstiftning (33.41) @sv
alternative label: Strandrätt (33.41) @sv
alternative label: Strandskydd, lagstiftning (33.41) @sv
alternative label: Tieoikeus (33.41)
alternative label: Timmerflottning, lagstiftning (33.41) @sv
alternative label: Tukinuitto, lainsäädäntö (33.41)
alternative label: Tvångsinlösning, jordrätt (33.41) @sv
alternative label: Uittolainsäädäntö (33.41)
alternative label: Vattenrätt (33.41) @sv
alternative label: Vesioikeus (33.41)
alternative label: Vägrätt (33.41) @sv
alternative label: Yhteismaa, maaoikeus (33.41)
broader: Talousoikeus
in scheme: YKL - Yleisten kirjastojen luokitusjärjestelmä
notation: 33.41
preferred label: Jord- och vattenrätt @sv
preferred label: Land and water rights @en
scope note: Lagstiftning om markpolitik och jordskifte Lagstiftning om fastighetsbildning Strandrätt. Vägrätt Allemansrätt @sv
scope note: Maapoliittinen ja maanjakolainsäädäntö Kiinteistönmuodostamisoikeus Rantaoikeus. Tieoikeus Jokamiehenoikeudet

Maa- ja metsätalouslainsäädäntö
type: Concept
References: MAA- JA METSÄTALOUS. ELINTARVIKETEOLLISUUS. BIOTEKNIIKKA
References: Metsästys. Kalastus
type: YKL-luokka
alternative label: Asutuslainsäädäntö (33.42)
alternative label: Bosättningslagstiftning (33.42) @sv
alternative label: Fiskerilagstiftning (33.42) @sv
alternative label: Jaktlagstiftning (33.42) @sv
alternative label: Kalastuslainsäädäntö (33.42)
alternative label: Lagen om enskilda skogar (33.42) @sv
alternative label: Lantbrukslagstiftning (33.42) @sv
alternative label: Maatalouslainsäädäntö (33.42)
alternative label: Metsälainsäädäntö (33.42)
alternative label: Metsästyslainsäädäntö (33.42)
alternative label: Metsätalouslainsäädäntö (33.42)
alternative label: Skogsbrukslagstiftning (33.42) @sv
alternative label: Skogslagstiftning (33.42) @sv
alternative label: Yksityismetsälaki (33.42)
broader: Talousoikeus
in scheme: YKL - Yleisten kirjastojen luokitusjärjestelmä
notation: 33.42
preferred label: Agriculture and forestry legislation @en
preferred label: Jord- och skogsbrukslagstiftning @sv
scope note: Hit också lagstiftning om jakt och fiske @sv
scope note: Tähän myös metsästys- ja kalastuslainsäädäntö

Elinkeino-oikeus
type: Concept
References: Rikosoikeus
References: Päihdepolitiikka. Päihdehuolto
References: Sosiaalilääketiede. Ympäristölääketiede
References: Päihteiden ja piristeiden käyttö
References: Tupakointi
References: Elintarviketeollisuus
type: YKL-luokka
alternative label: Alkoholilainsäädäntö (33.43)
alternative label: Alkohollagstiftning (33.43) @sv
alternative label: Anniskelu, alkoholilainsäädäntö (33.43)
alternative label: Elinkeino-oikeus (33.43)
alternative label: Elinkeinolupalainsäädäntö (33.43)
alternative label: Elintarvikelainsäädäntö (33.43)
alternative label: Huumausainelainsäädäntö (33.43)
alternative label: Lisäaineet, elintarvikelainsäädäntö (33.43)
alternative label: Livsmedelslagstiftning (33.43) @sv
alternative label: Narkotikalagstiftningen (33.43) @sv
alternative label: Näringsrätt (33.43) @sv
alternative label: Näringstillståndslagstiftning (33.43) @sv
alternative label: Tillsatsämnen, livsmedelslagstiftning (33.43) @sv
alternative label: Tobakslagstiftning (33.43) @sv
alternative label: Tupakkalainsäädäntö (33.43)
alternative label: Utskänkning, alkohollagstiftning (33.43) @sv
broader: Talousoikeus
in scheme: YKL - Yleisten kirjastojen luokitusjärjestelmä
notation: 33.43
preferred label: Business law @en
preferred label: Näringsrätt @sv
scope note: Elintarvike-, alkoholi-, huumausaine- ja tupakkalainsäädäntö
scope note: Livsmedels-, alkohol-, narkotika- och tobakslagstiftning @sv

Työoikeus
type: Concept
References: Virkamiesoikeus
References: Työ. Työelämä
References: Palkkapolitiikka. Tulopolitiikka
References: Työmarkkinajärjestöt
References: Työsuojelu. Ergonomia
References: Työterveyshuolto. Opiskeluterveydenhuolto Kouluterveydenhoitajan työ
alternative label: APL (33.44) @sv
alternative label: Ammattitaudit, lainsäädäntö (33.44)
alternative label: Arbetarskyddslagstiftning (33.44) @sv
alternative label: Arbetsdomstolar (33.44) @sv
alternative label: Arbetskonflikter, lagstiftning (33.44) @sv
alternative label: Arbetslagstiftning (33.44) @sv
alternative label: Arbetsolycksfall, lagstiftning (33.44) @sv
alternative label: Arbetspensionslagstiftning (33.44) @sv
alternative label: Arbetsrätt (33.44) @sv
alternative label: Arbetsrådet (33.44) @sv
alternative label: Arbetssäkerhet, lagstiftning (33.44) @sv
alternative label: Arbetstagarnas pensionsskyddslagstiftning (33.44) @sv
alternative label: Arbetstider, lagstiftning (33.44) @sv
alternative label: Faderskapsledighet, lagstiftning (33.44) @sv
alternative label: Familjeledighet, lagstiftning (33.44) @sv
alternative label: Företagshälsovård, lagstiftning (33.44) @sv
alternative label: Förlikning av arbetstvister, lagstiftning (33.44) @sv
alternative label: Förtroendemannasystem, lagstiftning (33.44) @sv
alternative label: Hoitovapaa, lainsäädäntö (33.44)
alternative label: Hyrd arbetskraft, lagstiftning (33.44) @sv
alternative label: Invalidpensioner, lagstiftning (33.44) @sv
alternative label: Irtisanomissuoja, lainsäädäntö (33.44)
alternative label: Isyysloma, lainsäädäntö (33.44)
alternative label: Isyysvapaa, lainsäädäntö (33.44)
alternative label: Kollektivavtalslagstiftning (33.44) @sv
alternative label: Lakot, työoikeus (33.44)
alternative label: Luottamusmiesjärjestelmä, lainsäädäntö (33.44)
alternative label: Löner, lagstiftning om arbets- och tjänstekollektivavtal (33.44) @sv
alternative label: Mammaledighet, lagstiftning (33.44) @sv
alternative label: Moderskapsledighet, lagstiftning (33.44) @sv
alternative label: Palkat, työ- ja virkaehtosopimuslains. (33.44)
alternative label: Pappaledighet, lagstiftning (33.44) @sv
alternative label: Perhevapaa, lainsäädäntö (33.44)
alternative label: Riksförlikningsmannen (33.44) @sv
alternative label: SA-lagen (33.44) @sv
alternative label: Samarbetsförfarande, arbetsrätt (33.44) @sv
alternative label: Samarbetsförfarande, lagen (33.44) @sv
alternative label: Semestrar, lagstiftning (33.44) @sv
alternative label: Strejker, arbetsrätt (33.44) @sv
alternative label: TEL (33.44)
alternative label: Tjänstemannapension, lagstiftning (33.44) @sv
alternative label: Työajat, lainsäädäntö (33.44)
alternative label: Työehtosopimuslainsäädäntö (33.44)
alternative label: Työeläkelainsäädäntö (33.44)
alternative label: Työkyvyttömyyseläkkeet, lainsäädäntö (33.44)
alternative label: Työlainsäädäntö (33.44)
alternative label: Työneuvosto (33.44)
alternative label: Työntekijäin eläketurvalainsäädäntö (33.44)
alternative label: Työoikeus (33.44)
alternative label: Työriitojen sovittelu, lainsäädäntö (33.44)
alternative label: Työsuojelulainsäädäntö (33.44)
alternative label: Työtaistelut, lainsäädäntö (33.44)
alternative label: Työtapaturmalainsäädäntö (33.44)
alternative label: Työterveyshuolto, lainsäädäntö (33.44)
alternative label: Työttömyysturva, lainsäädäntö (33.44)
alternative label: Työtuomioistuimet (33.44)
alternative label: Työturvallisuus, lainsäädäntö (33.44)
alternative label: Valtakunnansovittelija (33.44)
alternative label: Virkaehtolainsäädäntö (33.44)
alternative label: Virkamieseläkelainsäädäntö (33.44)
alternative label: Virkamiesoikeus, työoikeus (33.44)
alternative label: Vuokratyö, lainsäädäntö (33.44)
alternative label: Vuosilomat, lainsäädäntö (33.44)
alternative label: YT-laki (33.44)
alternative label: Yhteistoimintalaki (33.44)
alternative label: Yhteistoimintamenettely, työoikeus (33.44)
alternative label: Äitiysloma, lainsäädäntö (33.44)
alternative label: Äitiysvapaa, lainsäädäntö (33.44)
broader: Talousoikeus
in scheme: YKL - Yleisten kirjastojen luokitusjärjestelmä
notation: 33.44
scope note: Lagstiftning om kollektiv- och tjänstekollektivavtal Lagstiftning om arbetstid, semester, uppsägningsskydd och arbetskonflikter Lagstiftning om arbetspensionsskydd och tjänstemannapensionsskydd Lagstiftning om arbetarskydd, företagshälsovård och olycksfall i arbetet Lagen om samarbete inom företag. Förlikning av arbetstvister Riksförlikningsmannen. Arbetsdomstolen. Arbetsrådet @sv
scope note: Työ- ja virkaehtosopimuslainsäädäntö Työaikaa, vuosilomia, irtisanomissuojaa ja työtaisteluja koskeva lainsäädäntö Työeläke- ja virkamieseläketurvaa koskeva lainsäädäntö Työsuojelua, työturvallisuutta, työterveyshuoltoa ja työtapaturmia koskeva lainsäädäntö Yhteistoimintalaki. Työriitojen sovittelu Valtakunnansovittelija. Työtuomioistuin. Työneuvosto

Liikennelainsäädäntö
type: Concept
References: Kauppaoikeus
References: Vakuutuslainsäädäntö
References: Maa- ja vesioikeus
References: Rikosoikeus
References: Liikennesuunnittelu
References: Liikenne
type: YKL-luokka
alternative label: Haaksirikot, liikennelainsäädäntö (33.45)
alternative label: Ilmaliikennelainsäädäntö (33.45)
alternative label: Lentoliikennelainsäädäntö (33.45)
alternative label: Liikennelainsäädäntö (33.45)
alternative label: Lufttrafik, lagstiftning (33.45) @sv
alternative label: Merenkulkulainsäädäntö (33.45)
alternative label: Merioikeus (33.45)
alternative label: Sjöfartslagstiftning (33.45) @sv
alternative label: Sjörätt (33.45) @sv
alternative label: Sjötrafik, lagstiftning (33.45) @sv
alternative label: Skeppsbrott, trafiklagstiftning (33.45) @sv
alternative label: Tieliikennelainsäädäntö (33.45)
alternative label: Trafiklagstiftning (33.45) @sv
alternative label: Vesiliikenne, lainsäädäntö (33.45)
alternative label: Vägtrafiklagstiftning (33.45) @sv
broader: Talousoikeus
in scheme: YKL - Yleisten kirjastojen luokitusjärjestelmä
notation: 33.45
preferred label: Traffic legislation @en
preferred label: Trafiklagstiftning @sv
scope note: Hit allmänna verk om trafiklagstiftning Lagstiftning om väg-, luft- och vattentrafik Sjöfartslagstiftning @sv
scope note: Tähän liikennelainsäädännön yleisteokset Tie-, lento- ja vesiliikennelainsäädäntö Merenkulkulainsäädäntö

Rikosoikeus
type: Concept
References: Kriminologia. Kriminaalisosiologia
References: Prosessioikeus. Oikeushallinto
References: Poliisitoimi. Yleinen turvallisuus
alternative label: Alkoholbrott, straffrätt (33.5) @sv
alternative label: Alkoholirikokset, rikosoikeus (33.5)
alternative label: Atk-rikokset, rikosoikeus (33.5)
alternative label: Bluff, straffrätt (33.5) @sv
alternative label: Brott mot liv, straffrätt (33.5) @sv
alternative label: Brott, straffrätt (33.5) @sv
alternative label: Crackare, straffrätt (33.5) @sv
alternative label: Databrott, straffrätt (33.5) @sv
alternative label: Datavirus, straffrätt (33.5) @sv
alternative label: Dråp, straffrätt (33.5) @sv
alternative label: Egendomsbrott, straffrätt (33.5) @sv
alternative label: Ekonomiska brott, straffrätt (33.5) @sv
alternative label: Grå ekonomi, straffrätt (33.5) @sv
alternative label: Hackare, straffrätt (33.5) @sv
alternative label: Haittaohjelmat, rikosoikeus (33.5)
alternative label: Hakkerointi, rikosoikeus (33.5)
alternative label: Harmaa talous, rikosoikeus (33.5)
alternative label: Hatbrott, straffrätt (33.5) @sv
alternative label: Henkirikokset, rikosoikeus (33.5)
alternative label: Huijaus, rikosoikeus (33.5)
alternative label: Huumerikokset, rikosoikeus (33.5)
alternative label: Ihmiskauppa, rikosoikeus (33.5)
alternative label: Ihmisryöstöt, rikosoikeus (33.5)
alternative label: Ihmissalakuljetus, rikosoikeus (33.5)
alternative label: Informations- och kommunikationsbrott, straffrätt (33.5) @sv
alternative label: Itsepuolustus, lainsäädäntö (33.5)
alternative label: Kidnappningar, straffrätt (33.5) @sv
alternative label: Konkursbrott, straffrätt (33.5) @sv
alternative label: Konkurssirikokset, rikosoikeus (33.5)
alternative label: Koppleri, straffrätt (33.5) @sv
alternative label: Krakkerointi, rikosoikeus (33.5)
alternative label: Krigsförbrytelser, straffrätt (33.5) @sv
alternative label: Kringgående av skatt, straffrätt (33.5) @sv
alternative label: Kunnianloukkaus, rikosoikeus (33.5)
alternative label: Kvinnohandel, straffrätt (33.5) @sv
alternative label: Landsförräderi, straffrätt (33.5) @sv
alternative label: Liikennerikokset, rikosoikeus (33.5)
alternative label: Maanpetos, rikosoikeus (33.5)
alternative label: Militära brott, straffrätt (33.5) @sv
alternative label: Miljöbrott, straffrätt (33.5) @sv
alternative label: Murhat, rikosoikeus (33.5)
alternative label: Naiskauppa, rikosoikeus (33.5)
alternative label: Omaisuusrikokset, rikosoikeus (33.5)
alternative label: Paritus, rikosoikeus (33.5)
alternative label: Pedofilia, rikosoikeus (33.5)
alternative label: Pimeä työ, rikosoikeus (33.5)
alternative label: Raiskaukset, rikosoikeus (33.5)
alternative label: Raiskaus, rikosoikeus (33.5)
alternative label: Rattijuoppous, lainsäädäntö (33.5)
alternative label: Rikokset, rikosoikeus (33.5)
alternative label: Rikosoikeus (33.5)
alternative label: Salakuljetus, rikosoikeus (33.5)
alternative label: Seksuaalinen hyväksikäyttö, rikosoikeus (33.5)
alternative label: Seksuaalirikokset, rikosoikeus (33.5)
alternative label: Sotarikokset, rikosoikeus (33.5)
alternative label: Sotilasrikokset, rikosoikeus (33.5)
alternative label: Sukupuolinen häirintä, rikosoikeus (33.5)
alternative label: Talousrikokset, rikosoikeus (33.5)
alternative label: Tappo, rikosoikeus (33.5)
alternative label: Tieliikennerikokset, rikosoikeus (33.5)
alternative label: Tieto- ja viestintärikokset, rikosoikeus (33.5)
alternative label: Tietokonevirukset, rikosoikeus (33.5)
alternative label: Tietotekniikkarikokset, rikosoikeus (33.5)
alternative label: Varkaudet, rikosoikeus (33.5)
alternative label: Veronkierto, rikosoikeus (33.5)
alternative label: Verorikokset, rikosoikeus (33.5)
alternative label: Viharikokset, rikosoikeus (33.5)
alternative label: Virkarikokset, rikosoikeus (33.5)
alternative label: Väkivaltarikokset, rikosoikeus (33.5)
alternative label: Ympäristörikokset, rikosoikeus (33.5)
broader: OIKEUSTIEDE
in scheme: YKL - Yleisten kirjastojen luokitusjärjestelmä
narrower: Kriminaalipolitiikka. Vankeinhoito
notation: 33.5
scope note: Hit allmänna verk om straffrätt samt straffrätt som berör brott inom olika områden Alkohol-, egendoms-, hat-, miljö-, narkotika-, skatte-, tjänste-, trafik- och våldsbrott samt ekonomiska och militära brott och brott mot liv ur straffrättslig synvinkel @sv
scope note: Tähän sekä rikosoikeuden yleisteokset että eri alojen rikoksia koskeva rikosoikeus Alkoholi-, henki-, huume-, liikenne-, omaisuus-, sotilas-, talous-, vero-, viha-, virka-, väkivalta-, ympäristö- ym. rikokset rikosoikeuden kannalta

Kriminaalipolitiikka. Vankeinhoito
type: Concept
References: Kriminologia. Kriminaalisosiologia
References: Prosessioikeus. Oikeushallinto
References: Poliisitoimi. Yleinen turvallisuus
References: Sosiaalipalvelut
type: YKL-luokka
alternative label: Arbetsinrättningar (33.58) @sv
alternative label: Arbetskolonier (33.58) @sv
alternative label: Bestraffningspraxis (33.58) @sv
alternative label: Brottslighet, kriminalpolitik (33.58) @sv
alternative label: Brottspåföljder, kriminalpolitik (33.58) @sv
alternative label: Bötesstraff (33.58) @sv
alternative label: Centralfängelser (33.58) @sv
alternative label: Domar, verkställighet (33.58) @sv
alternative label: Dödsstraff, kriminalpolitik (33.58) @sv
alternative label: Frihetsstraff (33.58) @sv
alternative label: Fängelseadministration (33.58) @sv
alternative label: Fängelseförhållanden (33.58) @sv
alternative label: Fängelsepersonal (33.58) @sv
alternative label: Fängelser (33.58) @sv
alternative label: Fängelsesociologi (33.58) @sv
alternative label: Fängelsestadgar (33.58) @sv
alternative label: Fängelsestraff (33.58) @sv
alternative label: Fångar, fångvård (33.58) @sv
alternative label: Fångvård (33.58) @sv
alternative label: Keskusvankilat (33.58)
alternative label: Kriminaalihuolto, kriminaalipolitiikka (33.58)
alternative label: Kriminaalipolitiikka (33.58)
alternative label: Kriminalpolitik (33.58) @sv
alternative label: Kriminalvård, kriminalpolitik (33.58) @sv
alternative label: Kuolemanrangaistus, kriminaalipolitiikka (33.58)
alternative label: Kuritushuoneet (33.58)
alternative label: Nuorisorikollisuus, kriminaalipolitiikka (33.58)
alternative label: Pakkotyölaitokset (33.58)
alternative label: Penologi (33.58) @sv
alternative label: Penologia (33.58)
alternative label: Rangaistuskäytäntö (33.58)
alternative label: Rangaistusten täytäntöönpano (33.58)
alternative label: Rikollisuus, kriminaalipolitiikka (33.58)
alternative label: Rikosseuraamukset, kriminaalipolitiikka (33.58)
alternative label: Sakkorangaistus (33.58)
alternative label: Samhällspåföljder, kriminalpolitik (33.58) @sv
alternative label: Samhällstjänst, kriminalpolitik (33.58) @sv
alternative label: Straffverkställighet (33.58) @sv
alternative label: Tukthus (33.58) @sv
alternative label: Tuomiot, täytäntöönpano (33.58)
alternative label: Tvångsarbetsinrättningar (33.58) @sv
alternative label: Työlaitokset (33.58)
alternative label: Työsiirtolat (33.58)
alternative label: Ungdomsbrottslighet, kriminalpolitik (33.58) @sv
alternative label: Vangit, vankeinhoito (33.58)
alternative label: Vankeinhoito (33.58)
alternative label: Vankeusrangaistukset, kriminaalipolitiikka (33.58)
alternative label: Vankilahallinto (33.58)
alternative label: Vankilahenkilökunta (33.58)
alternative label: Vankilaolot (33.58)
alternative label: Vankilasosiologia (33.58)
alternative label: Vankilasäännökset (33.58)
alternative label: Vankilat (33.58)
alternative label: Vapausrangaistukset (33.58)
alternative label: Yhdyskuntapalvelu, kriminaalipolitiikka (33.58)
alternative label: Yhdyskuntaseuraamukset, kriminaalipolitiikka (33.58)
broader: Rikosoikeus
in scheme: YKL - Yleisten kirjastojen luokitusjärjestelmä
notation: 33.58
preferred label: Criminal policy. Prison administration @en
preferred label: Kriminalpolitik. Fångvård @sv
scope note: Rangaistusten täytäntöönpano Rangaistuskäytäntö. Penologia Vapausrangaistus. Sakkorangaistus Vankilat. Kuritushuoneet. Työlaitokset Vankilahallinto. Vankilahenkilökunta Vankilasäännökset. Vankilaolot. Vankilasosiologia
scope note: Verkställighet av straff Straffpraxis. Penologi Frihetsstraff. Bötesstraff Fängelser. Tukthus. Arbetsinrättningar Fängelseadministration. Fängelsepersonal Fängelsestadgar. Fängelseförhållanden. Fängelsesociologi @sv

Prosessioikeus. Oikeushallinto
type: Concept
References: Laki- ja säädöskokoelmat. Oikeustapauskokoelmat
References: Julkis- ja hallinto-oikeus
References: Kriminaalipolitiikka. Vankeinhoito
References: Poliisitoimi. Yleinen turvallisuus
type: YKL-luokka
alternative label: Advokatverksamhet, juridik (33.6) @sv
alternative label: Armahdus, oikeustiede (33.6)
alternative label: Asianajotoimi, oikeustiede (33.6)
alternative label: Benådning, juridik (33.6) @sv
alternative label: Bevisrätt (33.6) @sv
alternative label: Civilprocessrätt (33.6) @sv
alternative label: Domar, juridik (33.6) @sv
alternative label: Domstolar (33.6) @sv
alternative label: Domstolväsen (33.6) @sv
alternative label: Eduskunnan oikeusasiamies (33.6)
alternative label: Esitutkintalaki (33.6)
alternative label: Forum, domstolar (33.6) @sv
alternative label: Fri rättegång (33.6) @sv
alternative label: Förlikning, processrätt (33.6) @sv
alternative label: Förundersökningslagen (33.6) @sv
alternative label: Hovioikeudet (33.6)
alternative label: Hovrätter (33.6) @sv
alternative label: Häradsrätter (33.6) @sv
alternative label: Högsta domstolen (33.6) @sv
alternative label: Justitieförvaltning (33.6) @sv
alternative label: Justitiekanslersämbete (33.6) @sv
alternative label: Kihlakunnanoikeudet (33.6)
alternative label: Korkein oikeus (33.6)
alternative label: Käräjäoikeudet (33.6)
alternative label: Lainkäyttö, prosessioikeus (33.6)
alternative label: Maksuton oikeudenkäynti (33.6)
alternative label: Muutoksenhaku, prosessioikeus (33.6)
alternative label: Oikeudenkäynti (33.6)
alternative label: Oikeusapu (33.6)
alternative label: Oikeushallinto (33.6)
alternative label: Oikeuskanslerintoimi (33.6)
alternative label: Oikeuspaikat (33.6)
alternative label: Processrätt (33.6) @sv
alternative label: Prosessioikeus (33.6)
alternative label: Raastuvanoikeudet (33.6)
alternative label: Rikosprosessioikeus (33.6)
alternative label: Riksdagens justitieombudsman (33.6) @sv
alternative label: Rättegång (33.6) @sv
alternative label: Rättshjälp (33.6) @sv
alternative label: Rättskipning, processrätt (33.6) @sv
alternative label: Rådstuvurätter (33.6) @sv
alternative label: Salassapitovelvollisuus, lakimiehen työ (33.6)
alternative label: Sekretess, juristens arbete (33.6) @sv
alternative label: Siviiliprosessioikeus (33.6)
alternative label: Skiljeförfarande (33.6) @sv
alternative label: Sovittelu, prosessioikeus (33.6)
alternative label: Straffprocessrätt (33.6) @sv
alternative label: Syyteoikeus (33.6)
alternative label: Syyttäjäntoimi (33.6)
alternative label: Tingsrätter (33.6) @sv
alternative label: Todistusoikeus (33.6)
alternative label: Tuomioistuimet (33.6)
alternative label: Tuomioistuinlaitos (33.6)
alternative label: Tuomiot, oikeustiede (33.6)
alternative label: Tystnadsplikt, juristens arbete (33.6) @sv
alternative label: Vaitiolovelvollisuus, lakimiehen työ (33.6)
alternative label: Välimiesmenettely (33.6)
alternative label: Ändringssökande, processrätt (33.6) @sv
alternative label: Åklagarväsen (33.6) @sv
alternative label: Åtalsrätt (33.6) @sv
broader: OIKEUSTIEDE
in scheme: YKL - Yleisten kirjastojen luokitusjärjestelmä
narrower: Ulosotto- ja konkurssilainsäädäntö
notation: 33.6
preferred label: Law of procedure. Judicial administration @en
preferred label: Processrätt. Justitieförvaltning @sv
scope note: Civil- och straffprocessrätt. Domstolsväsen. Domstolar Underrrätter. Tingsrätter. Hovrätter. Högsta domstolen Rådstuvurätter. Häradsrätter Justitiekansler. Riksdagens justitieombudsman Advokatväsen. Åklagare. Rättegång Bevisföring. Fri rättegång. Rättshjälp Skiljemannaförfarande. Sökande av ändring. Förlikning Förundersökningslagen @sv
scope note: Siviili- ja rikosprosessioikeus Tuomioistuinlaitos. Tuomioistuimet. Oikeuspaikat Alioikeudet. Käräjäoikeudet. Hovioikeudet. Korkein oikeus Raastuvanoikeudet. Kihlakunnanoikeudet Oikeuskansleri. Eduskunnan oikeusasiamies Asianajotoimi. Syyttäjät. Oikeudenkäynti Todistusoikeus Maksuton oikeudenkäynti. Oikeusapu Välimiesmenettely. Muutoksenhaku. Sovittelu Esitutkintalaki

Ulosotto- ja konkurssilainsäädäntö
type: Concept
References: Rikosoikeus
References: Poliisitoimi. Yleinen turvallisuus
References: Elintaso. Kulutus
References: Liiketalous
type: YKL-luokka
alternative label: Bankrutter, konkursrätt (33.62) @sv
alternative label: Beslag, lagstiftning (33.62) @sv
alternative label: Exekutionslagstiftning (33.62) @sv
alternative label: Företagssanering, saneringslagstiftning (33.62) @sv
alternative label: Indrivningslagstiftning (33.62) @sv
alternative label: Insolvensrätt (33.62) @sv
alternative label: Insolvenssioikeus (33.62)
alternative label: Konkursförfarande (33.62) @sv
alternative label: Konkurslagstiftning (33.62) @sv
alternative label: Konkurssilainsäädäntö (33.62)
alternative label: Konkurssimenettely (33.62)
alternative label: Perintälainsäädäntö (33.62)
alternative label: Saneerauslainsäädäntö, velkasaneeraus (33.62)
alternative label: Saneerauslainsäädäntö, yrityssaneeraus (33.62)
alternative label: Saneringslagstiftning, företagssanering (33.62) @sv
alternative label: Saneringslagstiftning, skuldsanering (33.62) @sv
alternative label: Skuldsanering, lagstiftning (33.62) @sv
alternative label: Takavarikko, lainsäädäntö (33.62)
alternative label: Ulosottolainsäädäntö (33.62)
alternative label: Vararikot, konkurssioikeus (33.62)
alternative label: Velkajärjestely, lainsäädäntö (33.62)
alternative label: Velkasaneeraus, lainsäädäntö (33.62)
alternative label: Yrityssaneeraus, saneerauslainsäädäntö (33.62)
broader: Prosessioikeus. Oikeushallinto
in scheme: YKL - Yleisten kirjastojen luokitusjärjestelmä
notation: 33.62
preferred label: Execution and bankruptcy legislation @en
preferred label: Utsöknings- och konkurslagstiftning @sv

ALUESUUNNITTELU. ALUEPOLITIIKKA
type: Concept
References: Alueellinen sosiologia
References: Väestötiede. Väestöpolitiikka
References: Julkis- ja hallinto-oikeus
References: Talousoikeus
References: Maa- ja metsätalouslainsäädäntö
References: Valtion alue- ja paikallishallinto. Maakuntahallinto
References: Kunnallishallinto. Paikallishallinto
References: Talouspolitiikka. Taloudelliset rakenteet
References: Maa. Kiinteistöt. Tontit
References: SOSIAALIPOLITIIKKA
References: KASVATUS. OPETUS. KASVATUSTIEDE
References: Ympäristönsuojelu. Luonnonsuojelu
References: Maatalouspolitiikka
References: ARKKITEHTUURI
alternative label: Aluekehitys (34+)
alternative label: Aluepolitiikka (34+)
alternative label: Aluesuunnittelu (34+)
alternative label: Aluetiede (34+)
alternative label: Arkitektur, regionplanering (34+) @sv
alternative label: Arkkitehtuuri, aluesuunnittelu (34+)
alternative label: Arrende, markpolitik (34+) @sv
alternative label: Asutuspolitiikka (34+)
alternative label: Asutustilat, asutuspolitiikka (34+)
alternative label: Bosättningspolitik (34+) @sv
alternative label: Byggnadskonst, regionplanering (34+) @sv
alternative label: Centralisering, regionalpolitik (34+) @sv
alternative label: Centralisering, regionplanering (34+) @sv
alternative label: Centralområdessystem, regionplanering (34+) @sv
alternative label: EU, aluepolitiikka (34+)
alternative label: EU, regionalpolitik (34+) @sv
alternative label: Euroopan unioni, aluepolitiikka (34+)
alternative label: Europeiska unionen, regionalpolitik (34+) @sv
alternative label: Geografi, planeringsgeografi (34+) @sv
alternative label: Glesbebyggelse, regionplanering (34+) @sv
alternative label: Haja-asutus, aluesuunnittelu (34+)
alternative label: Hajautus, aluepolitiikka (34+)
alternative label: Influensområdessystem, regionplanering (34+) @sv
alternative label: Jakolaitos, maapolitiikka (34+)
alternative label: Jordförvärv, regionplanering och -politik (34+) @sv
alternative label: Jordägande, regionplanering och -politik (34+) @sv
alternative label: Kaavoitus, aluesuunnittelu (34+)
alternative label: Kaupunkipolitiikka (34+)
alternative label: Keskittäminen, aluepolitiikka (34+)
alternative label: Keskusaluejärjestelmät, aluesuunnittelu (34+)
alternative label: Kolonationslägenheter, kolonisationspolitik (34+) @sv
alternative label: Kompetenscentra, regionalpolitik (34+) @sv
alternative label: Landsbygdspolitik (34+) @sv
alternative label: Maanhankinta, aluesuunnittelu ja -politiikka (34+)
alternative label: Maankäyttö, aluesuunnittelu ja -politiikka (34+)
alternative label: Maanomistus, aluesuunnittelu ja -politiikka (34+)
alternative label: Maantiede, suunnittelumaantiede (34+)
alternative label: Maanvuokra, maapolitiikka (34+)
alternative label: Maapolitiikka, aluesuunnittelu ja -politiikka (34+)
alternative label: Maaseutupolitiikka (34+)
alternative label: Markanvändning, regionplanering och -politik (34+) @sv
alternative label: Markpolitik, regionplanering och -politik (34+) @sv
alternative label: Miljöpolitik (34+) @sv
alternative label: Miljöpolitik, kommuner (34+) @sv
alternative label: Miljöpolitik, statliga verken (34+) @sv
alternative label: Osaamiskeskukset, aluepolitiikka (34+)
alternative label: Planeringsgeografi (34+) @sv
alternative label: Planläggning, regionplanering (34+) @sv
alternative label: Rakennustaide, aluesuunnittelu (34+)
alternative label: Regional planering (34+) @sv
alternative label: Suunnittelumaantiede (34+)
alternative label: Toimintojen hajauttaminen, aluesuunnittelu (34+)
alternative label: Toimintojen keskittäminen, aluesuunnittelu (34+)
alternative label: Vaikutusaluejärjestelmät, aluesuunnittelu (34+)
alternative label: Ympäristöpolitiikka (34+)
alternative label: Ympäristöpolitiikka, kunnat (34+)
alternative label: Ympäristöpolitikka, valtion laitokset (34+)
broader: YHTEISKUNTA
in scheme: YKL - Yleisten kirjastojen luokitusjärjestelmä
narrower: Valtakunnallinen suunnittelu
narrower: Seutusuunnittelu
narrower: Yhdyskuntasuunnittelu. Kaupunkisuunnittelu. Ympäristönsuunnittelu
notation: 34
scope note: Hit allmänna verk om regionplanering och regionalpolitik Hit och till underklasserna också markpolitik samt regionplanerings- och regionalpolitiska aspekter på jordägoförhållanden och jordanskaffning Hit och till underklasserna också planläggning Hit och till underklasserna också miljöpolitik samt tjänster och behov av tjänster ur regionplaneringens och regionalpolitikens synvinkel Hit och till underklasserna också bosättningspolitik Hit och till underklasserna också planeringsgeografi och regionalvetenskap samt systemet med centralorter och influensområden Om verket behandlar ett enskilt samhälleligt spörsmål ur regionplaneringens eller regionalpolitikens synvinkel, ges företräde åt klassificering enligt område Om verket behandlar regionplanering eller regionalpolitik samt arkitektur, ges företräde åt klass 34+ @sv
scope note: Tähän aluesuunnittelun ja aluepolitiikan yleisteokset Tähän ja alaluokkiin myös maapolitiikka sekä maanomistusolot ja maanhankinta aluesuunnittelun ja aluepolitiikan kannalta Tähän ja alaluokkiin myös kaavoitus Tähän ja alaluokkiin myös ympäristöpolitiikka sekä palvelut ja palvelutarpeet aluesuunnittelun ja aluepolitiikan kannalta Tähän ja alaluokkiin myös asutuspolitiikka Tähän ja alaluokkiin myös suunnittelumaantiede ja aluetiede sekä keskus- ja vaikutusaluejärjestelmät Jos teos koskee jotakin tiettyä yhteiskunnallista kysymystä aluesuunnittelun tai aluepolitiikan kannalta, annetaan etusija alan mukaiselle luokalle Jos teoksessa on sekä aluesuunnittelua tai aluepolitiikkaa että arkkitehtuuria, annetaan etusija luokalle 34+

Valtakunnallinen suunnittelu
type: Concept
References: Alueellinen sosiologia
References: Talouspolitiikka. Taloudelliset rakenteet
References: Tuotanto. Tuottavuus
References: Työvoimapolitiikka
References: SOSIAALIPOLITIIKKA
type: YKL-luokka
alternative label: Kehitysaluepolitiikka, valtakunnansuunnittelu (34.1)
alternative label: Riksplanering (34.1) @sv
alternative label: Utvecklingsområdespolitik, riksplanering (34.1) @sv
alternative label: Valtakunnansuunnittelu (34.1)
broader: ALUESUUNNITTELU. ALUEPOLITIIKKA
in scheme: YKL - Yleisten kirjastojen luokitusjärjestelmä
notation: 34.1
preferred label: National planning @en
preferred label: Riksplanering @sv
scope note: Allmänna verk om riksomfattande regional- och miljöpolitik samt om utvecklingsområdespolitik Förläggning av samhällets funktioner i olika delar av riket Koncentration av funktionerna. Utlokalisering av funktionerna Planering och utveckling av samverkan mellan städer och landsbygd Centralorterna och deras influensområden på riksnivå @sv
scope note: Valtakunnallisen alue- ja ympäristöpolitiikan sekä kehitysaluepolitiikan yleisteokset Yhteiskunnan toimintojen sijoittaminen valtakunnan eri osiin Toimintojen keskittäminen. Toimintojen hajauttaminen Maaseudun ja kaupunkien välisten toimintasuhteiden suunnittelu ja kehittäminen Keskus- ja vaikutusalueet valtakunnan tasolla

Seutusuunnittelu
type: Concept
References: Valtion alue- ja paikallishallinto. Maakuntahallinto
References: Kuntien yhteistoiminta
type: YKL-luokka
alternative label: Ekonomiska regioner, regionplanering (34.2) @sv
alternative label: Etapplaner (34.2) @sv
alternative label: Gränstraktsarbete (34.2) @sv
alternative label: Kaavoitus, seutukaavat (34.2)
alternative label: Kehitysaluepolitiikka, seutusuunnittelu (34.2)
alternative label: Kommunalt samarbete, regionplanering (34.2) @sv
alternative label: Kommuner, samarbete, regionplanering (34.2) @sv
alternative label: Kunnat, yhteistoiminta, seutusuunnittelu (34.2)
alternative label: Kuntien yhteistoiminta, seutusuunnittelu (34.2)
alternative label: Landskap, regionplanering (34.2) @sv
alternative label: Landskapsplaner (34.2) @sv
alternative label: Län, regionplanering (34.2) @sv
alternative label: Länsplanering (34.2) @sv
alternative label: Lääninsuunnittelu (34.2)
alternative label: Läänit, aluesuunnittelu (34.2)
alternative label: Maakunnan suunnittelu (34.2)
alternative label: Maakunnat, aluesuunnittelu (34.2)
alternative label: Maakuntakaavat (34.2)
alternative label: Planläggning, regionplaner (34.2) @sv
alternative label: Rajaseututyö (34.2)
alternative label: Regionplaneförbund (34.2) @sv
alternative label: Regionplaner (34.2) @sv
alternative label: Regionplanering (34.2) @sv
alternative label: Regionplanering, landskap (34.2) @sv
alternative label: Regionplanläggning (34.2) @sv
alternative label: Seudullinen aluesuunnittelu (34.2)
alternative label: Seutukaavaliitot (34.2)
alternative label: Seutukaavat (34.2)
alternative label: Seutusuunnittelu (34.2)
alternative label: Talousalueet, seutusuunnittelu (34.2)
alternative label: Utvecklingsområdespolitik, regionplanering (34.2) @sv
alternative label: Vaihekaavat (34.2)
broader: ALUESUUNNITTELU. ALUEPOLITIIKKA
in scheme: YKL - Yleisten kirjastojen luokitusjärjestelmä
notation: 34.2
preferred label: Landskapsplanering. Länsplanering @sv
preferred label: Regional planning @en
scope note: Allmänna verk om regional- och miljöpolitik samt utvecklingsområdespolitik på landskapsnivå Regionplaneförbund. Regionplaner. Etapplaner Centralorter och deras influensområden på region- och landskapsnivå Hit också samarbete mellan kommuner och kommunalförbundens eller samkommunernas verksamhet med hänsyn till regionplanering @sv
scope note: Seudullisen alue- ja ympäristöpolitiikan sekä kehitysaluepolitiikan yleisteokset Seudullinen ja maakunnallinen aluesuunnittelu Seutukaavaliitot. Seutukaavat. Vaihekaavat Keskus- ja vaikutusalueet seudullisella ja maakunnallisella tasolla Tähän myös kuntien yhteistyö ja kuntainliittojen toiminta seutusuunnittelun kannalta

Yhdyskuntasuunnittelu. Kaupunkisuunnittelu. Ympäristönsuunnittelu
type: Concept
References: Kunnallishallinto. Paikallishallinto
References: Maa. Kiinteistöt. Tontit
References: Ympäristönsuojelu. Luonnonsuojelu
References: Rakennukset. Rakennustyypit
alternative label: Affärscentra, regionplanering (34.5) @sv
alternative label: Arkkitehtuuri, asemakaava-arkkitehtuuri (34.5+)
alternative label: Arkkitehtuuri, maisema-arkkitehtuuri (34.5+)
alternative label: Arkkitehtuuri, yhdyskuntasuunnittelu (34.5+)
alternative label: Arkkitehtuurikilpailut, asemakaava-arkkitehtuuri (34.5+)
alternative label: Arkkitehtuurikilpailut, maisema-arkkitehtuuri (34.5+)
alternative label: Arkkitehtuurikilpailut, yhdyskuntasuunnittelu (34.5+)
alternative label: Arkkitehtuuripiirustukset, asemakaavat (34.5+)
alternative label: Asemakaava-arkkitehtuuri (34.5+)
alternative label: Asemakaavaoppi (34.5+)
alternative label: Asemakaavat (34.5+)
alternative label: Detaljikaavat, asemakaavat (34.5+)
alternative label: Estetiikka, ympäristöestetiikka (34.5+)
alternative label: Huoltoalueet, aluesuunnittelu (34.5)
alternative label: Kaavoitus, asemakaavat (34.5+)
alternative label: Kaavoitus, ympäristönsuunnittelu (34.5+)
alternative label: Kaupungit, kaavoitus (34.5+)
alternative label: Kaupunkiarkkitehtuuri, kaupunkisuunnittelu (34.5+)
alternative label: Kaupunkiseudut, suunnittelu (34.5+)
alternative label: Kaupunkisuunnittelu (34.5+)
alternative label: Kaupunkiympäristö, suojelu (34.5+)
alternative label: Keskustat, kaupunkisuunnittelu (34.5)
alternative label: Kulttuurimaisema, suojelu (34.5+)
alternative label: Kulttuurimaisema, suunnittelu (34.5+)
alternative label: Kulttuuriperintö, kaupunkisuunnittelu (34.509)
alternative label: Kulttuuriympäristöt, ympäristönsuunnittelu (34.5+)
alternative label: Kuntasuunnittelu, maankäytön kannalta (34.5+)
alternative label: Kyläsuunnittelu (34.5+)
alternative label: Liikekeskukset, aluesuunnittelu (34.5)
alternative label: Maankäyttö, kunnat ja kaupungit (34.5+)
alternative label: Maankäyttö, ympäristönsuunnittelu (34.5+)
alternative label: Maisema-arkkitehtuuri (34.5+)
alternative label: Maisemasuunnittelu (34.5+)
alternative label: Miljöösuunnittelu (34.5+)
alternative label: Modernisaatio, yhdyskuntasuunnittelu (34.5)
alternative label: Opetusalueet, aluesuunnittelu (34.5)
alternative label: Osayleiskaavat (34.5+)
alternative label: Perinnemaisema, suojelu (34.5+)
alternative label: Perinnemaisema, suunnittelu (34.5+)
alternative label: Piirustus, asemakaavat (34.5+)
alternative label: Pääkaupunkiseutu, kaupunkisuunnittelu (34.5+)
alternative label: Rakennuskaavat (34.5+)
alternative label: Rakennustaide, asemakaava-arkkitehtuuri (34.5+)
alternative label: Rakennustaide, maisema-arkkitehtuuri (34.5+)
alternative label: Rakennustaide, yhdyskuntasuunnittelu (34.5+)
alternative label: Rantakaavat (34.5+)
alternative label: Rantojensuojelu, kaavoitus (34.5+)
alternative label: Sairaala-alueet, aluesuunnittelu (34.5)
alternative label: Saneeraus, yhdyskuntasuunnittelu (34.5+)
alternative label: Taajamat, kaavoitus (34.5+)
alternative label: Taajamat, yhdyskuntasuunnittelu (34.5+)
alternative label: Taajamat, ympäristönsuunnittelu (34.5+)
alternative label: Teollisuusalueet, aluesuunnittelu (34.5)
alternative label: Teollisuusyhdyskunnat, yhdyskuntasuunnittelu (34.5+)
alternative label: Tila, ympäristönsuunnittelu (34.5+)
alternative label: Tontit, yhdyskuntasuunnittelu (34.5+)
alternative label: Tonttipolitiikka (34.5+)
alternative label: Varastoalueet, aluesuunnittelu (34.5)
alternative label: Yhdyskuntapolitiikka (34.5+)
alternative label: Yhdyskuntasuunnittelu (34.5+)
alternative label: Yleiskaavat (34.5+)
alternative label: Yliopistoalueet, aluesuunnittelu (34.5)
alternative label: Ympäristöestetiikka (34.5+)
alternative label: Ympäristönsuunnittelu (34.5+)
alternative label: Ympäristöpsykologia (34.5+)
alternative label: Äänimaisema, ympäristösuunnittelu (34.5+)
alternative label: Ääniympäristö, ympäristönsuunnittelu (34.5+)
broader: ALUESUUNNITTELU. ALUEPOLITIIKKA
in scheme: YKL - Yleisten kirjastojen luokitusjärjestelmä
narrower: Asuinalueiden suunnittelu
narrower: Liikennesuunnittelu
narrower: Viheralueiden suunnittelu
notation: 34.5
scope note: Hit och till underklasserna också planering av markanvändning i kommuner och städer samt landskapsarkitektur Hit och till underklasserna också planering av stadsregioner Hit och till underklasserna också kommunernas och städernas områdes-, miljö-, mark- och tomtpolitik Hit och till underklasserna också kommunernas och städernas generalplaner, delgeneralplaner, stadsplaner, byggnadsplanen och strandplaner Hit och till underklasserna också stads-, landskaps- och stadsplanearkitektur samt stadsplanelära Hit och till underklasserna också miljöpsykologi och miljöestetik Hit också landskapsskydd Hit kommunernas och städernas centra och affärscentra samt industri-, lager-, service-, sjukhus-, undervisnings- och universitetsområden och planeringen av dem Om verket behandlar samhällsplanering eller stadsplanering samt arkitektur, ges företräde åt klass 34.5+ Om verket innehåller skydd av både kultur- och naturlandskap, ges företräde åt klass 50.1+ @sv
scope note: Tähän ja alaluokkiin myös kuntien ja kaupunkien alue- ja maankäytön suunnittelu sekä maisemasuunnittelu Tähän ja alaluokkiin myös kaupunkiseutujen suunnittelu Tähän ja alaluokkiin myös kuntien ja kaupunkien alue-, yhdyskunta-, ympäristö-, maa- ja tonttipolitiikka Tähän ja alaluokkiin myös kuntien ja kaupunkien yleiskaavat, osayleiskaavat, asemakaavat, rakennuskaavat ja rantakaavat Tähän ja alaluokkiin myös kaupunki-, maisema- ja asemakaava-arkkitehtuuri sekä asemakaavaoppi Tähän ja alaluokkiin myös ympäristöpsykologia ja ympäristöestetiikka Tähän ja alaluokkiin myös kulttuurimaiseman suojelu Tähän kuntien ja kaupunkien keskustat ja liikekeskukset sekä teollisuus-, varasto-, huolto-, sairaala-, opetus-ja yliopistoalueet ja niiden suunnittelu Jos teoksessa on sekä yhdyskunta- tai kaupunki-suunnittelua että arkkitehtuuria, annetaan etusija luokalle 34.5+ Jos teoksessa on sekä kulttuuri- että luonnonmaiseman suojelua, annetaan etusija luokalle 50.1+

Asuinalueiden suunnittelu
type: Concept
References: Liikennesuunnittelu
References: Asuntopolitiikka
References: Asuinrakennukset
type: YKL-luokka
alternative label: Asuinalueet, suunnittelu (34.52)
alternative label: Bostadsområden, planering (34.52) @sv
alternative label: Esikaupungit, aluesuunnittelu (34.52)
alternative label: Förorter, stadsplanering (34.52) @sv
alternative label: Förstäder, regionplanering (34.52) @sv
alternative label: Loma-asuntoalueet, aluesuunnittelu (34.52)
alternative label: Lähiöt, kaupunkisuunnittelu (34.52)
alternative label: Semesterbostäder, regionplanering (34.52) @sv
broader: Yhdyskuntasuunnittelu. Kaupunkisuunnittelu. Ympäristönsuunnittelu
in scheme: YKL - Yleisten kirjastojen luokitusjärjestelmä
notation: 34.52
preferred label: Housing area planning @en
preferred label: Planering av bostadsområden @sv
scope note: Förorter, förstäder och områden för fritidsbebyggelse samt planeringen av dem Hit också planering av bostadsområdenas servicestruktur Hit också miljöplanering och miljöpolitik som berör bostadsområden @sv
scope note: Lähiöt, esikaupungit ja loma-asuntoalueet sekä niiden suunnittelu Tähän myös asuinalueiden palvelurakenteen suunnittelu Tähän myös asuinalueita koskeva ympäristönsuunnittelu ja ympäristöpolitiikka

Liikennesuunnittelu
type: Concept
References: Tienrakennus
References: Vesirakennus
References: Liikenne
References: Rakennukset. Rakennustyypit
alternative label: Asema-alueet, liikennesuunnittelu (34.56)
alternative label: Autoliikenne, liikennesuunnittelu (34.56)
alternative label: Autot, liikennesuunnittelu (34.56)
alternative label: Bilar, trafikplanering (34.56) @sv
alternative label: Biltrafik, trafikplanering (34.56) @sv
alternative label: Bussiliikenne, liikennesuunnittelu (34.56)
alternative label: Busstrafik, trafikplanering (34.56) @sv
alternative label: Båttrafik, trafikplanering (34.56) @sv
alternative label: Cykelvägar, trafikplanering (34.56) @sv
alternative label: Cyklar, trafikplanering (34.56) @sv
alternative label: Fartygstrafik, trafikplanering (34.56) @sv
alternative label: Flygfält, trafikplanering (34.56) @sv
alternative label: Flygtrafik, trafikplanering (34.56) @sv
alternative label: Fotgängarområden, trafikplanering (34.56) @sv
alternative label: Gator, trafikplanering (34.56) @sv
alternative label: Gatutrafik, trafikplanering (34.56) @sv
alternative label: Godstrafik, trafikplanering (34.56) @sv
alternative label: Gågator, trafikplanering (34.56) @sv
alternative label: Hamnar, trafikplanering (34.56) @sv
alternative label: Hamnområden, planering (34.56) @sv
alternative label: Ilmaliikenne, liikennesuunnittelu (34.56)
alternative label: Inlandssjöfart, trafikplanering (34.56) @sv
alternative label: Jalankulkualueet, liikennesuunnittelu (34.56)
alternative label: Joukkoliikenne, liikennesuunnittelu (34.56)
alternative label: Julkinen liikenne, liikennesuunnittelu (34.56)
alternative label: Järnvägar, trafikplanering (34.56) @sv
alternative label: Järnvägsområden, trafikplanering (34.56) @sv
alternative label: Kadut, liikennesuunnittelu (34.56)
alternative label: Kanaler, trafikplanering (34.56) @sv
alternative label: Kanavat, liikennesuunnittelu (34.56)
alternative label: Katuliikenne, liikennesuunnittelu (34.56)
alternative label: Kaupunkiliikenne, liikennesuunnittelu (34.56)
alternative label: Kevyt liikenne, liikennesuunnittelu (34.56)
alternative label: Kollektivtrafik, trafikplanering (34.56) @sv
alternative label: Kävelykadut, liikennesuunnittelu (34.56)
alternative label: Laivaliikenne, liikennesuunnittelu (34.56)
alternative label: Landsvägar, trafikplanering (34.56) @sv
alternative label: Lentokentät, liikennesuunnittelu (34.56)
alternative label: Lentoliikenne, liikennesuunnittelu (34.56)
alternative label: Liikennealueet, suunnittelu (34.56)
alternative label: Liikennesuunnittelu (34.56)
alternative label: Liikenneväylät, liikennesuunnittelu (34.56)
alternative label: Linja-autoliikenne, liikennesuunnittelu (34.56)
alternative label: Maaliikenne, liikennesuunnittelu (34.56)
alternative label: Maaliikenneväylät, liikennesuunnittelu (34.56)
alternative label: Maantiet, liikennesuunnittelu (34.56)
alternative label: Metro, liikennesuunnittelu (34.56)
alternative label: Moottoriajoneuvoliikenne, liikennesuunnittelu (34.56)
alternative label: Moottoripyörät, liikennesuunnittelu (34.56)
alternative label: Moottoritiet, liikennesuunnittelu (34.56)
alternative label: Paikallisliikenne, liikennesuunnittelu (34.56)
alternative label: Paikoitusalueet, liikennesuunnittelu (34.56)
alternative label: Polkupyörät, liikennesuunnittelu (34.56)
alternative label: Pysäköintialueet, liikennesuunnittelu (34.56)
alternative label: Pyörätiet, liikennesuunnittelu (34.56)
alternative label: Rahtiliikenne, liikennesuunnittelu (34.56)
alternative label: Raideliikenne, liikennesuunnittelu (34.56)
alternative label: Raitiotiet, liikennesuunnittelu (34.56)
alternative label: Raskas liikenne, liikennesuunnittelu (34.56)
alternative label: Rautatiealueet, liikennesuunnittelu (34.56)
alternative label: Rautatiet, liikennesuunnittelu (34.56)
alternative label: Satama-alueet, suunnittelu (34.56)
alternative label: Satamat, liikennesuunnittelu (34.56)
alternative label: Sisävesiliikenne, liikennesuunnittelu (34.56)
alternative label: Tieliikenne, liikennesuunnittelu (34.56)
alternative label: Tiet, liikennesuunnittelu (34.56)
alternative label: Veneliikenne, liikennesuunnittelu (34.56)
alternative label: Vesiväylät, liikennesuunnittelu (34.56)
alternative label: Yksityisautoilu, liikennesuunnittelu (34.56)
alternative label: Ympäristönsuojelu, liikennesuunnittelu (34.56)
broader: Yhdyskuntasuunnittelu. Kaupunkisuunnittelu. Ympäristönsuunnittelu
in scheme: YKL - Yleisten kirjastojen luokitusjärjestelmä
notation: 34.56
scope note: Liikennealueet ja -väylät sekä niiden suunnittelu Tie-, katu- ja raideliikennealueet ja -väylät Jalankulku- ja pyöräilyalueet ja -väylät Paikoitus-, asema-, satama- ja lentokenttäalueet Tähän myös liikennesuunnittelua koskeva ympäristönsuunnittelu ja ympäristöpolitiikka
scope note: Trafikområden och trafikleder samt planering av dem Väg-, gatu- och spårtrafiksområden och -leder Fotgängar- och cykelområden och -vägar Parkerings-, stations-, hamn- och flygfältsområden Hit också miljöplanering och miljöpolitik som berör trafikplanering @sv

Viheralueiden suunnittelu
type: Concept
References: Asuinalueiden suunnittelu
References: Liikennesuunnittelu
References: Ympäristönsuojelu. Luonnonsuojelu
References: Uhanalaiset lajit. Luonnonsuojelualueet
References: URN:NBN:fi:au:ykl:57.062
References: Maanviljely. Puutarhanhoito. Hyötykasvit
References: Metsätalous
References: Rakennukset. Rakennustyypit
References: Liikunta. Urheilu
References: Voimistelu
References: Palloilu
References: Retkeily. Ulkoilu
References: Lentourheilu. Moottoriurheilu
References: Kuntoliikunta. Kuntourheilu
References: Muut urheilu- ja liikuntamuodot
alternative label: Arkitektur, trädgårdsarkitektur (34.57) @sv
alternative label: Arkkitehtuuri, puutarha-arkkitehtuuri (34.57)
alternative label: Begravningsplatser, planering (34.57) @sv
alternative label: Begravningstjänster, begravningsplatser (34.57) @sv
alternative label: Byggnadskonst, trädgårdsarkitektur (34.57) @sv
alternative label: Campingplatser, planering (34.57) @sv
alternative label: Friluftsområden, planering av grönområden (34.57) @sv
alternative label: Golfbanor, landskapsplanering (34.57) @sv
alternative label: Golfkentät, maisemasuunnittelu (34.57)
alternative label: Grönområden, planering (34.57) @sv
alternative label: Gårdar, samhällsplanering (34.57) @sv
alternative label: Gårdsplanering, samhällsplanering (34.57) @sv
alternative label: Hautausmaat, suunnittelu (34.57)
alternative label: Hautauspalvelut, hautausmaat (34.57)
alternative label: Idrottsområden, planering (34.57) @sv
alternative label: Idrottsplaner, landskapsplenering (34.57) @sv
alternative label: Keinonurmet, viheralueiden suunnittelu (34.57)
alternative label: Konstgräs, planering av grönområden (34.57) @sv
alternative label: Kulttuuriympäristöt, maisemansuojelu (34.57)
alternative label: Kulturmiljöer, landskapsskydd (34.57) @sv
alternative label: Landskapsgestaltning (34.57) @sv
alternative label: Landskapsskydd, kulturlandskap (34.57) @sv
alternative label: Landskapsvård (34.57) @sv
alternative label: Lantbruksområden, planering av grönområden (34.57) @sv
alternative label: Leikkipuistot, suunnittelu (34.57)
alternative label: Leirintäalueet, suunnittelu (34.57)
alternative label: Lekparker (34.57) @sv
alternative label: Luonnonalueet, viheralueiden suunnittelu (34.57)
alternative label: Maatalousalueet, viheralueiden suunnittelu (34.57)
alternative label: Maisemanhoito (34.57)
alternative label: Maisemansuojelu, kulttuurimaisema (34.57)
alternative label: Maisemointi (34.57)
alternative label: Naturområden, planering av grönområden (34.57) @sv
alternative label: Obebyggda områden, planering av grönområden (34.57) @sv
alternative label: Parker, planering av grönområden (34.57) @sv
alternative label: Pihasuunnittelu, yhdyskuntasuunnittelu (34.57)
alternative label: Pihat, yhdyskuntasuunnittelu (34.57)
alternative label: Puistot, viheralueiden suunnittelu (34.57)
alternative label: Puutarha-arkkitehtuuri, yhdyskuntasuunnittelu (34.57)
alternative label: Puutarhat, yhdyskuntasuunnittelu (34.57)
alternative label: Puutarhataide (34.57)
alternative label: Rakennustaide, puutarha-arkkitehtuuri (34.57)
alternative label: Rakentamattomat alueet, viheralueiden suunnittelu (34.57)
alternative label: Rekreationsområden, planering av grönområden (34.57) @sv
alternative label: Sportcentra, planering av idrottsområden (34.57) @sv
alternative label: Tekonurmet, viheralueiden suunnittelu (34.57)
alternative label: Trädgårdar, samhällsplanering (34.57) @sv
alternative label: Trädgårdsarkitektur, samhällsplanering (34.57) @sv
alternative label: Trädgårdskonst (34.57) @sv
alternative label: Ulkoilualueet, viheralueiden suunnittelu (34.57)
alternative label: Urheilualueet, suunnittelu (34.57)
alternative label: Urheilukentät, maisemasuunnittelu (34.57)
alternative label: Urheilukeskukset, urheilualueiden suunnittelu (34.57)
alternative label: Urnlundar, planering (34.57) @sv
alternative label: Uurnalehdot, suunnittelu (34.57)
alternative label: Vattendrag, användning för rekreationsändamål, planering (34.57) @sv
alternative label: Vesistöt, virkistyskäyttö, suunnittelu (34.57)
alternative label: Viheralueet, suunnittelu (34.57)
alternative label: Virkistysalueet, viheralueiden suunnittelu (34.57)
broader: Yhdyskuntasuunnittelu. Kaupunkisuunnittelu. Ympäristönsuunnittelu
in scheme: YKL - Yleisten kirjastojen luokitusjärjestelmä
notation: 34.57
scope note: Planering av parker, trädgårdar, gårdar och lekplatser ur samhällsplaneringens synvinkel Trädgårdsarkitektur ur samhällsplaneringens synvinkel Begravningsplatser och planering av dem Sport-, frilufts-, rekreations- och grönområden samt planering av dem Obebyggda områden samt natur- och lantbruksområden ur landskapsplaneringens synvinkel Lanskapsvård. Landskapsgestaltning Om verket innehåller både planering och skötsel av trädgårdar och gårdar, ges företräde åt klass 67.3+ @sv
scope note: Puistojen, puutarhojen, pihojen ja leikkikenttien suunnittelu yhdyskuntasuunnittelun kannalta Puutarha-arkkitehtuuri yhdyskuntasuunnittelun kannalta Hautausmaat ja niiden suunnittelu Urheilu-, ulkoilu-, virkistys- ja viheralueet sekä niiden suunnittelu Rakentamattomat alueet sekä luonnon- ja maatalousalueet maisemasuunnittelun kannalta Maisemanhoito. Maisemointi Jos teoksessa on sekä puutarhan tai pihan suunnittelua että hoitoa, annetaan etusija luokalle 67.3+

HALLINTO
type: Concept
References: Kirjastojen hallinto ja suunnittelu
References: Organisaatiososiologia
References: Valtiofilosofia. Poliittiset ideologiat
References: Poliittiset järjestelmät
References: Julkis- ja hallinto-oikeus
References: Yliopistot. Korkeakoulut
References: Koululaitos
References: MAANPUOLUSTUS
References: Liiketalous
References: Johtamisen tekniikka ja menetelmät
References: Henkilöstöpolitiikka
type: YKL-luokka
alternative label: Byrokratia, hallinto (35+)
alternative label: Byråkrati, förvaltning (35+) @sv
alternative label: Centralisering, förvaltning (35+) @sv
alternative label: Decentralisering, administration (35+) @sv
alternative label: Elektronisk kundtjänst, förvalning (35+) @sv
alternative label: Elinkeinoluvat (35+)
alternative label: Förvaltning (35+) @sv
alternative label: Förvaltning, offentlig förvaltning (35+) @sv
alternative label: Förvaltningssystem (35+) @sv
alternative label: Hajautus, hallinto (35+)
alternative label: Hallinto (35+)
alternative label: Hallinto, julkishallinto (35+)
alternative label: Hallintojärjestelmät (35+)
alternative label: Julkinen hallinto (35+)
alternative label: Julkiset palvelut (35+)
alternative label: Julkishallinto (35+)
alternative label: Keskittäminen, hallinto (35+)
alternative label: Näringstillstånd (35+) @sv
alternative label: Offentlig administration (35+) @sv
alternative label: Offentlig förvaltning (35+) @sv
alternative label: Offentlig service (35+) @sv
alternative label: Palvelumuotoilu, julkiset palvelut (35+)
alternative label: Palvelut, julkiset (35+)
alternative label: Rationalisering, administration (35+) @sv
alternative label: Rationalisointi, hallinto (35+)
alternative label: Salassapitovelvollisuus, hallinto (35+)
alternative label: Sekretess, förvaltning (35+) @sv
alternative label: Service design, offentlig service (35+) @sv
alternative label: Service, offentlig (35+) @sv
alternative label: Sähköinen asiointi, hallinto (35+)
alternative label: Tystnadsplikt, förvaltning (35+) @sv
alternative label: Vaitiolovelvollisuus, hallinto (35+)
alternative label: Verkkoasiointi, hallinto (35+)
alternative label: Webbkundtjänst, förvaltning (35+) @sv
broader: YHTEISKUNTA
in scheme: YKL - Yleisten kirjastojen luokitusjärjestelmä
narrower: Valtionhallinto
narrower: Kunnallishallinto. Paikallishallinto
narrower: Palo- ja pelastustoimi
narrower: Poliisitoimi. Yleinen turvallisuus
notation: 35
preferred label: ADMINISTRATION @en
preferred label: FÖRVALTNING @sv
scope note: Hit och till underklasserna allmänna verk om förvaltning och förvaltningssystem i olika länder Hit allmänna verk om offentlig förvaltning Hit också allmänna verk om både stats- och kommunalförvaltningens organisation, byråkrati, förvaltningsorgan och tjänster Om verket domineras av antingen stats- eller kommunalförvaltning, ges företräde åt klasserna 35.1+ och 35.4 Administrativa frågor inom specialområden klassificeras enligt område @sv
scope note: Tähän ja alaluokkiin eri maiden hallintoa tai hallintojärjestelmiä koskevat yleisteokset Tähän julkisen hallinnon yleisteokset Tähän myös yleisteokset, jotka koskevat sekä valtion- että kunnallishallinnon organisaatiota, byrokratiaa, hallintoelimiä tai palveluja Jos teos kuitenkin painottuu joko valtion- tai kunnallishallintoon, annetaan etusija luokille 35.1+ ja 35.4+ Erikoisalojen hallinnolliset kysymykset luokitetaan alan mukaan

Valtionhallinto
type: Concept
References: Julkis- ja hallinto-oikeus
References: Julkinen talous. Finanssioppi
References: Johtamisen tekniikka ja menetelmät
References: Henkilöstöpolitiikka
type: YKL-luokka
alternative label: Förvaltning, statlig (35.1+) @sv
alternative label: Hallinto, valtiollinen (35.1+)
alternative label: Julkiset palvelut, valtion (35.1+)
alternative label: Offentlig service, staten (35.1+) @sv
alternative label: Palvelut, valtiolliset (35.1+)
alternative label: Service, statlig (35.1+) @sv
alternative label: Statsförvaltning (35.1+) @sv
alternative label: Valtionhallinto (35.1+)
broader: HALLINTO
in scheme: YKL - Yleisten kirjastojen luokitusjärjestelmä
narrower: Keskushallinto
narrower: Valtion alue- ja paikallishallinto. Maakuntahallinto
notation: 35.1
preferred label: State administration @en
preferred label: Statsförvaltning @sv
scope note: Hit och till underklasserna allmänna verk om statsförvaltningens organisation, byråkrati, förvaltningsorgan och tjänster Verk om specialområden inom ramen för statsförvaltningen klassificeras enligt område Statskalendrar 35.1053 @sv
scope note: Tähän ja alaluokkiin valtionhallinnon organisaatiota, byrokratiaa, hallintoelimiä tai palveluja koskevat yleisteokset Teokset, jotka koskevat valtionhallinnon piiriin kuuluvia erikoisaloja, luokitetaan alan mukaan Valtiokalenterit 35.1053

Keskushallinto
type: Concept
References: Poliittiset järjestelmät
References: Valtakunnallinen suunnittelu
References: Johtamisen tekniikka ja menetelmät
References: Henkilöstöpolitiikka
type: YKL-luokka
alternative label: Centrala ämbetsverk, förvaltning (35.11) @sv
alternative label: Centralförvaltning (35.11) @sv
alternative label: Forststyrelsen (35.11) @sv
alternative label: Keskushallinto (35.11)
alternative label: Keskusvirastot, hallinto (35.11)
alternative label: Metsähallitus (35.11)
alternative label: Ministerier (35.11) @sv
alternative label: Ministeriöt (35.11)
alternative label: Statlig centralförvaltning (35.11) @sv
alternative label: Statsrådet, förvaltning (35.11) @sv
alternative label: Valtion keskushallinto (35.11)
alternative label: Valtioneuvosto, hallinto (35.11)
broader: Valtionhallinto
in scheme: YKL - Yleisten kirjastojen luokitusjärjestelmä
notation: 35.11
preferred label: Central administration @en
preferred label: Centralförvaltning @sv
scope note: Allmänna verk om statens centralförvaltning Statsrådet. Ministerier. Statliga ämbetsverk i allmänhet @sv
scope note: Valtion keskushallintoa koskevat yleisteokset Valtioneuvosto. Ministeriöt. Valtion virastot yleensä

Valtion alue- ja paikallishallinto. Maakuntahallinto
type: Concept
type: YKL-luokka
alternative label: Aluehallinto, valtion (35.12)
alternative label: Aluehallintovirastot (35.12)
alternative label: Aluevaalit (35.12)
alternative label: Distriktsförvaltning (35.12) @sv
alternative label: ELY-centralerna (35.12) @sv
alternative label: ELY-keskukset (35.12)
alternative label: Elinkeino-, liikenne- ja ympäristökeskukset (35.12)
alternative label: Hyvinvointialueet, hallinto (35.12)
alternative label: Häradsbyråer (35.12) @sv
alternative label: Kihlakunnanvirastot (35.12)
alternative label: Landskap, förvaltning (35.12) @sv
alternative label: Landskapsförvaltning (35.12) @sv
alternative label: Lokalförvaltning, statens (35.12) @sv
alternative label: Län, förvaltning (35.12) @sv
alternative label: Länsindelning (35.12) @sv
alternative label: Länsstyrelser (35.12) @sv
alternative label: Lääninhallitukset (35.12)
alternative label: Lääninjako (35.12)
alternative label: Läänit, hallinto (35.12)
alternative label: Maakunnat, hallinto (35.12)
alternative label: Maakuntahallinto (35.12)
alternative label: Magistrater (35.12) @sv
alternative label: Maistraatit (35.12)
alternative label: Mellaninstansförvaltning (35.12) @sv
alternative label: Närings-, trafik- och miljöcentralerna (35.12) @sv
alternative label: Paikallishallinto, valtion (35.12)
alternative label: Piirihallinto (35.12)
alternative label: Regionalförvaltning, statens (35.12) @sv
alternative label: Regionförvaltningsverk (35.12) @sv
alternative label: Vaalit, aluevaalit (35.12)
alternative label: Val (samhälleliga händelser), välfärdsområdesval (35.2) @sv
alternative label: Välfärdsområden, förvaltning (35.12) @sv
alternative label: Välfärdsområdesval (35.12) @sv
alternative label: Väliportaan hallinto (35.12)
broader: Valtionhallinto
in scheme: YKL - Yleisten kirjastojen luokitusjärjestelmä
notation: 35.12
preferred label: Provincial administration @en
preferred label: Statens regional- och lokalförvaltning. Landskapsförvaltning @sv
scope note: Statens regional-, distrikts- och lokalförvaltning i allmänhet Landskapsförvaltning i allämänhet. Mellanstegsförvaltning i allmänhet Regionförvalningsverk. Häradsbyråer. Magistrater @sv
scope note: Valtion alue-, piiri- ja paikallishallinto yleensä Maakuntahallinto yleensä. Väliportaan hallinto yleensä Aluehallintovirastot. Kihlakunnanvirastot. Maistraatit

Kunnallishallinto. Paikallishallinto
type: Concept
References: Kirjastojen hallinto ja suunnittelu
References: YLEINEN KULTTUURIPOLITIIKKA
References: Kansalaistoiminta ja –aktivismi. Järjestötoiminta. Kokoustekniikka.
References: Kunnallisoikeus
References: Yhdyskuntasuunnittelu. Kaupunkisuunnittelu. Ympäristönsuunnittelu
References: Julkinen talous. Finanssioppi
References: SOSIAALIPOLITIIKKA
References: Asuntopolitiikka
References: Koululaitos
References: Nuorisotyö. Lapsityö
References: Yleinen terveydenhoito
References: Kunnallistekninen ympäristönhuolto
References: Johtamisen tekniikka ja menetelmät
References: Henkilöstöpolitiikka
alternative label: Bärkraftsklassificering, kommunernas (35.4) @sv
alternative label: Frikommuner, kommunalförvaltning (35.4+) @sv
alternative label: Förvaltning, kommunal (35.4+) @sv
alternative label: Hallinto, kunnallinen (35.4+)
alternative label: Huvudstadsregionen, kommunalförvaltning (35.4+) @sv
alternative label: Julkiset palvelut, kuntien (35.4+)
alternative label: Kantokykyluokitus, kuntien (35.4)
alternative label: Kauppalat, kunnallishallinto (35.4+)
alternative label: Kaupunginhallitukset (35.4)
alternative label: Kaupunginvaltuustot (35.4)
alternative label: Kaupungit, kunnallishallinto (35.4+)
alternative label: Kommunal byråkrati (35.4+) @sv
alternative label: Kommunal information (35.4+) @sv
alternative label: Kommunal organisation (35.4+) @sv
alternative label: Kommunala organ (35.4+) @sv
alternative label: Kommunalförvaltning (35.4+) @sv
alternative label: Kommunalpolitik (35.4+) @sv
alternative label: Kommunalt ledarskap (35.4) @sv
alternative label: Kommunalval (35.4) @sv
alternative label: Kommunalvetenskap (35.4+) @sv
alternative label: Kommundelsfullmäktige (35.4) @sv
alternative label: Kommuner, förvaltning (35.4+) @sv
alternative label: Kommunformer (35.4) @sv
alternative label: Kommunfullmäktige (35.4) @sv
alternative label: Kommunplanering (35.4+) @sv
alternative label: Kommunreform (35.4+) @sv
alternative label: Kommunstruktur (35.4+) @sv
alternative label: Kommunstyrelser (35.4) @sv
alternative label: Kunnallinen byrokratia (35.4+)
alternative label: Kunnallinen organisaatio (35.4+)
alternative label: Kunnallinen tiedottaminen (35.4+)
alternative label: Kunnalliset toimielimet (35.4+)
alternative label: Kunnallishallinto (35.4+)
alternative label: Kunnallispolitiikka (35.4+)
alternative label: Kunnallistiede (35.4+)
alternative label: Kunnallisvaalit (35.4)
alternative label: Kunnanhallitukset (35.4)
alternative label: Kunnanosavaltuustot (35.4)
alternative label: Kunnanvaltuustot (35.4)
alternative label: Kunnat, hallinto (35.4+)
alternative label: Kuntajohtaminen (35.4)
alternative label: Kuntamuodot (35.4)
alternative label: Kuntapolitiikka (35.4)
alternative label: Kuntarakenne (35.4+)
alternative label: Kuntasuunnittelu (35.4+)
alternative label: Kuntauudistus (35.4+)
alternative label: Kuntavaalit (35.4)
alternative label: Köpingar, kommunalförvaltning (35.4+) @sv
alternative label: Lautakunnat, kuntien (35.4)
alternative label: Lähidemokratia, kunnallishallinto (35.4+)
alternative label: Paikallishallinto, kunnat (35.4+)
alternative label: Paikallispolitiikka (35.4+)
alternative label: Palvelut, kunnalliset (35.4+)
alternative label: Politiikka, kunnallinen (35.4+)
alternative label: Pääkaupunkiseutu, kunnallishallinto (35.4+)
alternative label: Vaalikoneet, kunnalliset (35.4)
alternative label: Vaalit, kunnalliset (35.4)
alternative label: Vapaakunnat, kunnallishallinto (35.4+)
alternative label: Äänestäminen, kunnallisvaalit (35.4)
broader: HALLINTO
in scheme: YKL - Yleisten kirjastojen luokitusjärjestelmä
narrower: Kuntien yhteistoiminta
notation: 35.4
scope note: Hit allmänna verk om kommun- eller lokalförvaltningens organisation, byråkrati, förvaltningsorgan och tjänster Kommunplanering. Kommunformer Kommunalpolitik. Kommunalval Kommunfullmäktige. Kommunstyrelser. Nämnder Närdemokrati. Kommundelsfullmäktige Verk som rör specialområden inom kommunförvaltningen klassificeras enligt område Allmänna kommunala periodiska publikationer samt kommunplaner 35.405 Kommunalkalendrar 35.4053 @sv
scope note: Tähän kunnallis- tai paikallishallinnon organisaatiota, byrokratiaa, hallintoelimiä tai palveluja koskevat yleisteokset Kuntasuunnittelu. Kuntamuodot Kunnallispolitiikka. Kunnallisvaalit Kunnanvaltuustot. Kunnanhallitukset. Lautakunnat Lähidemokratia. Kunnanosavaltuustot Teokset, jotka koskevat kunnallishallinnon piiriin kuuluvia erikoisaloja, luokitetaan alan mukaan Yleiset kunnalliset kausijulkaisut sekä kuntasuunnitelmat 35.405 Kunnalliskalenterit 35.4053

Kuntien yhteistoiminta
type: Concept
References: Seutusuunnittelu
type: YKL-luokka
alternative label: Finlands kommunförbund (35.48) @sv
alternative label: Finlands stadsförbund (35.48) @sv
alternative label: Finlands svenska kommunförbund (35.48)
alternative label: Huvudstadsregionens samarbetsdelegation (35.48) @sv
alternative label: Kommunala centralorganisationer (35.48) @sv
alternative label: Kommunalförbund (35.48) @sv
alternative label: Kommunalt samarbete (35.48) @sv
alternative label: Kommuner, samarbete (35.48) @sv
alternative label: Kommunsammanslagningar (35.48) @sv
alternative label: Kunnalliset keskusjärjestöt (35.48)
alternative label: Kunnat, yhteistoiminta (35.48)
alternative label: Kuntainliitot (35.48)
alternative label: Kuntaliitokset (35.48)
alternative label: Kuntayhtymät (35.48)
alternative label: Kuntien yhteistoiminta (35.48)
alternative label: Pääkaupunkiseudun yhteistyövaltuuskunta (35.48)
alternative label: SAD (35.48) @sv
alternative label: Samkommuner (35.48) @sv
alternative label: Suomen kaupunkiliitto (35.48)
alternative label: Suomen kunnallisliitto (35.48)
alternative label: YTV (35.48)
broader: Kunnallishallinto. Paikallishallinto
in scheme: YKL - Yleisten kirjastojen luokitusjärjestelmä
notation: 35.48
preferred label: Intermunicipal cooperation @en
preferred label: Kommunalt samarbete @sv
scope note: Allmänna verk om kommunalt samarbete Sammanslagning av kommuner. Kommunalförbund Kommunala centralorganisationer Kommunalt samarbete kring en enskild samhällsfråga klassificeras enligt område @sv
scope note: Kuntien yhteistoimintaa koskevat yleisteokset Kuntaliitokset. Kuntainliitot Kunnalliset keskusjärjestöt Kuntien yhteistoiminta tietyn yhteiskunnallisen kysymyksen osalta luokitetaan alan mukaan

Palo- ja pelastustoimi
type: Concept
References: Julkis- ja hallinto-oikeus
References: Tapaturmantorjunta. Ensiapu
alternative label: Befolkningsskydd (35.6) @sv
alternative label: Befolkningsskyddsteknik (35.6) @sv
alternative label: Brandbilar, användning (35.6) @sv
alternative label: Branddetektorer (35.6) @sv
alternative label: Brandförsvar (35.6) @sv
alternative label: Brandinspektion (35.6) @sv
alternative label: Brandkår (35.6) @sv
alternative label: Brandlarm. larmanordningar (35.6) @sv
alternative label: Brandmannens arbete (35.6) @sv
alternative label: Brandskydd (35.6) @sv
alternative label: Brandstationer (35.6) @sv
alternative label: Brandsäkerhet (35.6) @sv
alternative label: Brandvarnare (35.6) @sv
alternative label: Brandvärnsteknik (35.6) @sv
alternative label: Brandväsen (35.6) @sv
alternative label: Eldsvådor (35.6) @sv
alternative label: Elsäkerhet, brandsäkerhet (35.6) @sv
alternative label: Fabriksbrandkårer (35.6) @sv
alternative label: Faromoment, brand- och räddningsväsen (35.6) @sv
alternative label: Frivilliga brandkårer (35.6) @sv
alternative label: Henkiinjäämisoppaat, palo- ja pelastustoimi (35.6)
alternative label: Hormit, nuohous (35.6)
alternative label: Kärnkraftsolyckor, strålskydd (35.6) @sv
alternative label: Meripelastus (35.6)
alternative label: Metsäpalot, palontorjunta (35.6)
alternative label: Nuohous, palontorjunta (35.6)
alternative label: Paloasemat (35.6)
alternative label: Paloautot, käyttö (35.6)
alternative label: Palohälyttimet (35.6)
alternative label: Paloilmaisimet (35.6)
alternative label: Palokunnat (35.6)
alternative label: Palomiehen työ (35.6)
alternative label: Palontorjuntatekniikka (35.6)
alternative label: Palosuojelu (35.6)
alternative label: Palotarkastus (35.6)
alternative label: Palotoimi (35.6)
alternative label: Paloturvallisuus (35.6)
alternative label: Palovaroittimet (35.6)
alternative label: Pelastusasemat (35.6)
alternative label: Pelastuslaitokset (35.6)
alternative label: Pelastussukellus (35.6)
alternative label: Pelastussukeltajat (35.6)
alternative label: Pelastustoimi (35.6)
alternative label: Radioaktiivisuus, säteilysuojelu (35.6)
alternative label: Radioaktivitet, strålskydd (35.6) @sv
alternative label: Räddningsdykare (35.6) @sv
alternative label: Räddningsdykning (35.6) @sv
alternative label: Räddningsstationer (35.6) @sv
alternative label: Räddningsverk (35.6) @sv
alternative label: Räddningsväsen (35.6) @sv
alternative label: Rökkanaler, sotning (35.6) @sv
alternative label: Savupiiput, nuohous (35.6)
alternative label: Selviytymisoppaat, palo- ja pelastustoimi (35.6)
alternative label: Sjöräddning (35.6) @sv
alternative label: Skogsbränder, brandförsvar (35.6) @sv
alternative label: Skorstenar, sotning (35.6) @sv
alternative label: Skydd, skyddsrum (35.6) @sv
alternative label: Skydd, strålskydd (35.6) @sv
alternative label: Suojautuminen, säteilysuojelu (35.6)
alternative label: Suojautuminen, väestönsuojat (35.6)
alternative label: Sähköturvallisuus, paloturvallisuus (35.6)
alternative label: Säteilysuojelu (35.6)
alternative label: Säteilyturvallisuus (35.6)
alternative label: Tehdaspalokunnat (35.6)
alternative label: Tulentorjunta (35.6)
alternative label: Tulipalot (35.6)
alternative label: Vaaratilanteet, palo- ja pelastustoimi (35.6)
alternative label: Vapaapalokunnat (35.6)
alternative label: Väestönsuojat, suunnittelu ja rakentaminen (35.6)
alternative label: Väestönsuojelu (35.6)
alternative label: Väestönsuojelutekniikka (35.6)
alternative label: Ydinonnettomuudet, säteilysuojelu (35.6)
broader: HALLINTO
in scheme: YKL - Yleisten kirjastojen luokitusjärjestelmä
notation: 35.6
scope note: Pelastuslaitokset. Palokunnat. Vapaapalokunnat. Tehdaspalokunnat Palontorjuntatekniikka Väestönsuojelu. Väestönsuojelutekniikka Väestönsuojien suunnittelu ja rakentaminen Säteilysuojelu
scope note: Räddningsverk. Brandkårer. Frivilliga brandkåren. Fabriksbrandkårer Brandförsvarsteknik Befolkningsskydd. Befolkningsskyddsteknik Att planera och bygga skyddsrum Strålskydd @sv

Poliisitoimi. Yleinen turvallisuus
type: Concept
References: Kriminologia. Kriminaalisosiologia
References: Kansainvälinen politiikka
References: Julkis- ja hallinto-oikeus
References: Rikosoikeus
References: Kriminaalipolitiikka. Vankeinhoito
References: Prosessioikeus. Oikeushallinto
References: Palo- ja pelastustoimi
References: Perhepolitiikka
References: MAANPUOLUSTUS
References: Tapaturmantorjunta. Ensiapu
References: Sisäelimet. Sisätaudit
References: Liiketalous
References: Voimailu. Kehonrakennus. Fitness-urheilu
alternative label: Atk-rikokset, poliisitoimi (35.7)
alternative label: Esitutkinta (35.7)
alternative label: Haittaohjelmat, poliisitoimi (35.7)
alternative label: Hakkerointi, poliisitoimi (35.7)
alternative label: Henkiinjäämisoppaat, turvallisuusala (35.7)
alternative label: Hälytyskeskukset (35.7)
alternative label: Hälytyslaitteet (35.7)
alternative label: Hätäkeskukset (35.7)
alternative label: Hätäpuhelimet (35.7)
alternative label: Järjestyksenvalvonta (35.7)
alternative label: Kameravalvonta (35.7)
alternative label: Kansalaiskaartit (35.7)
alternative label: Kodin turvallisuus, oppaat (35.7)
alternative label: Kodintekniikka, omaisuudensuoja (35.7)
alternative label: Krakkerointi, poliisitoimi (35.7)
alternative label: Merivartiolaitos (35.7)
alternative label: Murhat, rikostutkinta (35.7)
alternative label: Nimismiestoimi (35.7)
alternative label: Oikeusantropologia, rikostutkinta (35.7)
alternative label: Omaisuudensuoja (35.7)
alternative label: Pandemiat, yleinen turvallisuus (35.7)
alternative label: Perintätoimi (35.7)
alternative label: Poliisi (35.7)
alternative label: Poliisiautot, poliisin työ (35.7)
alternative label: Poliisilaitos (35.7)
alternative label: Poliisin työ (35.7)
alternative label: Poliisitoimi (35.7)
alternative label: Rajavartiolaitos (35.7)
alternative label: Rannikkovartiolaitos (35.7)
alternative label: Rikoksentorjunta (35.7)
alternative label: Rikokset, poliisitutkinta (35.7)
alternative label: Rikostutkinta (35.7)
alternative label: Rikostutkinta, oikeusantropologia (35.7)
alternative label: Salainen poliisi (35.7)
alternative label: Salapoliisit, rikostutkinta (35.7)
alternative label: Scotland Yard (35.7)
alternative label: Selviytymisoppaat, turvallisuusala (35.7)
alternative label: Sormenjäljet, rikostutkinta (35.7)
alternative label: Suojelupoliisi (35.7)
alternative label: Tappo, rikostutkinta (35.7)
alternative label: Tekninen rikostutkinta (35.7)
alternative label: Tekninen tarkkailu, turvallisuus (35.7)
alternative label: Televalvonta, turvallisuus (35.7)
alternative label: Tieto- ja viestintärikokset, poliisitoimi (35.7)
alternative label: Tietokonevirukset, poliisitoimi (35.7)
alternative label: Tietotekniikkarikokset, poliisitoimi (35.7)
alternative label: Tullilaitos (35.7)
alternative label: Turva-ala (35.7)
alternative label: Turvallisuus, fyysinen (35.7)
alternative label: Turvallisuusala (35.7)
alternative label: Turvallisuuskasvatus (35.7)
alternative label: Turvallisuuskasvatus, lapset (35.7)
alternative label: Turvallisuuspalvelu (35.7)
alternative label: Turvallisuustekniikka (35.7)
alternative label: Ulosottotoimi (35.7)
alternative label: Vaaratilanteet, yleinen turvallisuus (35.7)
alternative label: Valpo (35.7)
alternative label: Valtiollinen poliisi (35.7)
alternative label: Vartiointipalvelu (35.7)
alternative label: Yksityinen turvallisuuspalvelu (35.7)
alternative label: Yksityinen vartiointipalvelu (35.7)
broader: HALLINTO
in scheme: YKL - Yleisten kirjastojen luokitusjärjestelmä
notation: 35.7
scope note: Poliisilaitos. Nimismiehet. Esitutkinta. Rikostutkinta Hätä- ja hälytyskeskukset yleensä Yleinen järjestyksen valvonta. Kansalaiskaartit Tullilaitos. Meri-, raja- ja rannikkovartiolaitos Turva-ala yleensä. Yksityishenkilöiden, yritysten ja laitosten turvallisuus yleensä Fyysinen turvallisuus yleensä. Omaisuudensuoja Yksityinen vartiointi- ja turvallisuuspalvelu. Yksityisetsivät Perintä- ja ulosottotoimi Tähän myös teokset, jotka koskevat sekä poliisi- että pelastustointa
scope note: Polisinrättningar. Länsmän. Förundersökning. Brottsutredning Larmcentraler i allmänhet Övervakning av den allmänna ordningen. Medborgargarden Tullväsen. Sjö-, gräns- och kustbevakningsväsen Säkerhetsbranschen i allmänhet. Privatpersoners, företags och institutioners säkerhet i allmänhet Fysisk säkerhet i allmänhet. Egendomsskydd Privat övervaknings- och säkerhetstjänst. Privatdetektiver Indrivnings- och utmätningsväsen Hit även verk som behandlar både polis- och räddningsväsendet @sv

TALOUSTIEDE. KANSANTALOUSTIEDE
type: Concept
modified: 2026-05-06T14:19:39
References: Sosiaaliset järjestelmät
References: Valtiofilosofia. Poliittiset ideologiat
References: OIKEUSTIEDE
References: LIIKETALOUS. MARKKINOINTI. KAUPPA. LIIKENNE
type: YKL-luokka
alternative label: Blandekonomiskt system, ekonomi (36+) @sv
alternative label: Cirkulär ekonomi, ekonomisk vetenskap (36+) @sv
alternative label: Delningsekonomi, ekonomisk vetenskap (36+) @sv
alternative label: Ekonomisk vetenskap (36+) @sv
alternative label: Ekonomiska system (36+) @sv
alternative label: Jakamistalous, taloustiede (36+)
alternative label: Kansantaloustiede (36+)
alternative label: Kapitalism, ekonomiska system (36+) @sv
alternative label: Kapitalismi, talousjärjestelmät (36+)
alternative label: Kiertotalous, taloustiede (36+)
alternative label: Kommunism, ekonomiska system (36+) @sv
alternative label: Kommunismi, talousjärjestelmät (36+)
alternative label: Makroekonomi, nationalekonomi (36+) @sv
alternative label: Makrotaloustiede, kansantaloustiede (36+)
alternative label: Markkinatalous (36)
alternative label: Marknadsekonomi (36) @sv
alternative label: Marxism, ekonomiska system (36+) @sv
alternative label: Marxismi, talousjärjestelmät (36+)
alternative label: Mikroekonomi, nationalekonomi (36+) @sv
alternative label: Mikrotaloustiede, kansantaloustiede (36+)
alternative label: Nationalekonomi (36+) @sv
alternative label: Samhällsekonomi (36+) @sv
alternative label: Samhällssystem, ekonomi (36+) @sv
alternative label: Sekatalousjärjestelmä, taloustiede (36+)
alternative label: Socialism, ekonomiska system (36+) @sv
alternative label: Sosialismi, talousjärjestelmät (36+)
alternative label: Talousjärjestelmät (36+)
alternative label: Taloustiede (36+)
alternative label: Yhteiskulutus, taloustiede (36+)
alternative label: Yhteiskuntajärjestelmät, taloustiede (36+)
alternative label: Yhteiskuntatalous (36+)
broader: YHTEISKUNTA
in scheme: YKL - Yleisten kirjastojen luokitusjärjestelmä
narrower: Taloushistoria
narrower: Talouspolitiikka. Taloudelliset rakenteet
narrower: Raha. Valuutta
narrower: Vakuutustoimi
narrower: Osuustoiminta
narrower: Julkinen talous. Finanssioppi
narrower: Kansainvälinen talous. Maailmankauppa
notation: 36
preferred label: ECONOMICS. NATIONAL ECONOMY @en
preferred label: EKONOMISK VETENSKAP. NATIONALEKONOMI @sv
scope note: Hit allmänna verk om företagsekonomi, nationalekonomi och samhällsekonomi Hit också allmänna verk om ekonomiska system Kapitalism, socialism och blandekonomier som ekonomiska system Ekonomiska frågor inom olika områden klassificeras enligt område Om verket innehåller både nationalekonomi och företagsekonomi, ges företräde åt klass 36+ Allmänna läroböcker i ekonomikunskap 36.07 Ekonomisk historia samt olika länders allmänna ekonomiska historia 36.09 @sv
scope note: Tähän taloustieteen, kansantaloustieteen ja yhteiskuntatalouden yleisteokset Tähän myös talousjärjestelmiä koskevat yleisteokset Kapitalismi, sosialismi ja sekatalousjärjestelmä talousjärjestelminä Eri alojen taloudelliset kysymykset luokitetaan alan mukaan Jos teoksessa on sekä kansantalous- että liiketaloustiedettä, annetaan etusija luokalle 36+ Taloustiedon yleiset oppikirjat 36.07 Taloustieteen historia sekä eri maiden yleinen taloushistoria 36.09

Taloushistoria
type: Concept
References: Sosiaaliset järjestelmät
References: Valtiofilosofia. Poliittiset ideologiat
References: OIKEUSTIEDE
References: LIIKETALOUS. MARKKINOINTI. KAUPPA. LIIKENNE
type: YKL-luokka
alternative label: Ekonomisk historia (36.09) @sv
alternative label: Ekonomisk vetenskap, historia (36.09) @sv
alternative label: Imperialism, ekonomisk historia (36.09) @sv
alternative label: Imperialismi, taloushistoria (36.09)
alternative label: Industrialisering, ekonomisk historia (36.09) @sv
alternative label: Industrialismi, taloushistoria (36.09)
alternative label: Kapitalism, ekonomisk historia (36.09) @sv
alternative label: Kapitalismi, taloushistoria (36.09)
alternative label: Kolonialism, ekonomisk historia (36.09) @sv
alternative label: Kolonialismi, taloushistoria (36.09)
alternative label: Kommunism, ekonomisk historia (36.09) @sv
alternative label: Kommunismi, taloushistoria (36.09)
alternative label: Merkantilism, ekonomisk historia (36.09) @sv
alternative label: Merkantilismi, taloushistoria (36.09)
alternative label: Socialism, ekonomisk historia (36.09) @sv
alternative label: Sosialismi, taloushistoria (36.09)
alternative label: Taloushistoria (36.09)
alternative label: Taloustiede, historia (36.09)
alternative label: Teollistuminen, taloushistoria (36.09)
broader: TALOUSTIEDE. KANSANTALOUSTIEDE
in scheme: YKL - Yleisten kirjastojen luokitusjärjestelmä
notation: 36.09
preferred label: Economic history @en
preferred label: Ekonomisk historia @sv
scope note: Ekonomisk historia samt olika länders allmänna ekonomiska historia @sv
scope note: Taloustieteen historia sekä eri maiden yleinen taloushistoria

Talouspolitiikka. Taloudelliset rakenteet
type: Concept
References: Kansainvälinen politiikka
References: ALUESUUNNITTELU. ALUEPOLITIIKKA
References: Julkinen talous. Finanssioppi
References: Kansainvälinen talous. Maailmankauppa
References: Kehitysmaiden taloudelliset olot
References: Energia
References: LIIKETALOUS. MARKKINOINTI. KAUPPA. LIIKENNE
alternative label: Aluekehitys, aluetalous (36.1+)
alternative label: Aluetalous (36.1+)
alternative label: Arbetskrafts- och näringscentraler (36.1+) @sv
alternative label: Depression, ekonomisk politik (36.1+) @sv
alternative label: Ekonomisk geografi (36.1+) @sv
alternative label: Ekonomisk politik (36.1+) @sv
alternative label: Ekonomisk recession (36.1+) @sv
alternative label: Ekonomisk tillväxt (36.1+) @sv
alternative label: Ekonomisk verksamhet, ekonomisk vetenskap (36.1+) @sv
alternative label: Ekonomiska kriser (36.1+) @sv
alternative label: Ekonomiska strukturer, ekonomisk politik (36.1+) @sv
alternative label: Elinkeinoelämä (36.1+)
alternative label: Elinkeinopolitiikka (36.1)
alternative label: Elinkeinot (36.1+)
alternative label: Elvytys, talouspolitiikka (36.1+)
alternative label: Finanskriser (36.1+) @sv
alternative label: Finanssikriisit (36.1+)
alternative label: Försörjningskvot, ekonomisk politik (36.1+) @sv
alternative label: Geografi, ekonomisk geografi (36.1+) @sv
alternative label: Grå ekonomi, ekonomiska strukturen (36.1+) @sv
alternative label: Handels- och industriförvaltning (36.1+) @sv
alternative label: Harmaa talous, talouden rakenteet (36.1+)
alternative label: Huoltosuhde, talouspolitiikka (36.1+)
alternative label: Högkonjunkturer, ekonomisk politik (36.1+) @sv
alternative label: Industrialisering, ekonomisk vetenskap och politik (36.1+) @sv
alternative label: Investeringar, ekonomisk politik (36.1+) @sv
alternative label: Investeringsverksamhet, ekonomisk politik (36.1+) @sv
alternative label: Investoinnit, talouspolitiikka (36.1+)
alternative label: Investointitoiminta, talouspolitiikka (36.1+)
alternative label: Kauppa- ja teollisuushallinto (36.1+)
alternative label: Konjunkturer (36.1+) @sv
alternative label: Konjunkturutveckling (36.1+) @sv
alternative label: Korporativismi, talouspolitiikka (36.1+)
alternative label: Kriisit, talous (36.1+)
alternative label: Lama, talouspolitiikka (36.1+)
alternative label: Luova talous (36.1+)
alternative label: Maantiede, talousmaantiede (36.1+)
alternative label: Markkinat, kansantalous (36.1+)
alternative label: Nousukaudet, talouspolitiikka (36.1+)
alternative label: Pimeä työ, talouden rakenteet (36.1+)
alternative label: Prekariaatti, taloudelliset rakenteet (36.1+)
alternative label: Prekarisaatio, taloudelliset rakenteet (36.1+)
alternative label: Pulakaudet (36.1+)
alternative label: Sijoitustoiminta, talouspolitiikka (36.1+)
alternative label: Suhdannekehitys (36.1+)
alternative label: Suhdanteet (36.1+)
alternative label: TE-keskukset (36.1+)
alternative label: Taantuma, talouspolitiikka (36.1+)
alternative label: Taloudellinen kasvu (36.1+)
alternative label: Taloudellinen taantuma (36.1+)
alternative label: Taloudellinen toiminta, taloustiede (36.1+)
alternative label: Taloudelliset rakenteet, talouspolitiikka (36.1+)
alternative label: Talouden elvytys (36.1+)
alternative label: Talouskriisit (36.1+)
alternative label: Talouslamat (36.1+)
alternative label: Talousmaantiede (36.1+)
alternative label: Talouspolitiikka (36.1+)
alternative label: Teollistuminen, taloustiede ja -politiikka (36.1+)
alternative label: Työvoima- ja elinkeinokeskukset (36.1+)
alternative label: Vakautus, talouspolitiikka (36.1+)
alternative label: Velkakriisit (36.1+)
alternative label: Verkostotalous, talouspolitiikka (36.1+)
broader: TALOUSTIEDE. KANSANTALOUSTIEDE
in scheme: YKL - Yleisten kirjastojen luokitusjärjestelmä
narrower: Pääoma. Luonnonvarat
narrower: Tuotanto. Tuottavuus
narrower: Työ. Työelämä
narrower: Hinnat. Hintapolitiikka
narrower: Elintaso. Kulutus
notation: 36.1
scope note: Hit allmänna verk om ekonomisk politik, ekonomiska strukturen, näringsliv, näringspolitik, ekonomisk verksamhet eller utvecklingsfenomen inom ekonomin Konjunkturer. Ekonomisk tillväxt och recession. Högkonjunkturer. Ekonomiska kriser. Ekonomisk depression. Kristider. Ekonomisk stimulans Hit också regional ekonomi och ekonomisk geografi i allmänhet Verk om ekonomisk politik inom specialområden klassificeras enligt område @sv
scope note: Tähän talouspolitiikkaa, taloudellisia rakenteita, elinkeinoelämää, elinkeinopolitiikkaa, taloudellista toimintaa tai talouselämän kehitysilmiöitä koskevat yleisteokset Suhdanteet. Taloudellinen kasvu ja taantuma. Nousukaudet. Talouskriisit. Talouslamat. Pulakaudet. Talouden elvytys Tähän myös aluetalous ja talousmaantiede yleensä Erikoisaloja koskevat talouspoliittiset teokset luokitetaan alan mukaan

Pääoma. Luonnonvarat
type: Concept
References: Pankkitoimi. Pörssitoimi. Sijoitustoiminta
References: Ympäristönsuojelu. Luonnonsuojelu
References: Energia
References: Kaivannaisteollisuus
References: Maatalouspolitiikka
References: Metsätalous
type: YKL-luokka
alternative label: Driftskapital (36.11) @sv
alternative label: Förmögenhet, ekonomi (36.11) @sv
alternative label: Förnybara naturtillgångar, ekonomi (36.11) @sv
alternative label: Kansallistaminen, tuotantovälineet (36.11)
alternative label: Kapital (36.11) @sv
alternative label: Kapital, ägandeförhållanden (36.11) @sv
alternative label: Kapitalavkastning (36.11) @sv
alternative label: Kapitalbildning (36.11) @sv
alternative label: Kapitalformer (36.11) @sv
alternative label: Käyttöpääoma (36.11)
alternative label: Lisäarvo, taloustiede (36.11)
alternative label: Luonnonvarat, taloustiede (36.11)
alternative label: Mervärde, ekonomi (36.11) @sv
alternative label: Miljöekonomi, ekonomi (36.11+) @sv
alternative label: Nationalisering, produktionsmedel (36.11) @sv
alternative label: Naturtillgångar, ekonomisk vetenskap (36.11) @sv
alternative label: Oförnybara naturtillgångar, ekonomi (36.11) @sv
alternative label: Pakkolunastus, tuotantovälineet (36.11)
alternative label: Privatisering, produktionsfaktorer (36.11) @sv
alternative label: Produktionsanläggningar, nationalekonomi (36.11) @sv
alternative label: Produktionsmedel, ekonomi (36.11) @sv
alternative label: Produktionsmedel, nationalekonomi (36.11) @sv
alternative label: Produktionsmedel, ägandeförhållanden (36.11) @sv
alternative label: Pääoma (36.11)
alternative label: Pääoman muodostus (36.11)
alternative label: Pääoman muodot (36.11)
alternative label: Pääoman omistussuhteet (36.11)
alternative label: Pääoman tuotto (36.11)
alternative label: Raaka-aineet, taloustiede (36.11)
alternative label: Reaalipääoma, taloustiede (36.11)
alternative label: Realkapital, ekonomi (36.11) @sv
alternative label: Riskipääoma, kansantalous (36.11)
alternative label: Riskkapital, samhällsekonomi (36.11) @sv
alternative label: Råmaterial, ekonomi (36.11) @sv
alternative label: Tuotantolaitokset, kansantaloustiede (36.11)
alternative label: Tuotantovälineet, kansantaloustiede (36.11)
alternative label: Tuotantovälineet, omistussuhteet (36.11)
alternative label: Tuotantovälineet, taloustiede (36.11)
alternative label: Tvångsinlösning, produktionsmedel (36.11) @sv
alternative label: Uusiutumattomat luonnonvarat, taloustiede (36.11)
alternative label: Uusiutuvat luonnonvarat, taloustiede (36.11)
alternative label: Varallisuus, taloustiede (36.11)
alternative label: Vinst, ekonomi (36.11) @sv
alternative label: Voitto, taloustiede (36.11)
alternative label: Yksityistäminen, tuotantovälineet (36.11)
alternative label: Ympäristötalous, taloustiede (36.11+)
broader: Talouspolitiikka. Taloudelliset rakenteet
in scheme: YKL - Yleisten kirjastojen luokitusjärjestelmä
narrower: Maa. Kiinteistöt. Tontit
notation: 36.11
preferred label: Capital. Natural resources @en
preferred label: Kapital. Naturresurser @sv
scope note: Hit allmänna verk om kapital och naturresurser Kapitalbildning. Kapitalformer. Förmögenhet Realkapital. Produktionsmedel. Driftskapital Kapitalavkastning. Vinst. Mervärde Kapital och produktionsmedel, ägandeförhållanden, nationalisering och privatisering Miljöekonomi ur ekonomisk synvinkel Verk som behandlar enskilda produktionsmedel, råmaterial eller naturtillgångar klassificeras enligt område @sv
scope note: Tähän pääomaa ja luonnonvaroja koskevat yleisteokset Pääomanmuodostus. Pääoman muodot. Varallisuus Reaalipääoma. Tuotantovälineet. Käyttöpääoma Pääoman tuotto. Voitto. Lisäarvo Pääoman ja tuotantovälineiden omistussuhteet, kansallistaminen ja yksityistäminen Raaka-aineet ja luonnonvarat sekä niiden tuotanto ja riittävyys talouspolitiikan kannalta Ympäristötalous taloustieteen kannalta Tiettyä tuotantovälinettä, raaka-ainetta tai luonnonvaraa koskevat teokset luokitetaan alan mukaan

Maa. Kiinteistöt. Tontit
type: Concept
References: Asunto- ja kiinteistönkauppaoikeus
References: Maa- ja vesioikeus
References: ALUESUUNNITTELU. ALUEPOLITIIKKA
References: Yhdyskuntasuunnittelu. Kaupunkisuunnittelu. Ympäristönsuunnittelu
References: Rakennuksen kunnossapito
type: YKL-luokka
alternative label: Allmänning, markpolitik (36.111) @sv
alternative label: Fastigheter (36.111) @sv
alternative label: Fastigheter, affärer (36.111) @sv
alternative label: Fastigheter, ekonomisk politik (36.111) @sv
alternative label: Jord, ekonomisk politik (36.111) @sv
alternative label: Jordförvärv, ekonomisk politik (36.111) @sv
alternative label: Jordreformer, ekonomisk politik (36.111) @sv
alternative label: Jordvärdering, ekonomisk politik (36.111) @sv
alternative label: Jordägande, ekonomisk politik (36.111) @sv
alternative label: Kansallistaminen, maa, kiinteistöt, tontit (36.111)
alternative label: Keinottelu, maa, kiinteistöt, tontit (36.111)
alternative label: Kiinteistöt (36.111)
alternative label: Kiinteistöt, kauppa (36.111)
alternative label: Kiinteistöt, talouspolitiikka (36.111)
alternative label: Maa, talouspolitiikka (36.111)
alternative label: Maakauppa (36.111)
alternative label: Maan arviointi, talouspolitiikka (36.111)
alternative label: Maanhankinta, talouspolitiikka (36.111)
alternative label: Maanomistus, talouspolitiikka (36.111)
alternative label: Maareformit, talouspolitiikka (36.111)
alternative label: Markaffärer (36.111) @sv
alternative label: Nationalisering, mark, fastigheter, tomter (36.111) @sv
alternative label: Pakkolunastus, maa, kiinteistöt, tontit (36.111)
alternative label: Privatisering, mark, fastigheter, tomter (36.111) @sv
alternative label: Spekulation, jord, fastigheter, tomter (36.111) @sv
alternative label: Tomter, ekonomisk politik (36.111) @sv
alternative label: Tomtköp (36.111) @sv
alternative label: Tontit, talouspolitiikka (36.111)
alternative label: Tonttikauppa (36.111)
alternative label: Tvångsinlösning, land, fastigheter, tomter (36.111) @sv
alternative label: Yhteismaa, maapolitiikka (36.111)
alternative label: Yksityistäminen, maa, kiinteistöt, tontit (36.111)
broader: Pääoma. Luonnonvarat
in scheme: YKL - Yleisten kirjastojen luokitusjärjestelmä
notation: 36.111
preferred label: Land. Real estates. Building sites @en
preferred label: Mark. Fastigheter. Tomter @sv
scope note: Hit mark, fastigheter och tomter ur ekonomisk och ekonomisk-politisk synvinkel Mark-, fastighets- och tomtaffärer Mark, fastigheter och tomter och deras värde, värdestegring, avkastning och lönsamhet Ägandet av mark, fastigheter och tomter Jordreformer. Nationalisering. Tvångsinlösen @sv
scope note: Tähän maa, kiinteistöt ja tontit taloustieteen ja talouspolitiikan kannalta Maa-, kiinteistö- ja tonttikauppa Maan, kiinteistöjen ja tonttien arviointi, arvo, arvonnousu, tuotto ja kannattavuus Maan-, kiinteistöjen ja tonttien omistus Maareformit. Kansallistaminen. Pakkolunastus

Tuotanto. Tuottavuus
type: Concept
References: Sosiaaliset järjestelmät
References: Valtakunnallinen suunnittelu
References: Seutusuunnittelu
References: URN:NBN:fi:au:ykl:60.09
References: Tuotannon organisointi ja suunnittelu
type: YKL-luokka
alternative label: Alkutuotanto, kansantaloustiede (36.12)
alternative label: Elinkeinorakenne (36.12)
alternative label: Industrisektorn, ekonomi (36.12) @sv
alternative label: Näringsstruktur (36.12) @sv
alternative label: Palvelusektori, taloustiede (36.12)
alternative label: Perustuotantosektori, taloustiede (36.12)
alternative label: Primärproduktion, nationalekonomi (36.12) @sv
alternative label: Primärproduktionssektorn, ekonomi (36.12) @sv
alternative label: Produktion, samhällsekonomi (36.12) @sv
alternative label: Produktivitet, nationalekonomi (36.12) @sv
alternative label: Servicesektor, ekonomi (36.12) @sv
alternative label: Teollisuussektori, taloustiede (36.12)
alternative label: Tuotanto, kansantalous (36.12)
alternative label: Tuottavuus, kansantalous (36.12)
broader: Talouspolitiikka. Taloudelliset rakenteet
in scheme: YKL - Yleisten kirjastojen luokitusjärjestelmä
notation: 36.12
preferred label: Production. Productivity @en
preferred label: Produktion. Produktivitet @sv
scope note: Basproduktionssektorn, industri- och servicesektorn och deras utveckling som allmän ekonomisk och ekonomisk-politisk fråga Näringsstruktur och dess förändring Industrialisering som ekonomisk och ekonomisk-politisk fråga Verk som behandlar en enskild gren av produktionen eller näringslivet klassificeras enligt område @sv
scope note: Perustuotanto-, teollisuus- ja palvelusektori ja niiden kehitys yleisenä taloustieteellisenä ja talouspoliittisena kysymyksenä Elinkeinorakenne ja sen muutos Teollistuminen taloustieteellisenä ja talouspoliittisena kysymyksenä Tiettyä tuotannon tai elinkeinoelämän alaa koskevat teokset luokitetaan alan mukaan

Työ. Työelämä
type: Concept
References: Työoikeus
References: Työsuojelu. Ergonomia
References: KANSATIEDE. KULTTUURIANTROPOLOGIA
References: Työterveyshuolto. Opiskeluterveydenhuolto Kouluterveydenhoitajan työ
References: Mielenterveys. Tunne-elämän häiriöt
References: Henkilöstöpolitiikka
References: Työntutkimukset. Työanalyysi. Työn suunnittelu
alternative label: Alienation från arbete (36.13) @sv
alternative label: Alienation, arbetsliv (36.13) @sv
alternative label: Ammatit, sosiologia (36.13)
alternative label: Arbete (36.13) @sv
alternative label: Arbete, ekonomi (36.13) @sv
alternative label: Arbete, nationalekonomi (36.13) @sv
alternative label: Arbete, psykologi (36.13) @sv
alternative label: Arbete, sociologi (36.13) @sv
alternative label: Arbetets sociologi (36.13) @sv
alternative label: Arbetsförhållanden (36.13) @sv
alternative label: Arbetshälsa, arbetstrivsel (36.13) @sv
alternative label: Arbetskollektiv (36.13) @sv
alternative label: Arbetsliv (36.13) @sv
alternative label: Arbetsmotivation (36.13) @sv
alternative label: Arbetsplatsmobbning (36.13) @sv
alternative label: Arbetspsykologi (36.13) @sv
alternative label: Arbetsresor, arbetsförhållanden (36.13) @sv
alternative label: Arbetstillfredsställelse (36.13) @sv
alternative label: Etätyö (36.13+)
alternative label: Henkinen väkivalta, työpaikoilla (36.13)
alternative label: ILO (36.13)
alternative label: Jaksaminen, työelämä (36.13)
alternative label: Kansalaisen asema työelämässä (36.13)
alternative label: Kiusaaminen, työelämä (36.13)
alternative label: Korporativismi, tulopolitiikka (36.13+)
alternative label: Lapsityövoiman käyttö (36.13)
alternative label: Miehet, asema työelämässä (36.13)
alternative label: Naiset, asema työelämässä (36.13)
alternative label: Nuoret, asema työelämässä (36.13)
alternative label: Pimeä työ, työelämä (36.13)
alternative label: Pätkätyö (36.13+)
alternative label: Suojatyöpaikat (36.13)
alternative label: Syrjintä, työelämä (36.13+)
alternative label: Syrjäytyminen, työelämä (36.13+)
alternative label: Työ (36.13)
alternative label: Työ, kansantaloustiede (36.13)
alternative label: Työ, psykologia (36.13)
alternative label: Työ, sosiologia (36.13)
alternative label: Työ, taloustiede (36.13)
alternative label: Työelämä (36.13)
alternative label: Työhyvinvointi, työviihtyvyys (36.13)
alternative label: Työmatkat, työolot (36.13)
alternative label: Työmotivaatio (36.13)
alternative label: Työn psykologia (36.13)
alternative label: Työn sosiologia (36.13)
alternative label: Työolot (36.13)
alternative label: Työpaikkakiusaaminen (36.13)
alternative label: Työpsykologia (36.13)
alternative label: Työskentely ulkomailla (36.13+)
alternative label: Työssä jaksaminen (36.13)
alternative label: Työssä jatkaminen (36.13)
alternative label: Työssä viihtyminen (36.13)
alternative label: Työssäjatkaminen (36.13)
alternative label: Työssäkäynti (36.13)
alternative label: Työssäviihtyminen (36.13)
alternative label: Työstä vieraantuminen (36.13)
alternative label: Työtyytyväisyys (36.13)
alternative label: Työviihtyvyys, yksilö/työntekijä (36.13)
alternative label: Työyhteisöt (36.13)
alternative label: Vaaratilanteet, työelämä (36.13)
alternative label: Vammaiset, asema työelämässä (36.13)
alternative label: Vieraantuminen, työelämä (36.13)
alternative label: Viihtyminen, työelämä (36.13)
alternative label: Yhteisölliset työtilat, työn sosiologia (36.13)
broader: Talouspolitiikka. Taloudelliset rakenteet
in scheme: YKL - Yleisten kirjastojen luokitusjärjestelmä
narrower: Työvoimapolitiikka
narrower: Palkkapolitiikka. Tulopolitiikka
narrower: Työmarkkinajärjestöt
notation: 36.13
scope note: Arbete, arbetsliv och arbetsförhållanden i allmänhet Arbetets ekonomi. Arbetets och yrkenas sociologi Arbetets psykologi. Att trivas i arbetet. Alienation från arbetet Unga arbetstagares, kvinnors, mäns, handikappades och andra arbetstagargruppers ställning i arbetslivet Barnarbetskraft Arbete som ekonomisk fråga Arbete, arbetsförhållanden och yrken inom olika områden klassificeras enligt område @sv
scope note: Työ, työelämä ja työolot yleensä Työn taloustiede. Työn ja ammattien sosiologia Työn psykologia. Työssä viihtyminen. Työstä vieraantuminen Nuorten työntekijöiden, naisten, miesten, vammaisten sekä muiden työntekijäryhmien asema työelämässä Lapsityövoiman käyttö Työ taloustieteellisenä kysymyksenä Eri alojen työ, työolot ja ammatit luokitetaan alan mukaan Työviihtyvyys ja työhyvinvointi yksilön/työntekijän näkökulmasta.

Työvoimapolitiikka
type: Concept
References: Työoikeus
References: Toimeentuloturva
References: Aikuiskoulutus. Vapaa sivistystyö
References: Ammatinvalinta
References: Henkilöstöpolitiikka
alternative label: Ammattikurssitoiminta (36.131)
alternative label: Arbetande befolkningen (36.131) @sv
alternative label: Arbetsförmedling (36.131) @sv
alternative label: Arbetskraft (36.131) @sv
alternative label: Arbetskraft, ekonomisk politik (36.131) @sv
alternative label: Arbetskraft, rörlighet (36.131) @sv
alternative label: Arbetskraftpolitik (36.131) @sv
alternative label: Arbetskraftsbyråer (36.131) @sv
alternative label: Arbetskraftsförvaltning (36.131) @sv
alternative label: Arbetskraftsinvandring (36.131) @sv
alternative label: Arbetskraftstjänster (36.131) @sv
alternative label: Arbetslösa (36.131) @sv
alternative label: Arbetslöshet (36.131) @sv
alternative label: Arbetsmarknaden (36.131) @sv
alternative label: Arbetspraktik, arbetsliv (36.131) @sv
alternative label: Arbetssökarguider (36.131) @sv
alternative label: Brist på arbetskraft (36.131) @sv
alternative label: Flyktingar, arbetskraftpolitik (36.131) @sv
alternative label: Full sysselsättning (36.131) @sv
alternative label: Gästarbetare, arbetskraftspolitik (36.131) @sv
alternative label: Harjoittelu, työelämä (36.131)
alternative label: Hyrd arbetskraft (36.131) @sv
alternative label: Invandrare, arbetskraftpolitik (36.131) @sv
alternative label: Irtisanomiset, työvoimapolitiikka (36.131)
alternative label: Irtisanomissuoja, työvoimapolitiikka (36.131)
alternative label: Kausityöttömyys (36.131)
alternative label: Kehitysaluepolitiikka, työvoimapolitiikka (36.131)
alternative label: Koulutuspolitiikka, työllistämiskoulutus (36.131)
alternative label: Lomautukset, työvoimapolitiikka (36.131)
alternative label: Maahanmuuttajat, työvoimapolitiikka (36.131)
alternative label: Nuorisotyöttömyys (36.131)
alternative label: Osaaminen, työvoimapolitiikka (36.131)
alternative label: Paikanhakuoppaat (36.131)
alternative label: Pakolaiset, työvoimapolitiikka (36.131)
alternative label: Pitkäaikaistyöttömyys (36.131)
alternative label: Rakennetyöttömyys (36.131)
alternative label: Siirtolaiset, työvoimapolitiikka (36.131)
alternative label: Sosiaaliset yritykset, työllistäminen (36.131)
alternative label: Työharjoittelu, työelämä (36.131)
alternative label: Työhönsijoittuminen, työllisyys (36.131)
alternative label: Työlliset (36.131)
alternative label: Työllistyminen (36.131)
alternative label: Työllistäminen (36.131)
alternative label: Työllistämiskoulutus, työvoimapolitiikka (36.131)
alternative label: Työllistämisohjelmat (36.131)
alternative label: Työllisyys (36.131)
alternative label: Työllisyyskoulutus (36.131)
alternative label: Työmarkkinat (36.131)
alternative label: Työnhakuoppaat (36.131)
alternative label: Työnvälitystoiminta (36.131)
alternative label: Työpaikan hakuoppaat (36.131)
alternative label: Työperäinen maahanmuutto (36.131)
alternative label: Työssäkäyvät (36.131)
alternative label: Työssäolevat (36.131)
alternative label: Työttömyys (36.131)
alternative label: Työttömät (36.131)
alternative label: Työvoima (36.131)
alternative label: Työvoima, liikkuvuus (36.131)
alternative label: Työvoima, talouspolitiikka (36.131)
alternative label: Työvoimahallinto (36.131)
alternative label: Työvoiman vuokraus (36.131)
alternative label: Työvoimapalvelu (36.131)
alternative label: Työvoimapolitiikka (36.131)
alternative label: Työvoimapula (36.131)
alternative label: Työvoimatoimistot (36.131)
alternative label: Täystyöllisyys (36.131)
alternative label: Vierastyöläiset, työvoimapolitiikka (36.131)
alternative label: Vuokratyö (36.131)
alternative label: Yhteistoimintamenettely, työelämä (36.131)
broader: Työ. Työelämä
in scheme: YKL - Yleisten kirjastojen luokitusjärjestelmä
notation: 36.131
scope note: Hit arbetskraftspolitik och arbetsmarknaden inom olika branscher Sysselsättning. Arbetslöshet. Arbetskraftens rörlighet Ungdoms-, säsong- och långtidsarbetslöshet och strukturell arbetslöshet Permitteringar. Uppsägningar. Uppsägningsskydd Full sysselsättning. Brist på arbetskraft. Gästarbetare Sysselsättningsåtgärder. Sysselsättningsprogram. Sysselsättningsfrämjande utbildning Yrkeskursverksamhet. Arbetsförmedling Arbetskraftsservice. Arbetskraftsbyråer Jobbsökarguider Hit också arbetskraftspolitiska åtgärder i anslutning till utvecklingsområdespolitik @sv
scope note: Tähän eri alojen työvoimapolitiikkaa ja työmarkkinoita koskevat teokset Työllisyys. Työttömyys. Työvoiman liikkuvuus Nuoriso-, kausi-, pitkäaikais- ja rakennetyöttömyys Lomautukset. Irtisanomiset. Irtisanomissuoja Täystyöllisyys. Työvoimapula. Vierastyöläiset Työllistäminen. Työllistyminen. Työllistämisohjelmat. Työllistämiskoulutus Ammattikurssitoiminta. Työnvälitystoiminta Työvoimapalvelu. Työvoimatoimistot. Paikanhakuoppaat Tähän myös kehitysaluepolitiikkaan kuuluvat työvoimapoliittiset toimet

Palkkapolitiikka. Tulopolitiikka
type: Concept
References: Työoikeus
References: Työmarkkinajärjestöt
References: Elintaso. Kulutus
References: Toimeentuloturva
References: Henkilöstöpolitiikka
References: Liiketaloudellinen laskentatoimi
type: YKL-luokka
alternative label: Anställningsfrågor (36.132) @sv
alternative label: Arbete, löner (36.132) @sv
alternative label: Arbetsavtalsfrågor (36.132) @sv
alternative label: Arbetsfred (36.132) @sv
alternative label: Arbetsfrånvaro (36.132) @sv
alternative label: Arbetskonflikter (36.132) @sv
alternative label: Arbetskraftskostnader, lönepolitik (36.132) @sv
alternative label: Arbetsmarknadskonflikter (36.132) @sv
alternative label: Arbetstider (36.132) @sv
alternative label: Avlöning (36.132) @sv
alternative label: Inkomstpolitik (36.132) @sv
alternative label: Kannustus, palkkapolitiikka (36.132)
alternative label: Kollektivavtal (36.132) @sv
alternative label: Kommuner, kollektivavtal (36.132) @sv
alternative label: Kunnat, työ- ja virkaehtosopimukset (36.132)
alternative label: Lakot (36.132)
alternative label: Lockouter (36.132) @sv
alternative label: Lomat, palkkapolitiikka (36.132)
alternative label: Löneförvaltning (36.132) @sv
alternative label: Lönepolitik (36.132) @sv
alternative label: Löner (36.132) @sv
alternative label: Nattarbete (36.132) @sv
alternative label: Palkat (36.132)
alternative label: Palkitseminen, palkkapolitiikka (36.132)
alternative label: Palkkahallinto (36.132)
alternative label: Palkkapolitiikka (36.132)
alternative label: Palkkaus (36.132)
alternative label: Premiering, lönepolitik (36.132) @sv
alternative label: Semestrar (36.132) @sv
alternative label: Semestrar, lönepolitik (36.132) @sv
alternative label: Skiftarbete (36.132) @sv
alternative label: Statliga tjänstekollektivavtal (36.132) @sv
alternative label: Strejker (36.132) @sv
alternative label: Tjänstekollektivavtal (36.132) @sv
alternative label: Tulopolitiikka (36.132)
alternative label: Työ, palkat (36.132)
alternative label: Työ, poissaolot (36.132)
alternative label: Työajat (36.132)
alternative label: Työehtosopimukset (36.132)
alternative label: Työmarkkinariidat (36.132)
alternative label: Työrauha (36.132)
alternative label: Työsopimusasiat (36.132)
alternative label: Työsuhdeasiat (36.132)
alternative label: Työsulut (36.132)
alternative label: Työtaistelut (36.132)
alternative label: Työvoimakustannukset, palkkapolitiikka (36.132)
alternative label: Uppmuntran, lönepolitik (36.132) @sv
alternative label: Valtion virkaehtosopimukset (36.132)
alternative label: Virkaehtosopimukset (36.132)
alternative label: Vuorotyö (36.132)
alternative label: Vuosilomat (36.132)
alternative label: Yötyö (36.132)
broader: Työ. Työelämä
in scheme: YKL - Yleisten kirjastojen luokitusjärjestelmä
notation: 36.132
preferred label: Lönepolitik. Inkomstpolitik @sv
preferred label: Wage policy. Incomes policy @en
scope note: Hit lönepolitik och inkomstpolitik inom olika branscher Arbetsavtal och anställningsförhållanden. Arbetstvister Kollektivavtal. Tjänstekollektivavtal Avlöning. Löneadministration. Lönesystem Lönepolitik inom den offentliga sektorn och den privata sektorn Arbetstid. Semestrar @sv
scope note: Tähän eri alojen palkka- ja tulopolitiikkaa koskevat teokset Työsopimus- ja työsuhdeasiat. Työtaistelut Työehtosopimukset. Virkaehtosopimukset Palkkaus. Palkkahallinto. Palkkausjärjestelmät Julkisen ja yksityisen sektorin palkkapolitiikka Työaika. Lomat

Työmarkkinajärjestöt
type: Concept
References: Poliittiset järjestelmät
References: Työoikeus
References: Palkkapolitiikka. Tulopolitiikka
type: YKL-luokka
alternative label: Ammattijärjestöt (36.133)
alternative label: Ammattiliitot (36.133)
alternative label: Ammattiyhdistykset (36.133)
alternative label: Ammattiyhdistysliike (36.133)
alternative label: Arbetsgivarorganisationer (36.133) @sv
alternative label: Arbetsmarknadsorganisationer, arbetsgivare (36.133) @sv
alternative label: Arbetsmarknadsorganisationer, arbetstagare (36.133) @sv
alternative label: Arbetstagarorganisationer (36.133) @sv
alternative label: Fackförbund (36.133) @sv
alternative label: Fackföreningar (36.133) @sv
alternative label: Fackföreningsrörelse (36.133) @sv
alternative label: Fackorganisationer (36.133) @sv
alternative label: Företagarorganisationer, arbetsmarknadsorganisationer (36.133) @sv
alternative label: Förtroendemannauppdrag (36.133) @sv
alternative label: Luottamusmiestoimi (36.133)
alternative label: Työmarkkinajärjestöt, työnantajat (36.133)
alternative label: Työmarkkinajärjestöt, työntekijät (36.133)
alternative label: Työnantajajärjestöt (36.133)
alternative label: Työntekijäjärjestöt (36.133)
alternative label: Yrittäjäjärjestöt, työmarkkinajärjestöt (36.133)
broader: Työ. Työelämä
in scheme: YKL - Yleisten kirjastojen luokitusjärjestelmä
notation: 36.133
preferred label: Arbetsmarknadsorganisationer @sv
preferred label: Labour market organisations @en
scope note: Hit arbetsmarknadsorganisationer inom olika branscher och deras verksamhet Arbetsgivarorganisationer. Fackföreningsrörelsen. Fackföreningar Förtroendemannaväsen Formtillägget 06 används inte i samband med klassen 36.133 @sv
scope note: Tähän eri alojen työmarkkinajärjestöt ja niiden toiminta Työnantajajärjestöt. Ammattiyhdistysliike. Ammattiyhdistykset Luottamusmiestoimi Muotoluokkaa 06 ei käytetä luokan 36.133 yhteydessä

Hinnat. Hintapolitiikka
type: Concept
References: Monikansalliset yritykset
References: Kuluttajapolitiikka
References: Markkinointi. Kauppa
type: YKL-luokka
alternative label: Elinkustannusindeksit (36.14)
alternative label: Hinnanmuodostus (36.14)
alternative label: Hinnat (36.14)
alternative label: Hintaindeksit (36.14)
alternative label: Hintapolitiikka (36.14)
alternative label: Karteller, prispolitik (36.14) @sv
alternative label: Kartellit, hintapolitiikka (36.14)
alternative label: Konsumentprisindex (36.14) @sv
alternative label: Kuluttajahintaindeksi (36.14)
alternative label: Levnadskostnadsindex (36.14) @sv
alternative label: Markkinat, hinnanmuodostus (36.14)
alternative label: Marknaden, prisbildning (36.14) @sv
alternative label: Monopol, prispolitik (36.14) @sv
alternative label: Monopolit, hintapolitiikka (36.14)
alternative label: Prisbildning (36.14) @sv
alternative label: Priser (36.14) @sv
alternative label: Prisindex (36.14) @sv
alternative label: Prispolitik (36.14) @sv
alternative label: Truster, prispolitik (36.14) @sv
alternative label: Trustit, hintapolitiikka (36.14)
broader: Talouspolitiikka. Taloudelliset rakenteet
in scheme: YKL - Yleisten kirjastojen luokitusjärjestelmä
notation: 36.14
preferred label: Prices. Price policy @en
preferred label: Priser. Prispolitik @sv
scope note: Hit allmänna verk om priser och prispolitik Prisbildning. Prisindex Hit också ekonomiska sammanslutningar av prispolitisk art såsom karteller, monopol och truster Prispolitik som gäller en enskild produkt eller produktgrupp klassificeras enligt område @sv
scope note: Tähän hintoja ja hintapolitiikkaa koskevat yleisteokset Hinnanmuodostus. Hintaindeksit Tähän myös hintapoliittiset taloudelliset yhteenliittymät, kuten kartellit, monopolit ja trustit Tiettyä tuotetta tai tuoteryhmää koskeva hintapolitiikka luokitetaan alan mukaan

Elintaso. Kulutus
type: Concept
References: Valtakunnallinen suunnittelu
References: Seutusuunnittelu
References: Palkkapolitiikka. Tulopolitiikka
References: Kehitysmaiden taloudelliset olot
References: Kuluttajapolitiikka
type: YKL-luokka
alternative label: Deprivation (36.15) @sv
alternative label: Ekokulutus, talouspolitiikka (36.15)
alternative label: Ekologinen kulutus, talouspolitiikka (36.15)
alternative label: Ekologisk konsumtion, ekonomisk politik (36.15) @sv
alternative label: Ekonomisk välfärd, levnadsstandard (36.15) @sv
alternative label: Elintarvikepula (36.15)
alternative label: Elintaso, talouspolitiikka (36.15)
alternative label: Fattigdom, utvecklade länder (36.15) @sv
alternative label: Henkilökohtainen taloudenhoito, kulutus (36.15)
alternative label: Henkilökohtaiset konkurssit (36.15)
alternative label: Huono-osaisuus (36.15)
alternative label: Hyvinvointivaltio (36.15)
alternative label: Hyvinvointiyhteiskunta (36.15)
alternative label: Hållbar konsumtion, ekonomisk politik (36.15) @sv
alternative label: Inkomstbildning (36.15) @sv
alternative label: Inkomstfördelning (36.15) @sv
alternative label: Inkomstskillnader (36.15) @sv
alternative label: Kansantulo (36.15)
alternative label: Kansantuote (36.15)
alternative label: Kerjäläiset (36.15)
alternative label: Kerjääminen (36.15)
alternative label: Kestävä kulutus, talouspolitiikka (36.15)
alternative label: Konkurser, personliga (36.15) @sv
alternative label: Konkurssit, henkilökohtaiset (36.15)
alternative label: Konsumentbeteende (36.15) @sv
alternative label: Konsumtion, ekonomisk politik (36.15) @sv
alternative label: Konsumtionskritik (36.15) @sv
alternative label: Kuluttajakäyttäytyminen (36.15)
alternative label: Kulutus, talouspolitiikka (36.15)
alternative label: Kulutuskritiikki (36.15)
alternative label: Köpbeteende, konsumtion (36.15) @sv
alternative label: Köyhyys, kehittyneet maat (36.15)
alternative label: Levnadsstandard, ekonomisk politik (36.15) @sv
alternative label: Livsmedelsbrist (36.15) @sv
alternative label: Matsäkerhet, utvecklade länder (36.15) @sv
alternative label: Nationalinkomst (36.15) @sv
alternative label: Nationalprodukt (36.15) @sv
alternative label: Ostokäyttäytyminen, kulutus (36.15)
alternative label: Personlig ekonomi, konsumtion (36.15) @sv
alternative label: Personliga konkurser (36.15) @sv
alternative label: Ruokaturva, kehittyneet maat (36.15)
alternative label: Skuldrådgivning (36.15) @sv
alternative label: Skuldsanering, privatpersoner (36.15) @sv
alternative label: Syrjäytyminen, köyhyys (36.15)
alternative label: Taloudellinen hyvinvointi, elintaso (36.15)
alternative label: Tiggare (36.15) @sv
alternative label: Tiggeri (36.15) @sv
alternative label: Tuloerot (36.15)
alternative label: Tulonjako (36.15)
alternative label: Tulonmuodostus (36.15)
alternative label: Utslagning, fattigdom (36.15) @sv
alternative label: Velkajärjestely, yksityishenkilöt (36.15)
alternative label: Velkaneuvonta (36.15)
alternative label: Velkasaneeraus, yksityishenkilöt (36.15)
alternative label: Välfärdssamhälle (36.15) @sv
alternative label: Välfärdsstat (36.15) @sv
alternative label: Ympäristötietoinen kulutus, talouspolitiikka (36.15)
broader: Talouspolitiikka. Taloudelliset rakenteet
in scheme: YKL - Yleisten kirjastojen luokitusjärjestelmä
notation: 36.15
preferred label: Levnadsstandard. Konsumtion @sv
preferred label: Standard of living. Consumption @en
scope note: Hit allmänna verk om levnadsstandard eller konsumtion Nationalinkomst. Nationalproduktion. Inkomstfördelning Ekonomiskt välstånd. Välfärdssamhället Underutveckling och fattigdom i de utvecklade länderna Personliga konkurser Konsumtion av en enskild produkt eller produktgrupp klassificeras enligt område @sv
scope note: Tähän elintasoa tai kulutusta koskevat yleisteokset Kansantulo. Kansantuote. Tulonjakautuminen Taloudellinen hyvinvointi. Hyvinvointiyhteiskunta Alikehitys ja köyhyys kehittyneissä maissa Henkilökohtaiset konkurssit Tiettyä tuotetta tai tuoteryhmää koskeva kulutus luokitetaan alan mukaan

Raha. Valuutta
type: Concept
References: Hinnat. Hintapolitiikka
References: Rahatiede. Mitalitiede
type: YKL-luokka
alternative label: Clearing (36.2)
alternative label: Deflaatio (36.2)
alternative label: Deflation (36.2) @sv
alternative label: Devalvaatio (36.2)
alternative label: Devalvering (36.2) @sv
alternative label: Digitala pengar (36.2+) @sv
alternative label: EMU (36.2)
alternative label: Elektroninen raha (36.2+)
alternative label: Elektroniska betalningsmedel (36.2+) @sv
alternative label: Euroopan rahaliitto (36.2)
alternative label: Europeiska monetära unionen (36.2) @sv
alternative label: Guldmyntfot (36.2) @sv
alternative label: Indeksisidonnaisuus (36.2)
alternative label: Indexbundenhet (36.2) @sv
alternative label: Inflaatio (36.2)
alternative label: Inflation (36.2) @sv
alternative label: Internationell penninghushållning (36.2+) @sv
alternative label: Kansainvälinen rahatalous (36.2+)
alternative label: Kolikot, rahajärjestelmät (36.2)
alternative label: Kultakanta (36.2)
alternative label: Monetära system (36.2) @sv
alternative label: Mynt, monetära system (36.2) @sv
alternative label: Myntenheter (36.2) @sv
alternative label: Myntfotar (36.2) @sv
alternative label: Nätpengar (36.2+) @sv
alternative label: Penningmarknad (36.2+) @sv
alternative label: Penningpolitik (36.2+) @sv
alternative label: Penningteorier (36.2) @sv
alternative label: Penningvärde (36.2) @sv
alternative label: Rahajärjestelmät (36.2)
alternative label: Rahakannat (36.2)
alternative label: Rahamarkkinat (36.2+)
alternative label: Rahanarvo (36.2)
alternative label: Rahapolitiikka (36.2+)
alternative label: Rahateoriat (36.2)
alternative label: Rahayksiköt (36.2)
alternative label: Revalvaatio (36.2)
alternative label: Revalvering (36.2) @sv
alternative label: Riskipääoma, raha- ja valuuttapolitiikka (36.2+)
alternative label: Riskkapital, penning- och valutapolitik (36.2+) @sv
alternative label: Sedlar, monetära system (36.2) @sv
alternative label: Setelit, rahajärjestelmät (36.2)
alternative label: Sähköinen raha (36.2+)
alternative label: Valutakriser (36.2) @sv
alternative label: Valutakurser (36.2) @sv
alternative label: Valutapolitik (36.2+) @sv
alternative label: Valutor (36.2) @sv
alternative label: Valuutat (36.2)
alternative label: Valuuttakriisit (36.2)
alternative label: Valuuttakurssit (36.2)
alternative label: Valuuttapolitiikka (36.2+)
alternative label: Verkkoraha (36.2+)
broader: TALOUSTIEDE. KANSANTALOUSTIEDE
in scheme: YKL - Yleisten kirjastojen luokitusjärjestelmä
narrower: Pankkitoimi. Pörssitoimi. Sijoitustoiminta
notation: 36.2
preferred label: Money. Currency @en
preferred label: Pengar. Valuta @sv
scope note: Penning- och valutapolitik. Penningmarknaden Penningteorier. Penningsystem. Myntfot. Myntenheter Penningvärde. Valutakurser. Clearing Inflation. Deflation. Devalvering. Revalvering Indexbundenhet i allmänhet Hit också internationell finanshushållning och valutapolitik @sv
scope note: Raha- ja valuuttapolitiikka. Rahamarkkinat Rahateoriat. Rahajärjestelmät. Rahakannat. Rahayksiköt Rahanarvo. Valuuttakurssit. Clearing Inflaatio. Deflaatio. Devalvaatio. Revalvaatio Indeksisidonnaisuus yleensä Tähän myös kansainvälinen rahatalous ja valuuttapolitiikka

Pankkitoimi. Pörssitoimi. Sijoitustoiminta
type: Concept
References: Esine- ja velvoiteoikeus
References: Pankkilainsäädäntö
References: Liiketalous
References: Liiketaloudellinen laskentatoimi
alternative label: Affärsbanker (36.22) @sv
alternative label: Aktiesparande (36.22) @sv
alternative label: Andelsbanker (36.22) @sv
alternative label: Andelskassor (36.22) @sv
alternative label: Arbetsplatskassor (36.22) @sv
alternative label: Arvopaperikauppa (36.22)
alternative label: Arvopaperimarkkinat (36.22)
alternative label: Arvopaperit (36.22)
alternative label: Diskontto (36.22)
alternative label: Ekopankit (36.22)
alternative label: Euro, rahayksiköt (36.22)
alternative label: Henkilökohtainen taloudenhoito, sijoittaminen (36.22)
alternative label: Henkilökohtainen taloudenhoito, säästäminen (36.22)
alternative label: IMF (36.22)
alternative label: Investointitoiminta, arvopaperikauppa (36.22)
alternative label: Kansainvälinen valuuttarahasto (36.22)
alternative label: Kansainväliset luottolaitokset (36.22)
alternative label: Keinottelu, osakkeet, valuutta (36.22)
alternative label: Korko, pankkitoimi (36.22)
alternative label: Korkokanta (36.22)
alternative label: Korkopolitiikka (36.22)
alternative label: Lainat, pankkitoimi (36.22)
alternative label: Liikepankit (36.22)
alternative label: Luotto-osuuskunnat (36.22)
alternative label: Luottokortit (36.22)
alternative label: Luottolaitokset (36.22)
alternative label: Luottopolitiikka (36.22)
alternative label: Maailmanpankki (36.22)
alternative label: Maksujärjestelmät, pankkiala (36.22)
alternative label: Maksuliikenne (36.22)
alternative label: Maksupalvelut (36.22)
alternative label: Obligaatiot, valtion (36.22)
alternative label: Osakesäästäminen (36.22)
alternative label: Osingot (36.22)
alternative label: Osuuskassat (36.22)
alternative label: Osuuspankit (36.22)
alternative label: Pankit (36.22)
alternative label: Pankkikortit (36.22)
alternative label: Pankkikriisit (36.22)
alternative label: Pankkitoimi (36.22)
alternative label: Panttilainaamot (36.22)
alternative label: Postipankki (36.22)
alternative label: Pörssikurssit (36.22)
alternative label: Pörssinvälitys (36.22)
alternative label: Pörssit (36.22)
alternative label: Pörssitoimi (36.22)
alternative label: Rahalaitokset (36.22)
alternative label: Rahoitusmarkkinat (36.22)
alternative label: Rahoituspalvelut (36.22)
alternative label: Riskipääoma, pankit (36.22)
alternative label: Riskipääoma, sijoitustoiminta (36.22)
alternative label: Salassapitovelvollisuus, pankkisalaisuus (36.22)
alternative label: Sekit (36.22)
alternative label: Shekit (36.22)
alternative label: Sijoitusoppaat, yksityisille tarkoitetut (36.22)
alternative label: Sijoitustoiminta, arvopaperikauppa (36.22)
alternative label: Suomen Pankki (36.22)
alternative label: Sähköinen asiointi, pankkitoimi (36.22)
alternative label: Sähköinen laskutus, pankkitoimi (36.22)
alternative label: Säästäminen (36.22)
alternative label: Säästökassat (36.22)
alternative label: Säästöpankit (36.22)
alternative label: Työpaikkakassat (36.22)
alternative label: Vaitiolovelvollisuus, pankkisalaisuus (36.22)
alternative label: Valtion obligaatiot (36.22)
alternative label: Vekselit (36.22)
alternative label: Verkkoasiointi, pankkitoimi (36.22)
alternative label: Verkkopankit (36.22)
alternative label: asuntosijoittaminen (36.22)
alternative label: lyhytvuokraus, sijoittaminen (36.22)
broader: Raha. Valuutta
in scheme: YKL - Yleisten kirjastojen luokitusjärjestelmä
notation: 36.22
scope note: Kredit- och räntepolitik i allmänhet. Räntefot Banker och kreditinrättningar samt deras affärsverksamhet Finlands Bank. Affärsbanker. Ekobanker. Andelsbanker. Andelskassor. Sparbanker. Sparkassor. Arbetsplatskassor. Kreditandelslag. Pantlåneanstalter Sparande. Checker. Kredit- och bankkort. Betalningsrörelse Börser. Börskurser. Börsförmedling Värdepappershandel. Aktiesparande. Dividender Placerings- och investeringshandböcker för privatpersoner Hit också internationella banker, kreditinrättningar, börser och internationell värdepappershandel Världsbanken Kreditpolitik för olika områden klassificeras enligt område @sv
scope note: Luotto- ja korkopolitiikka yleensä. Korkokanta Pankit ja luottolaitokset sekä niiden liiketoiminta Suomen Pankki. Liikepankit. Ekopankit. Osuuspankit. Osuuskassat. Säästöpankit. Säästökassat. Työpaikkakassat. Luotto-osuuskunnat. Panttilainaamot Säästäminen. Shekit. Luotto- ja pankkikortit. Maksuliikenne Pörssit. Pörssikurssit. Pörssinvälitys. Arvopaperikauppa. Osakesäästäminen. Osingot Yksityishenkilöille tarkoitetut sijoitusoppaat Tähän myös kansainväliset pankit, luottolaitokset, pörssit ja kansainvälinen arvopaperikauppa Maailmanpankki Eri alojen luottopolitiikka luokitetaan alan mukaan

Vakuutustoimi
type: Concept
References: Vakuutuslainsäädäntö
References: Toimeentuloturva
type: YKL-luokka
alternative label: Betald pension (36.3) @sv
alternative label: Brandförsäkringar (36.3) @sv
alternative label: Byggnadsförsäkringar (36.3) @sv
alternative label: Eläkesäästäminen (36.3)
alternative label: Eläkevakuutus (36.3)
alternative label: Esinevakuutukset (36.3)
alternative label: Frivillig pensionsförsäkring (36.3) @sv
alternative label: Försäkringar (36.3) @sv
alternative label: Försäkringsandelslag (36.3) @sv
alternative label: Försäkringsbolag (36.3) @sv
alternative label: Försäkringsinrättningar (36.3) @sv
alternative label: Försäkringsmatematik (36.3) @sv
alternative label: Försäkringsvillkor (36.3) @sv
alternative label: Försäkringsväsen (36.3) @sv
alternative label: Hemförsäkringar (36.3) @sv
alternative label: Henkilövakuutukset (36.3)
alternative label: Henkivakuutukset (36.3)
alternative label: Internationell försäkringsverksamhet (36.3) @sv
alternative label: Kansainvälinen vakuutustoiminta (36.3)
alternative label: Kotivakuutukset (36.3)
alternative label: Kreditförsäkringar (36.3) @sv
alternative label: Kuljetusvakuutukset (36.3)
alternative label: Liikennevakuutukset (36.3)
alternative label: Livförsäkringar (36.3) @sv
alternative label: Luottovakuutukset (36.3)
alternative label: Matematiikka, vakuutusmatematiikka (36.3)
alternative label: Matematik, försäkringsmatematik (36.3) @sv
alternative label: Matkavakuutukset (36.3)
alternative label: Olycksfallsförsäkringar (36.3) @sv
alternative label: Ostoeläke (36.3)
alternative label: Palovakuutukset (36.3)
alternative label: Pensionförsäkring (36.3) @sv
alternative label: Pensionssparande (36.3) @sv
alternative label: Personförsäkringar (36.3) @sv
alternative label: Rakennusvakuutukset (36.3)
alternative label: Reseförsäkringar (36.3) @sv
alternative label: Sakförsäkringar (36.3) @sv
alternative label: Skadeförsäkringar (36.3) @sv
alternative label: Stöldförsäkringar (36.3) @sv
alternative label: Tapaturmavakuutukset (36.3)
alternative label: Trafikförsäkringar (36.3) @sv
alternative label: Transportförsäkringar (36.3) @sv
alternative label: Vahinkovakuutukset (36.3)
alternative label: Vakuutukset (36.3)
alternative label: Vakuutusehdot (36.3)
alternative label: Vakuutuslaitokset (36.3)
alternative label: Vakuutusmatematiikka (36.3)
alternative label: Vakuutusosuuskunnat (36.3)
alternative label: Vakuutustoimi (36.3)
alternative label: Vakuutusyhtiöt (36.3)
alternative label: Vapaaehtoinen eläkevakuutus (36.3)
alternative label: Varkausvakuutukset (36.3)
broader: TALOUSTIEDE. KANSANTALOUSTIEDE
in scheme: YKL - Yleisten kirjastojen luokitusjärjestelmä
notation: 36.3
preferred label: Försäkringsväsen @sv
preferred label: Insurance activities @en
scope note: Försäkringsmatematik. Försäksingsvillkor Försäkringsinrättningar samt deras affärsverksamhet Försäkringsbolag. Försäkringsandelslag Skadeersättningar. Sak- och byggnadsförsäkringar. Brandförsäkringar. Hemförsäkringar. Stöldförsäkringar. Livförsäkringar. Personförsäkringar. Kreditförsäkringar. Rese-, trafik- och transportförsäkringar. Frivilliga pensionsförsäkringar Hit också internationell försäkringsverksamhet @sv
scope note: Vakuutusmatematiikka. Vakuutusehdot Vakuutuslaitokset sekä niiden liiketoiminta Vakuutusyhtiöt. Vakuutusosuuskunnat Vahinkovakuutukset. Esine- ja rakennusvakuutukset. Palovakuutukset. Kotivakuutukset. Varkausvakuutukset. Henkivakuutukset. Henkilövakuutukset. Luottovakuutukset. Matka-, liikenne- ja kuljetusvakuutukset. Vapaaehtoiset eläkevakuutukset Tähän myös kansainvälinen vakuutustoiminta

Osuustoiminta
type: Concept
References: Pankkitoimi. Pörssitoimi. Sijoitustoiminta
References: Vakuutustoimi
References: Kuluttajapolitiikka
References: Markkinointi. Kauppa
type: YKL-luokka
alternative label: Andelsverksamhet (36.4) @sv
alternative label: Osuustoiminta (36.4)
alternative label: Producentandelslag (36.4) @sv
alternative label: Tuotanto-osuuskunnat (36.4)
broader: TALOUSTIEDE. KANSANTALOUSTIEDE
in scheme: YKL - Yleisten kirjastojen luokitusjärjestelmä
notation: 36.4
preferred label: Cooperatives @en
preferred label: Kooperation @sv
scope note: Hit allmänna verk om kooperation Arbetstagarnas produktionsandelslag i allmänhet Kooperativ verksamhet inom en enskild bransch klassificeras enligt bransch @sv
scope note: Tähän osuustoimintaa koskevat yleisteokset Työntekijöiden tuotanto-osuuskunnat yleensä Tiettyä alaa koskeva osuustoiminta luokitetaan alan mukaan

Julkinen talous. Finanssioppi
type: Concept
References: Julkis- ja hallinto-oikeus
References: Valtionhallinto
References: Kunnallishallinto. Paikallishallinto
References: TALOUSTIEDE. KANSANTALOUSTIEDE
References: Talouspolitiikka. Taloudelliset rakenteet
References: LIIKETALOUS. MARKKINOINTI. KAUPPA. LIIKENNE
type: YKL-luokka
alternative label: Affärsverk, staten (36.5) @sv
alternative label: Ekonomiförvaltning, offentlig ekonomi (36.5+) @sv
alternative label: Finanspolitik (36.5+) @sv
alternative label: Finanssioppi (36.5+)
alternative label: Finanssipolitiikka (36.5+)
alternative label: Finansvetenskap (36.5+) @sv
alternative label: Julkinen talous (36.5+)
alternative label: Julkiset hankinnat (36.5+)
alternative label: Kilpailuttaminen, julkinen talous (36.5+)
alternative label: Kommunal ekonomi (36.5+) @sv
alternative label: Konkurrensutsättning, offentlig ekonomi (36.5+) @sv
alternative label: Kunnallistalous (36.5+)
alternative label: Kuntatalous (36.5)
alternative label: Offentlig ekonomi (36.5+) @sv
alternative label: Offentlig upphandling (36.5+) @sv
alternative label: Statliga lån (36.5+) @sv
alternative label: Statsandelar (36.5+) @sv
alternative label: Statsbidrag (36.5+) @sv
alternative label: Statsbolag (36.5) @sv
alternative label: Statsfinanser (36.5+) @sv
alternative label: Statsunderstöd (36.5+) @sv
alternative label: Taloushallinto, julkinen talous (36.5+)
alternative label: Tariffer, kommunal ekonomi (36.5+) @sv
alternative label: Tariffer, offentlig ekonomi (36.5+) @sv
alternative label: Tariffer, statlig ekonomi (36.5+) @sv
alternative label: Tariffit, julkinen talous (36.5+)
alternative label: Tariffit, kunnallistalous (36.5+)
alternative label: Tariffit, valtiontalous (36.5+)
alternative label: Valtion lainat (36.5+)
alternative label: Valtion liikelaitokset (36.5)
alternative label: Valtionavut (36.5+)
alternative label: Valtionosuudet (36.5+)
alternative label: Valtiontalous (36.5+)
alternative label: Valtiontuet (36.5+)
alternative label: Valtionyhtiöt (36.5)
broader: TALOUSTIEDE. KANSANTALOUSTIEDE
in scheme: YKL - Yleisten kirjastojen luokitusjärjestelmä
narrower: Taloussuunnittelu
narrower: Verotus. Veropolitiikka
narrower: Julkistaloudellinen kirjanpito ja tilintarkastus
notation: 36.5
preferred label: Offentlig ekonomi. Finansvetenskap @sv
preferred label: Public economy. Public finance @en
scope note: Hit och till underklasserna allmänna verk om offentlig ekonomi, finanspolitik eller finansvetenskap Statsfinanser. Kommunalekonomi Hit också allmänna verk om statens och kommunernas egendom eller affärsverksamhet Ekonomiska frågor inom specialområden samt offentliga företag och affärsverk inom specialområden klassificeras enligt område @sv
scope note: Tähän ja alaluokkiin julkista taloutta, finanssipolitiikkaa tai finanssioppia koskevat yleisteokset Valtiontalous. Kunnallistalous Tähän myös valtion ja kuntien omaisuutta tai liiketoimintaa koskevat yleisteokset Erikoisalojen taloudelliset kysymykset sekä erikoisalojen julkiset yritykset tai liikelaitokset luokitetaan alan mukaan

Taloussuunnittelu
type: Concept
References: ALUESUUNNITTELU. ALUEPOLITIIKKA
References: Kunnallishallinto. Paikallishallinto
References: URN:NBN:fi:au:ykl:35.405
References: Julkistaloudellinen kirjanpito ja tilintarkastus
References: Liiketaloudellinen laskentatoimi
type: YKL-luokka
alternative label: Ekonomisk planering, kommuner (36.51) @sv
alternative label: Ekonomisk planering, offentlig ekonomi (36.51) @sv
alternative label: Ekonomisk planering, staten (36.51) @sv
alternative label: Finansmatematik (36.51) @sv
alternative label: Finanssimatematiikka (36.51)
alternative label: Julkistaloudellinen laskentatoimi (36.51)
alternative label: Laskentatoimi, julkistaloudellinen (36.51)
alternative label: Matematiikka, finanssimatematiikka (36.51)
alternative label: Matematik, finansmatematik (36.51) @sv
alternative label: Offentlig ekonomi, redovisning (36.51) @sv
alternative label: Redovisning, offentlig ekonomi (36.51) @sv
alternative label: Statens finansförvaltning (36.51) @sv
alternative label: Statsfinanser, budgetering (36.51) @sv
alternative label: Statsfinanser, planering (36.51) @sv
alternative label: Taloussuunnittelu, julkinen talous (36.51)
alternative label: Taloussuunnittelu, kunnat (36.51)
alternative label: Taloussuunnittelu, valtio (36.51)
alternative label: Valtiontalous, suunnittelu (36.51)
alternative label: Valtiontalous, talousarvion laadinta (36.51)
alternative label: Valtiovarainhallinto (36.51)
broader: Julkinen talous. Finanssioppi
in scheme: YKL - Yleisten kirjastojen luokitusjärjestelmä
notation: 36.51
preferred label: Budgetary planning @en
preferred label: Ekonomisk planering @sv
scope note: Julkisen talouden suunnittelu yleensä Valtion taloussuunnittelu. Kuntien taloussuunnittelu Valtion ja kuntien talousarvioiden laadinta Julkistaloudellinen laskentatoimi Erikoisalojen taloussuunnittelu luokitetaan alan mukaan Valtion ja kuntien talousarviot 36.5105
scope note: Planering av offentlig ekonomi i allmänhet Statens och kommunernas ekonomiska planering Budgetering i staten och kommunerna Redovisning inom den offentliga ekonomin Ekonomisk planering inom specialområden klassificeras enligt område Statens och kommunernas budgetar 36.5105 @sv

Verotus. Veropolitiikka
type: Concept
References: Suomen evankelis-luterilainen kirkko
References: Vero-oikeus
References: Kirkko-oikeus
References: Rikosoikeus
type: YKL-luokka
alternative label: Alv (36.52)
alternative label: Arv, beskattning (36.52) @sv
alternative label: Arvonlisävero (36.52)
alternative label: Arvsskatt, skattepolitik (36.52) @sv
alternative label: Beskattning av gårdsbruk (36.52) @sv
alternative label: Beskattning, offentlig ekonomi (36.52) @sv
alternative label: Bruksavgifter, av skattenatur (36.52) @sv
alternative label: Dividender, beskattning (36.52) @sv
alternative label: Elinkeinolupamaksut, veroluonteiset (36.52)
alternative label: Elinkeinoverotus (36.52)
alternative label: Företagsbeskattning (36.52) @sv
alternative label: Förmögenhetsskatt (36.52) @sv
alternative label: Förmögenhetsskatt, skattepolitik (36.52) @sv
alternative label: Gåvoskatt, skattepolitik (36.52) @sv
alternative label: Haittaverot (36.52)
alternative label: Hundskatt (36.52) @sv
alternative label: Inkomst- och förmögenhetsskatt, skattepolitik (36.52) @sv
alternative label: Koiravero (36.52)
alternative label: Kommunalbeskattning (36.52) @sv
alternative label: Konsumtionsskatter (36.52) @sv
alternative label: Kulutusverot (36.52)
alternative label: Kunnallisverotus (36.52)
alternative label: Käyttömaksut, veroluonteiset (36.52)
alternative label: Lahjavero, veropolitiikka (36.52)
alternative label: Liikevaihtovero, veropolitiikka (36.52)
alternative label: Liikeverotus (36.52)
alternative label: Maatalousverotus (36.52)
alternative label: Mervärdesskatt (36.52) @sv
alternative label: Miljöskatt (36.52) @sv
alternative label: Moms (36.52) @sv
alternative label: Näringsbeskattning (36.52) @sv
alternative label: Näringstillståndsavgifter (36.52) @sv
alternative label: Näringstillståndsavgifter av skattenatur (36.52) @sv
alternative label: Omaisuusvero, veropolitiikka (36.52)
alternative label: Omsättningsskatt, skattepolitik (36.52) @sv
alternative label: Osingot, verotus (36.52)
alternative label: Perinnöt, verotus (36.52)
alternative label: Perintövero, veropolitiikka (36.52)
alternative label: Sambeskattning (36.52) @sv
alternative label: Skatteavdrag (36.52) @sv
alternative label: Skattedeklarationer (36.52) @sv
alternative label: Skattehandledningar (36.52) @sv
alternative label: Skattelättnader (36.52) @sv
alternative label: Skattemässiga bruksavgifter (36.52) @sv
alternative label: Skatteplanering (36.52) @sv
alternative label: Skattepolitik (36.52) @sv
alternative label: Statsbeskattning (36.52) @sv
alternative label: Tulo- ja omaisuusvero, veropolitiikka (36.52)
alternative label: Valtionverotus (36.52)
alternative label: Varallisuusvero (36.52)
alternative label: Vero-oppaat (36.52)
alternative label: Verohelpotukset (36.52)
alternative label: Veroilmoitukset, laadinta (36.52)
alternative label: Veroluonteiset elinkeinolupamaksut (36.52)
alternative label: Veroluonteiset käyttömaksut (36.52)
alternative label: Veropolitiikka (36.52)
alternative label: Verosuunnittelu (36.52)
alternative label: Verotus, julkinen talous (36.52)
alternative label: Verovähennykset (36.52)
alternative label: Yhteisverotus (36.52)
alternative label: Yritysverotus (36.52)
alternative label: arvskifte, beskattning (36.52) @sv
alternative label: perinnönjako, verotus (36.52)
broader: Julkinen talous. Finanssioppi
in scheme: YKL - Yleisten kirjastojen luokitusjärjestelmä
notation: 36.52
preferred label: Beskattning. Skattepolitik @sv
preferred label: Taxation. Tax policy @en
scope note: Statsbeskattning. Kommunalbeskattning Hit också särskilda skatter för olika områden Inkomstskatt. Förmögenhetsskatt. Omsättningsskatt Mervärdesskatt. Konsumtionsskatt. Miljöskatter Bruksavgifter och näringstillstånd av skattekaraktär Skattelättnader. Skatteavdrag Information om beskattning och skatteplanering för privatpersoner, organisationer och företag Skattedeklarationer och hur man deklarerar Skattekalendrar 36.52053 @sv
scope note: Valtionverotus. Kunnallisverotus Tähän myös eri aloja koskevat erityisverot Tulovero. Omaisuusvero. Varallisuusvero Liikevaihtovero. Arvonlisävero. Kulutusverot. Haittaverot Veronluonteiset käyttömaksut ja elinkeinolupamaksut Verohelpotukset. Verovähennykset Yksityisten, yhteisöjen ja yritysten vero-oppaat ja verosuunnittelu Veroilmoitukset ja niiden laadinta Verokalenterit 36.52053

Julkistaloudellinen kirjanpito ja tilintarkastus
type: Concept
References: Kirjanpito- ja tilintarkastuslainsäädäntö
References: Taloussuunnittelu
References: Liiketaloudellinen kirjanpito ja tilintarkastus
type: YKL-luokka
alternative label: Bokföring, offentlig ekonomi (36.53) @sv
alternative label: Bokslut, offentlig ekonomi (36.53) @sv
alternative label: Julkistaloudellinen kirjanpito ja tilintarkastus (36.53)
alternative label: Kirjanpito, julkistaloudellinen (36.53)
alternative label: Kommunal ekonomi, bokföring och revision (36.53) @sv
alternative label: Kunnallistalous, kirjanpito ja tilintarkastus (36.53)
alternative label: Offentlig ekonomi, bokföring och revision (36.53) @sv
alternative label: Revision, offentlig ekonomi (36.53) @sv
alternative label: Räkenskapsföring, offentlig ekonomi (36.53) @sv
alternative label: Statsfinanser, bokföring och revision (36.53) @sv
alternative label: Tilinpito, julkistalous (36.53)
alternative label: Tilinpäätös, julkistalous (36.53)
alternative label: Tilintarkastus, julkistalous (36.53)
alternative label: Valtiontalous, kirjanpito ja tilintarkastus (36.53)
broader: Julkinen talous. Finanssioppi
in scheme: YKL - Yleisten kirjastojen luokitusjärjestelmä
notation: 36.53
preferred label: Bokföring och redovisning inom den offentliga ekonomin @sv
preferred label: Public finance bookkeeping and auditing @en
scope note: Bokföring och redovisning inom statsekonomin och kommunalekonomin @sv
scope note: Valtion- ja kunnallistalouden kirjanpito ja tilintarkastus

Kansainvälinen talous. Maailmankauppa
type: Concept
References: Kansainvälinen politiikka
References: Poliisitoimi. Yleinen turvallisuus
References: Talouspolitiikka. Taloudelliset rakenteet
References: Raha. Valuutta
References: Orgaaniset ja fossiiliset polttoaineet
alternative label: Betalningsbalanser, internationell ekonomi (36.6+) @sv
alternative label: Bytesbalanser, övriga länder (36.6+) @sv
alternative label: Digital ekonomi, internationell ekonomi (36.6+) @sv
alternative label: Ekonomisk integration, internationell ekonomi (36.6+) @sv
alternative label: Ekonomiska relationer, internationella (36.6+) @sv
alternative label: Ekonomiska sanktioner, internationell ekonomi (36.6+) @sv
alternative label: Export, utrikeshandel (36.6+) @sv
alternative label: Frihandel (36.6+) @sv
alternative label: GATT (36.6+)
alternative label: Gemensamma marknaden (36.6+) @sv
alternative label: Geografi, handelsgeografi (36.6+) @sv
alternative label: Globalisaatio, kansainvälinen talous (36.6+)
alternative label: Globalisering, internationell ekonomi (36.6+) @sv
alternative label: Handel, utrikeshandel (36.6+) @sv
alternative label: Handel, världshandel (36.6+) @sv
alternative label: Handelsavtal, internationell handel (36.6+) @sv
alternative label: Handelsbalanser, internationell ekonomi (36.6+) @sv
alternative label: Handelsgeografi (36.6+) @sv
alternative label: Handelspolitik (36.6+) @sv
alternative label: Imperialism, internationell ekonomi (36.6+) @sv
alternative label: Imperialismi, kansainvälinen talous (36.6+)
alternative label: Import, utrikeshandel (36.6+) @sv
alternative label: Internationell ekonomi (36.6+) @sv
alternative label: Internationell handel (36.6+) @sv
alternative label: Internationella, överenskommelser, handelsavtal (36.6+) @sv
alternative label: Kansainvälinen kauppa (36.6+)
alternative label: Kansainvälinen talous (36.6+)
alternative label: Kansainväliset sopimukset, kauppasopimukset (36.6+)
alternative label: Kauppa, maailmankauppa (36.6+)
alternative label: Kauppa, ulkomaankauppa (36.6+)
alternative label: Kauppamaantiede (36.6+)
alternative label: Kauppapolitiikka (36.6+)
alternative label: Kauppasopimukset, kansainvälinen kauppa (36.6+)
alternative label: Kauppataseet, kansainvälinen talous (36.6+)
alternative label: Kilpailukyky, ulkomaankauppa (36.6+)
alternative label: Kilpailupolitiikka (36.6+)
alternative label: Konkurrenskraft, utrikeshandel (36.6+) @sv
alternative label: Konkurrenspolitik (36.6+) @sv
alternative label: Maailmankauppa (36.6+)
alternative label: Maailmantalous (36.6+)
alternative label: Maantiede, kauppamaantiede (36.6+)
alternative label: Maksutaseet, kansainvälinen talous (36.6+)
alternative label: Markkinat, kansainvälinen talous (36.6+)
alternative label: Marknaden, internationell ekonomi (36.6+) @sv
alternative label: Ny ekonomisk världsordning (36.6+) @sv
alternative label: Oljekriser, världsekonomin (36.6+) @sv
alternative label: Rooman klubi (36.6+)
alternative label: Suojelutullit (36.6+)
alternative label: Taloudellinen yhdentyminen, kansainvälinen talous (36.6+)
alternative label: Taloudelliset pakotteet, kansainvälinen talous (36.6+)
alternative label: Taloudelliset suhteet, kansainväliset (36.6+)
alternative label: Tulliliitot (36.6+)
alternative label: Tullipolitiikka (36.6+)
alternative label: Tullisopimukset (36.6+)
alternative label: Tuonti, ulkomaankauppa (36.6+)
alternative label: UKTJ (36.6+)
alternative label: Ulkomaankauppa (36.6+)
alternative label: Uusi kansainvälinen taloudellinen järjestelmä (36.6+)
alternative label: Uusi talous, kansainvälinen talous (36.6+)
alternative label: Vaihtotaseet, kansainvälinen talous (36.6+)
alternative label: Vapaakauppa (36.6+)
alternative label: Vienti, ulkomaankauppa (36.6+)
alternative label: WTO (36.6)
alternative label: Yhteismarkkinat (36.6+)
alternative label: Öljykriisit, maailmantalous (36.6+)
broader: TALOUSTIEDE. KANSANTALOUSTIEDE
in scheme: YKL - Yleisten kirjastojen luokitusjärjestelmä
narrower: Kansainväliset talousjärjestöt
narrower: Monikansalliset yritykset
narrower: Suomen ulkomaankauppa
narrower: Kehitysmaiden taloudelliset olot
notation: 36.6
scope note: Hit och till underklasserna allmänna verk om internationella ekonomiska eller handelspolitiska relationer och deras utveckling Hit och till underklasserna också allmänna verk om världshandel och handelsgeografi samt olika länders utrikeshandel och handelspolitik Hit och till underklasserna också olika länders handelsbalans i utrikeshandeln, handels- och skatteavtal, tullpolitik, tullavtal och skyddstullar Hit också ekonomisk integration, GATT, WTO och frihandel i allmänhet Världs- och utrikeshandel samt handelsgeografi som gäller en enskild produkt klassificeras enligt produkt Finlands utrikeshandel 36.63 @sv
scope note: Tähän ja alaluokkiin kansainvälisiä taloudellisia tai kauppapoliittisia suhteita ja niiden kehitystä koskevat yleisteokset Tähän ja alaluokkiin myös maailmankaupan, kauppamaantieteen sekä eri maiden ulkomaankaupan ja kauppapolitiikan yleisteokset Tähän ja alaluokkiin myös eri maiden ulkomaankaupan kauppataseet, kauppa- ja verotus- sopimukset, tullipolitiikka, tullisopimukset ja suojelutullit Tähän myös taloudellinen yhdentyminen ja vapaakauppa yleensä. GATT. WTO Tiettyä tuotetta koskeva maailman- ja ulkomaankauppa sekä kauppamaantiede luokitetaan ko. tuotteen mukaiseen luokkaan Suomen ulkomaankauppa 36.63

Kansainväliset talousjärjestöt
type: Concept
References: Kansainvälinen yhteistyö
References: Kansainväliset järjestöt
References: OIKEUSTIEDE
References: Pankkitoimi. Pörssitoimi. Sijoitustoiminta
References: Suomen ulkomaankauppa
type: YKL-luokka
alternative label: CMEA (36.61)
alternative label: COMECON (36.61)
alternative label: EC (36.61)
alternative label: EEC (36.61)
alternative label: EEG (36.61) @sv
alternative label: EES (36.61)
alternative label: EFTA (36.61)
alternative label: ETA (36.61)
alternative label: EU, ekonomi (36.61) @sv
alternative label: EU, talous (36.61)
alternative label: Euroopan talousyhteisö (36.61)
alternative label: Euroopan unioni, talous (36.61)
alternative label: Euroopan yhteismarkkinat (36.61)
alternative label: Europeiska ekonomiska gemenskapen (36.61) @sv
alternative label: Europeiska gemensamma marknaden (36.61) @sv
alternative label: Europeiska unionen, ekonomi (36.61) @sv
alternative label: Integraatio, taloudellinen (36.61)
alternative label: Integration, ekonomisk (36.61) @sv
alternative label: Internationella ekonomiska organisationer (36.61) @sv
alternative label: Kansainväliset talousjärjestöt (36.61)
alternative label: Komekon (36.61)
alternative label: NAFTA (36.61)
alternative label: NORDEK (36.61)
alternative label: OECD (36.61)
alternative label: SEV (36.61)
broader: Kansainvälinen talous. Maailmankauppa
in scheme: YKL - Yleisten kirjastojen luokitusjärjestelmä
notation: 36.61
preferred label: International economic organisations @en
preferred label: Internationella ekonomiska organisationer @sv
scope note: Hit t.ex. EEG, EG, EES, EFTA, NAFTA och OECD och deras ekonomiska politik samt deras integrations-, handels-, tull- och frihandelspolitik Hit även Europeiska unionen som ekonomisk organisation @sv
scope note: Tähän esim. EC, EEC, EES, EFTA, OECD ja NAFTA sekä niiden harjoittama talous-, yhdentymis-, kauppa-, tulli- ja vapaakauppapolitiikka Tähän myös Euroopan unioni talousjärjestönä

Monikansalliset yritykset
type: Concept
References: Suomen ulkomaankauppa
References: LIIKETALOUS. MARKKINOINTI. KAUPPA. LIIKENNE
type: YKL-luokka
alternative label: Företag, multinationella (36.62) @sv
alternative label: Internationella företag (36.62) @sv
alternative label: Kansainväliset yritykset (36.62)
alternative label: Monikansalliset yritykset (36.62)
alternative label: Multinationella företag (36.62) @sv
alternative label: Yritykset, monikansalliset (36.62)
broader: Kansainvälinen talous. Maailmankauppa
in scheme: YKL - Yleisten kirjastojen luokitusjärjestelmä
notation: 36.62
preferred label: Multinational companies @en
preferred label: Multinationella företag @sv
scope note: Hit allmänna verk om multinationella företag Multinationella företag inom en enskild bransch klassificeras enligt bransch @sv
scope note: Tähän monikansallisia yrityksiä koskevat yleisteokset Tietyn alan monikansalliset yritykset luokitetaan alan mukaan

Suomen ulkomaankauppa
type: Concept
References: Suomen ulkopolitiikka
References: Poliisitoimi. Yleinen turvallisuus
References: Kehitysmaiden taloudelliset olot
References: Markkinointi. Kauppa
type: YKL-luokka
alternative label: Betalningsbalans, Finland (36.63) @sv
alternative label: Bytesbalans, Finland (36.63) @sv
alternative label: Export, utrikeshandel, Finland (36.63) @sv
alternative label: Gränshandel, Finland (36.63) @sv
alternative label: Handel, utrikeshandel, Finland (36.63) @sv
alternative label: Handelsavtal, Finland (36.63) @sv
alternative label: Handelsbalans, Finland (36.63) @sv
alternative label: Handelspolitik, Finland (36.63) @sv
alternative label: Idänkauppa, Suomi (36.63)
alternative label: Import, utrikeshandel, Finland (36.63) @sv
alternative label: Kauppa, ulkomaankauppa, Suomi (36.63)
alternative label: Kauppapolitiikka, Suomi (36.63)
alternative label: Kauppasopimukset, Suomi (36.63)
alternative label: Kauppatase, Suomi (36.63)
alternative label: Kilpailukyky, ulkomaankauppa, Suomi (36.63)
alternative label: Konkurrenskraft, utrikeshandel, Finland (36.63) @sv
alternative label: Länsikauppa, Suomi (36.63)
alternative label: Maksutase, Suomi (36.63)
alternative label: Rajakauppa, Suomi (36.63)
alternative label: Tullipolitiikka, Suomi (36.63)
alternative label: Tullpolitik, Finland (36.63) @sv
alternative label: Tuonti, ulkomaankauppa, Suomi (36.63)
alternative label: Ulkomaankauppa, Suomi (36.63)
alternative label: Utrikeshandel, Finland (36.63) @sv
alternative label: Vaihtotase, Suomi (36.63)
alternative label: Vienti, ulkomaankauppa, Suomi (36.63)
alternative label: Västhandel, Finland (36.63) @sv
alternative label: Östhandel, Finland. (36.63) @sv
broader: Kansainvälinen talous. Maailmankauppa
in scheme: YKL - Yleisten kirjastojen luokitusjärjestelmä
notation: 36.63
preferred label: Finland's foreign trade @en
preferred label: Finlands utrikeshandel @sv
scope note: Hit allmänna verk om Finlands utrikeshandel Finlands ställning i världshandeln och världsekonomin Finlands handelsbalans, handelspolitik, handelsavtal och tullpolitik Finlands internationella konkurrenskraft Östhandeln. Västhandeln. Gränshandeln Hit också Finlands ekonomiska relationer och handelsrelationer till internationella ekonomiska organisationer och multinationella företag Hit också handeln mellan Finland och utvecklingsländerna Utrikeshandel som rör en enskild produkt klassificeras enligt produkt Om ett arbete om Finlands utrikeshandel gäller både samhällsekonomi och företagsekonomi, ges företräde åt klass 36.63 @sv
scope note: Tähän Suomen ulkomaankaupan yleisteokset Suomen asema maailmankaupassa ja -taloudessa Suomen kauppatase, kauppapolitiikka, kauppasopimukset ja tullipolitiikka Suomen kansainvälinen kilpailukyky Idänkauppa. Länsikauppa. Rajakauppa Tähän myös Suomen taloudelliset ja kaupalliset suhteet kansainvälisiin talousjärjestöihin ja monikansallisiin yrityksiin Tähän myös Suomen ja kehitysmaiden välinen kauppa Tiettyä tuotetta koskeva ulkomaankauppa luokitetaan ko. tuotteen mukaiseen luokkaan Jos Suomen ulkomaankauppaa koskevassa teoksessa on sekä kansantaloutta että liiketaloutta, annetaan etusija luokalle 36.63

Kehitysmaiden taloudelliset olot
type: Concept
References: Kansainvälinen yhteistyö
References: Kansainväliset järjestöt
References: Elintaso. Kulutus
References: Suomen ulkomaankauppa
References: Ympäristönsuojelu. Luonnonsuojelu
References: Maatalouspolitiikka
type: YKL-luokka
alternative label: Alikehitys, kehitysmaat (36.68)
alternative label: Aliravitsemus, kehitysmaat (36.68)
alternative label: Betalningsbalanser, utvecklingsländer (36.68) @sv
alternative label: Bytesbalanser, utvecklingsländer (36.68) @sv
alternative label: Elintarvikepula, kehitysmaat (36.68)
alternative label: Fattigdom, utvecklingsländer (36.68) @sv
alternative label: Handelsbalanser, utvecklingsländer (36.68) @sv
alternative label: Hungersnöd, utvecklingsländer (36.68) @sv
alternative label: Katastrofhjälp, utvecklingsbistånd (36.68) @sv
alternative label: Katastrofiapu, kehitysyhteistyö (36.68)
alternative label: Kauppataseet, kehitysmaat (36.68)
alternative label: Kehitysapu (36.68)
alternative label: Kehitysmaat, taloudelliset olot (36.68)
alternative label: Kehitysmaat, talouspolitiikka (36.68)
alternative label: Kehitysmaat, velkaantuminen (36.68)
alternative label: Kehitysyhteistyö (36.68)
alternative label: Kolmas maailma, talouspolitiikka (36.68)
alternative label: Köyhyys, kehitysmaat (36.68)
alternative label: Livsmedelsbrist, utvecklingsländer (36.68) @sv
alternative label: Maksutaseet, kehitysmaat (36.68)
alternative label: Matsäkerhet, utvecklingsländer (36.68) @sv
alternative label: Nälänhätä, kehitysmaat (36.68)
alternative label: Näringsämnesbrist, utvecklingsländer (36.68) @sv
alternative label: Ravintoainepula, kehitysmaat (36.68)
alternative label: Ruokaturva, kehitysmaat (36.68)
alternative label: Samarbete, utvecklingssamarbete (36.68) @sv
alternative label: Tredje världen, ekonomisk politik (36.68) @sv
alternative label: Undernäring, utvecklingsländerna (36.68) @sv
alternative label: Underutveckling, utvecklingsländerna (36.68) @sv
alternative label: Utvecklingsbistånd (36.68) @sv
alternative label: Utvecklingsländer, ekonomisk politik (36.68) @sv
alternative label: Utvecklingsländer, ekonomiska förhållanden (36.68) @sv
alternative label: Utvecklingsländer, skuldsättning (36.68) @sv
alternative label: Utvecklingssamarbete (36.68) @sv
alternative label: Vaihtotaseet, kehitysmaat (36.68)
alternative label: Yhteistyö, kehitysyhteistyö (36.68)
broader: Kansainvälinen talous. Maailmankauppa
in scheme: YKL - Yleisten kirjastojen luokitusjärjestelmä
notation: 36.68
preferred label: Economic conditions of developing countries @en
preferred label: Ekonomiska förhållanden i utvecklingsländerna @sv
scope note: Hit allmänna verk om utvecklingsländernas ekonomiska problem och ekonomiska politik Hit också allmänna verk om handel mellan utvecklingsländer och utvecklade länder och de ekonomiska relationerna dem emellan Handelsgeografi och ekonomisk geografi som rör utvecklingsländerna Skuldsättning i utvecklingsländerna Fattigdom och svält i utvecklingsländerna Utvecklingsbistånd. Utvecklingssamarbete Hit också Finlands utvecklingsbistånd och utvecklingssamarbete Verk om enskilda produkter från utvecklingsländerna klassificeras enligt produkt Utvecklingssamarbete som hör till ett specialområde klassificeras enligt område @sv
scope note: Tähän kehitysmaiden talousongelmia ja talouspolitiikkaa koskevat yleisteokset Tähän myös kehitysmaiden ja kehittyneiden maiden välistä kauppaa ja niiden välisiä taloudellisia suhteita koskevat yleisteokset Kehitysmaita koskeva kauppa- ja talousmaantiede Kehitysmaiden velkaantuminen Köyhyys ja nälänhätä kehitysmaissa Kehitysapu. Kehitysyhteistyö Tähän myös Suomen harjoittama kehitysapu- ja kehitysyhteistyötoiminta Tiettyä kehitysmaan tuotetta koskevat teokset sijoitetaan ko. tuotteen luokkaan Tiettyyn erikoisalaan liittyvä kehitysyhteistyö luokitetaan alan mukaan

SOSIAALIPOLITIIKKA
type: Concept
References: Sosiologia
References: Sosiaalioikeus
References: ALUESUUNNITTELU. ALUEPOLITIIKKA
References: Talouspolitiikka. Taloudelliset rakenteet
References: KASVATUS. OPETUS. KASVATUSTIEDE
References: Yleinen terveydenhoito
References: MAAILMANHISTORIA. EUROOPAN HISTORIA
References: SUOMEN HISTORIA
References: POHJOISMAIDEN HISTORIA
References: KESKI-EUROOPAN HISTORIA
References: BRITTEINSAARTEN HISTORIA
References: ETELÄ-EUROOPAN HISTORIA
References: ITÄ-EUROOPAN HISTORIA
References: MUIDEN MAANOSIEN HISTORIA
alternative label: Anstaltsvård, socialpolitik (37+) @sv
alternative label: Auttaminen (37+)
alternative label: Auttamistyö (37+)
alternative label: Avustustoiminta (37+)
alternative label: Basservice, allm. (37) @sv
alternative label: Deprivation, socialpolitik (37+) @sv
alternative label: Esteettömyys, sosiaalipolitiikka (37+)
alternative label: Familjevård, socialvård (37+) @sv
alternative label: Fattigdom, socialpolitik (37+) @sv
alternative label: Fattigvård (37+) @sv
alternative label: Försörjningskvot, socialpolitik (37+) @sv
alternative label: Hinderslöshet, socialpolitik (37+) @sv
alternative label: Hjälp (37+) @sv
alternative label: Hjälparbete (37+) @sv
alternative label: Hjälpverksamhet (37+) @sv
alternative label: Huoltosuhde, sosiaalipolitiikka (37+)
alternative label: Huono-osaisuus, sosiaalipolitiikka (37+)
alternative label: Hyvinvointiala, yl. (37)
alternative label: Hyvinvointipalvelut, yl. (37)
alternative label: Hyvinvointivaltio, sosiaalipolitiikka (37+)
alternative label: Hyvinvointiyhteiskunta, sosiaalipolitiikka (37+)
alternative label: Institutionsvård, socialpolitik (37+) @sv
alternative label: Jämförelsegrupper, socialpolitik (37+) @sv
alternative label: Kommunal socialvård, allm. (37) @sv
alternative label: Kunnallinen sosiaalitoimi, yl. (37)
alternative label: Köyhyys, sosiaalipolitiikka (37+)
alternative label: Köyhäinhoito (37+)
alternative label: Laitoshoito, sosiaalipolitiikka (37+)
alternative label: Laitoshuolto, sosiaalipolitiikka (37+)
alternative label: Motiverande samtal, socialt arbete (37+) @sv
alternative label: Motivoiva keskustelu, sosiaalityö (37+)
alternative label: Oma-apuryhmät, sosiaalipolitiikka (37+)
alternative label: Palvelut, sosiaalipalvelut (37+)
alternative label: Patientstöd, socialpolitik (37+) @sv
alternative label: Perhehoito, sosiaalihuolto (37+)
alternative label: Peruspalvelut, yl. (37)
alternative label: Saavutettavuus, sosiaalipalvelut (37+)
alternative label: Samhällspolitik, socialpolitik (37+) @sv
alternative label: Service, social service (37+) @sv
alternative label: Självhjälpsgrupper, socialpolitik (37+) @sv
alternative label: Sosiaali- ja terveysala (37)
alternative label: Sosiaali- ja terveyshallinto (37+)
alternative label: Sosiaaliala, yl. (37)
alternative label: Sosiaalinen ajattelu, yl. (37)
alternative label: Sosiaalipoliittiset järjestelmät, yl. (37)
alternative label: Sosiaalipolitiikka, yl. (37)
alternative label: Sosiaaliset ongelmat, sosiaalipolitiikka (37)
alternative label: Sosiaalitieteet (37+)
alternative label: Sosiaalitoimi, yl. (37)
alternative label: Syrjäytyminen, sosiaalipolitiikka (37+)
alternative label: Vertaisryhmät, sosiaalipolitiikka (37+)
alternative label: Vertaistuki, sosiaalipolitiikka (37+)
alternative label: Yhteiskuntapolitiikka, sosiaalipolitiikka (37+)
broader: YHTEISKUNTA
in scheme: YKL - Yleisten kirjastojen luokitusjärjestelmä
narrower: Työsuojelu. Ergonomia
narrower: Sosiaaliturvapolitiikka
narrower: Perhepolitiikka
narrower: Asuntopolitiikka
narrower: Päihdepolitiikka. Päihdehuolto
narrower: Yksityinen avustus- ja huoltotyö
narrower: Kuluttajapolitiikka
notation: 37
scope note: Hit allmänna verk om socialpolitik, socialt tänkande och socialpolitiska system i olika länder Välfärdssektorn i allmänhet. Socialsektorn i allmänhet Hit också allmänna verk om samhällspolitik Hit och till underklasserna statlig, kommunal och privat socialpolitik och socialpolitisk verksamhet samt administration, organisation och finansiering av socialtjänst Om verket innehåller både socialpolitik och sociologi, ges företräde åt klass 37+ Om verket innehåller både social- och hälsovårdspolitik, ges företräde åt klass 37+ Allmänna verk om socialpolitik, socialt tänkande och historia som behandlar olika länders socialpolitiska system 37.09 Social services åtkomlighet 37+ @sv
scope note: Tähän sosiaalipolitiikkaa, sosiaalista ajattelua ja eri maiden sosiaalipoliittisia järjestelmiä koskevat yleisteokset Hyvinvointiala yleensä. Sosiaaliala yleensä Tähän myös yhteiskuntapolitiikan yleisteokset Tähän ja alaluokkiin valtiollinen, kunnallinen ja yksityinen sosiaalipolitiikka ja sosiaalipoliittinen toiminta sekä sosiaalitoimen hallinto, organisaatio ja rahoitus Jos teoksessa on sekä sosiaalipolitiikkaa että sosiologiaa, annetaan etusija luokalle 37+ Jos teoksessa on sekä sosiaali- että terveys- politiikkaa, annetaan etusija luokalle 37+ Sosiaalipolitiikan, sosiaalisen ajattelun ja eri maiden sosiaalipoliittisten järjestelmien historian yleisteokset 37.09 Sosiaalipalvelujen saavutettavuus 37+

Työsuojelu. Ergonomia
type: Concept
References: Työoikeus
References: Työ. Työelämä
References: Työvoimapolitiikka
References: Palkkapolitiikka. Tulopolitiikka
References: Työmarkkinajärjestöt
References: Toimeentuloturva
References: Työterveyshuolto. Opiskeluterveydenhuolto Kouluterveydenhoitajan työ
References: Mielenterveys. Tunne-elämän häiriöt
References: Henkilöstöpolitiikka
References: Kuntoliikunta. Kuntourheilu
type: YKL-luokka
alternative label: Ammattientarkastus (37.1+)
alternative label: Arbetarskydd (37.1+) @sv
alternative label: Arbetarskydd, ergonomi (37.1+) @sv
alternative label: Arbetarskyddsfullmäktige (37.1+) @sv
alternative label: Arbetarskyddsförvaltning (37.1+) @sv
alternative label: Arbetarskyddskommissioner (37.1+) @sv
alternative label: Arbetarskyddsteknik (37.1+) @sv
alternative label: Arbetarskyddsövervakning (37.1+) @sv
alternative label: Arbetshälsa (37.1) @sv
alternative label: Arbetshälsa, arbetarskydd (37.1+) @sv
alternative label: Arbetskläder (37.1+) @sv
alternative label: Arbetssäkerhet (37.1+) @sv
alternative label: Arbetstrivsel, arbetarskydd (37.1) @sv
alternative label: Bildskärmsarbete, arbetarskydd (37.1+) @sv
alternative label: Dataterminaler, arbetarskydd (37.1+) @sv
alternative label: Datorterminaler, arbetarskydd (37.1+) @sv
alternative label: Ergonomi (37.1+) @sv
alternative label: Ergonomia (37.1+)
alternative label: Fysiskt arbetarskydd (37.1+) @sv
alternative label: Fyysinen työsuojelu (37.1+)
alternative label: Henkinen työsuojelu (37.1)
alternative label: Henkinen työsuojelu (37.1+)
alternative label: Lyftarbete, arbetarskydd (37.1+) @sv
alternative label: Nattarbete, arbetarskydd (37.1+) @sv
alternative label: Nostotyö, työsuojelu (37.1+)
alternative label: Psykiskt arbetarskydd (37.1) @sv
alternative label: Psykiskt arbetarskydd (37.1+) @sv
alternative label: Päätetyö, työsuojelu (37.1+)
alternative label: Päätteet, työsuojelu (37.1+)
alternative label: Repetitivt arbete, arbetarskydd (37.1+) @sv
alternative label: Röstvård, ergonomi (37.1+) @sv
alternative label: Skiftarbete, arbetarskydd (37.1+) @sv
alternative label: Skyddskläder, arbetarskydd (37.1+) @sv
alternative label: Suojavaatteet, työsuojelu (37.1+)
alternative label: Terminaler, arbetarskydd (37.1+) @sv
alternative label: Tietokonepäätteet, työsuojelu (37.1+)
alternative label: Toistotyö, työsuojelu (37.1+)
alternative label: Työhyvinvointi (37.1)
alternative label: Työhyvinvointi, työsuojelu (37.1+)
alternative label: Työsuojelu (37.1+)
alternative label: Työsuojelu, ergonomia (37.1+)
alternative label: Työsuojeluhallinto (37.1+)
alternative label: Työsuojelutekniikka (37.1+)
alternative label: Työsuojelutoimikunnat (37.1+)
alternative label: Työsuojeluvaltuutetut (37.1+)
alternative label: Työsuojeluvalvonta (37.1+)
alternative label: Työturvallisuus (37.1+)
alternative label: Työvaatteet, työsuojelu (37.1+)
alternative label: Työviihtyvyys, työsuojelu (37.1)
alternative label: Vuorotyö, työsuojelu (37.1+)
alternative label: Yrkesinspektion (37.1+) @sv
alternative label: Yötyö, työsuojelu (37.1+)
alternative label: Äänenhuolto, ergonomia (37.1+)
broader: SOSIAALIPOLITIIKKA
in scheme: YKL - Yleisten kirjastojen luokitusjärjestelmä
narrower: Eri alojen työsuojelu, ergonomia ja työturvallisuus
notation: 37.1
preferred label: Arbetarskydd. Ergonomi @sv
preferred label: Occupational safety. Ergonomics @en
scope note: Hit allmänna verk om arbetarskydd, arbetarskyddsteknik och ergonomi. Arbetshälsa i allmänhet Arbetarskyddsförvaltning. Övervakning av arbetarskydd. Arbetarskyddsfullmäktige. Arbetarskyddskommittéer Psykiskt arbetarskydd. Fysiskt arbetarskydd Ergonomisk planering och förbättring Tekniska, biologiska, fysiologiska, fysikaliska, kemiska och psykologiska faktorer som inverkar på ergonomin Lyftarbete, bildskärmsarbete och monotont arbete ur arbetarskyddets synvinkel Arbetarskyddsnormer i allmänhet 37.1081 Arbetarskydd och ergonomi inom ett enskilt område eller på en enskild arbetsplats 37.13 Arbetstrivsel och välbefinnande i arbetet ur arbetarskyddsperspektiv. @sv
scope note: Tähän työsuojelun, työsuojelutekniikan ja ergonomian yleisteokset. Työhyvinvointi yleensä Työsuojeluhallinto. Työsuojeluvalvonta. Työsuojeluvaltuutetut. Työsuojelutoimikunnat Henkinen työsuojelu. Fyysinen työsuojelu Suunnitteleva ja korjaava ergonomia Ergonomiaan vaikuttavat tekniset, biologiset, fysiologiset, fysikaaliset, kemialliset ja psykologiset tekijät Nosto-, pääte- ja toistotyö työsuojelun kannalta Työsuojelunormit yleensä 37.1081 Tietyn alan tai tietyn työpaikan työsuojelu ja ergonomia 37.13 Työviihtyvyys ja työhyvinvointi työsuojelun näkökulmasta.

Eri alojen työsuojelu, ergonomia ja työturvallisuus
type: Concept
type: YKL-luokka
alternative label: Arbetarskydd, branschspecifikt (37.13) @sv
alternative label: Arbetssäkerhet, branschspecifikt (37.13) @sv
alternative label: Työsuojelu, yksittäisen alan (37.13)
alternative label: Työturvallisuus, yksittäisen alan (37.13)
broader: Työsuojelu. Ergonomia
in scheme: YKL - Yleisten kirjastojen luokitusjärjestelmä
notation: 37.13
preferred label: Arbetarskydd, ergonomi och arbetssäkerhet på olika områden @sv
preferred label: Occupational safety, ergonomics and industrial safety in different branches @en
scope note: Hit verk som behandlar arbetarskydd, arbetarskyddsteknik, arbetssäkerhet eller ergonomi inom ett bestämt område eller yrke eller på en bestämd arbetsplats Arbetarskyddsnormer inom ett bestämt område eller yrke 37.13081 @sv
scope note: Tähän teokset, jotka koskevat tietyn alan, ammatin tai työpaikan työsuojelua, työsuojelutekniikkaa, työturvallisuutta tai ergonomiaa Tietyn alan tai ammatin työsuojelunormit 37.13081

Sosiaaliturvapolitiikka
type: Concept
References: Sosiaalioikeus
References: Perhepolitiikka
References: Yksityinen avustus- ja huoltotyö
type: YKL-luokka
alternative label: Flyktingvård (37.2+) @sv
alternative label: Pakolaishuolto (37.2+)
alternative label: Sociala problem, socialt arbete (37.2+) @sv
alternative label: Socialarbetarens arbete (37.2+) @sv
alternative label: Socialarbete (37.2+) @sv
alternative label: Socialskyddspolitik (37.2+) @sv
alternative label: Sosiaaliset ongelmat, sosiaalityö (37.2+)
alternative label: Sosiaaliturvapolitiikka (37.2+)
alternative label: Sosiaalityö (37.2+)
alternative label: Sosiaalityöntekijän työ (37.2+)
broader: SOSIAALIPOLITIIKKA
in scheme: YKL - Yleisten kirjastojen luokitusjärjestelmä
narrower: Toimeentuloturva
narrower: Sosiaalipalvelut
notation: 37.2
preferred label: Social security policy @en
preferred label: Social trygghet @sv
scope note: Hit allmänna verk om social trygghet och socialskyddspolitik Hit också verk som rör både utkomstskydd och sociala tjänster Hit och till underklasserna socialarbete och socialarbetarens arbete @sv
scope note: Tähän sosiaaliturvan ja sosiaaliturvapolitiikan yleisteokset Tähän myös teokset, jotka koskevat sekä toimeentuloturvaa että sosiaalipalvelua Tähän ja alaluokkiin sosiaalityö ja sosiaalityöntekijän työ

Toimeentuloturva
type: Concept
References: Työvoimapolitiikka
References: Perhepolitiikka
References: Asuntopolitiikka
References: KASVATUS. OPETUS. KASVATUSTIEDE
type: YKL-luokka
alternative label: Arbetslöshetsförsäkring (37.21) @sv
alternative label: Arbetspensioner (37.21) @sv
alternative label: Avträdelsestödsystem (37.21) @sv
alternative label: Eläkepolitiikka (37.21)
alternative label: Eläketurvapolitiikka (37.21)
alternative label: Eläkkeet, sosiaalivakuutus (37.21)
alternative label: Familjepensioner, pensionspolitik (37.21) @sv
alternative label: Folkpension, socialpolitik (37.21) @sv
alternative label: Fortsatt förvärvsarbete, pensionspolitk (37.21) @sv
alternative label: Generationsskifte, pensionspolitik (37.21) @sv
alternative label: Generationsväxlingspensioner (37.21) @sv
alternative label: Huoltoapu (37.21)
alternative label: Invaliditetsskydd (37.21) @sv
alternative label: Invalidpensioner (37.21) @sv
alternative label: Kansaneläke, sosiaalipolitiikka (37.21)
alternative label: Luopumistukijärjestelmät (37.21)
alternative label: Miltärunderstöd (37.21) @sv
alternative label: Pensioner, socialförsäkring (37.21) @sv
alternative label: Pensionspolitik (37.21) @sv
alternative label: Pensionsskyddspolitik (37.21) @sv
alternative label: Perhe-eläkkeet, eläkepolitiikka (37.21)
alternative label: Sairaudenturva (37.21)
alternative label: Sairausvakuutus, sosiaalipolitiikka (37.21)
alternative label: Sjukbidrag (37.21) @sv
alternative label: Sjukförsäkring, socialpolitik (37.21) @sv
alternative label: Socialbidrag (37.21) @sv
alternative label: Socialförsäkring (37.21) @sv
alternative label: Socialhjälp (37.21) @sv
alternative label: Sosiaaliavustus (37.21)
alternative label: Sosiaalivakuutus (37.21)
alternative label: Sotilasavustukset (37.21)
alternative label: Sukupolvenvaihdos, eläkepolitiikka (37.21)
alternative label: Sukupolvenvaihdoseläkkeet (37.21)
alternative label: Toimeentulotuki (37.21)
alternative label: Toimeentuloturva (37.21)
alternative label: Työeläkkeet (37.21)
alternative label: Työkyvyttömyyseläkkeet (37.21)
alternative label: Työkyvyttömyysturva (37.21)
alternative label: Työssä jatkaminen, eläkepolitiikka (37.21)
alternative label: Työssäjatkaminen, eläkepolitiikka (37.21)
alternative label: Työttömyysturva (37.21)
alternative label: Työttömyysvakuutus (37.21)
alternative label: Utkomstskydd (37.21) @sv
alternative label: Utkomstskydd för arbetslösa (37.21) @sv
alternative label: Utkomststöd (37.21) @sv
alternative label: Vanhukset, eläkepolitiikka (37.21)
alternative label: Vanhukset, toimeentuloturva (37.21)
alternative label: Vanhuudenturva (37.21)
alternative label: Ålderdomsstöd (37.21) @sv
alternative label: Åldringar, pensionspolitik (37.21) @sv
alternative label: Åldringar, utkomstskydd (37.21) @sv
broader: Sosiaaliturvapolitiikka
in scheme: YKL - Yleisten kirjastojen luokitusjärjestelmä
notation: 37.21
preferred label: Livelihood security @en
preferred label: Utkomstskydd @sv
scope note: Hit allmänna verk om socialförsäkring och socialbidrag. Pensionsskyddspolitik. Folkpension. Familjepension. Arbetspension. Trygghet vid sjukdom och ålderdom. Sjukförsäkring. Utkomststöd. Invalidpension och utkomstskydd vid arbetslöshet. Arbetspensionsfonder 37.2106. Pensionsstiftelser 37.2106 @sv
scope note: Tähän sosiaalivakuutusta tai -avustusta koskevat yleisteokset. Eläketurvapolitiikka. Kansaneläke. Perhe-eläke. Työeläke. Sairauden- ja vanhuudenturva. Sairausvakuutus. Toimeentulotuki. Työkyvyttömyys- ja työttömyysturva. Työeläkerahastot 37.2106. Eläkesäätiöt 37.2106

Sosiaalipalvelut
type: Concept
References: Prosessioikeus. Oikeushallinto
References: Työvoimapolitiikka
References: Perhepolitiikka
References: Päivähoitopalvelut
References: Asuntopolitiikka
References: Päihdepolitiikka. Päihdehuolto
References: Yleinen terveydenhoito
alternative label: Aikuishuolto (37.23+)
alternative label: Aikuissosiaalityö (37.23+)
alternative label: Arbertsverksamhet i rehabiliteringssyfte (37.23) @sv
alternative label: Ateriapalvelut, sosiaalipalvelut (37.23+)
alternative label: Auttaminen, sosiaalihuolto (37.23+)
alternative label: Auttamistyö, sosiaalihuolto (37.23+)
alternative label: Avohoito, sosiaalipolitiikka (37.23+)
alternative label: Avustustoiminta, sosiaalihuolto (37.23+)
alternative label: Frigivna fångar, omsorg (37.23) @sv
alternative label: Frontmän, socialvård (37.23+) @sv
alternative label: Fångar, omsorg av frigivna fångar (37.23) @sv
alternative label: Green care, social service (37.23) @sv
alternative label: Green care, sosiaalipalvelut (37.23)
alternative label: Hemhjälparens arbete (37.23+) @sv
alternative label: Hemservice (37.23+) @sv
alternative label: Hemtjänst (37.23+) @sv
alternative label: Hemvård, socialpolitik (37.23+) @sv
alternative label: Hemvårdarens arbete (37.23+) @sv
alternative label: Hjälp, socialvård (37.23+) @sv
alternative label: Hjälparbete, socialvård (37.23+) @sv
alternative label: Hjälpverksamhet, socialvård (37.23+) @sv
alternative label: Hoivapalvelut (37.23)
alternative label: Hoivatyö, sosiaalipalvelut (37.23+)
alternative label: Hoivayritykset (37.23+)
alternative label: Huoltolaitokset, sosiaalipolitiikka (37.23+)
alternative label: Irtolaishuolto (37.23)
alternative label: Kodinhoitajan työ (37.23+)
alternative label: Kodinhoitoapu (37.23+)
alternative label: Kotiavustajan työ (37.23+)
alternative label: Kotihoito, sosiaalipolitiikka (37.23+)
alternative label: Kotipalvelu (37.23+)
alternative label: Krigsveteraner, social omsorg (37.23+) @sv
alternative label: Kriminaalihuolto, vapautuneiden vankien huolto (37.23)
alternative label: Kriminalvård, omsorg av frigivna fångar (37.23) @sv
alternative label: Kuntouttava työtoiminta (37.23)
alternative label: Lomakodit (37.23+)
alternative label: Lösdrivarvård (37.23) @sv
alternative label: Matleverantörer, socialtjänst (37.23+) @sv
alternative label: Måltidsservice, socialtjänst (37.23+) @sv
alternative label: Närståendevård allm. (37.23) @sv
alternative label: Omaishoito yl. (37.23)
alternative label: Omvårdnadsarbete, social service (37.23+) @sv
alternative label: Omvårdnadstjänster (37.23) @sv
alternative label: Palveluasuminen (37.23+)
alternative label: Palveluasunnot, palveluasuminen (37.23+)
alternative label: Palvelutalot, palveluasuminen (37.23+)
alternative label: Rintamamiehet, sosiaalihuolto (37.23+)
alternative label: Ruokapalvelut, sosiaalipalvelut (37.23+)
alternative label: Semesterhem (37.23+) @sv
alternative label: Serviceboende (37.23+) @sv
alternative label: Servicebostäder, serviceboende (37.23+) @sv
alternative label: Servicehus, serviceboende (37.23+) @sv
alternative label: Socialservice (37.23+) @sv
alternative label: Socialt arbete med vuxna (37.23+) @sv
alternative label: Socialt omsorgsarbete (37.23+) @sv
alternative label: Socialvård (37.23+) @sv
alternative label: Sosiaalihuolto (37.23+)
alternative label: Sosiaalinen huoltotyö (37.23+)
alternative label: Sosiaalipalvelut (37.23+)
alternative label: Sotaveteraanit, sosiaalihuolto (37.23+)
alternative label: Säkerhetstelefoner, social service (37.23+) @sv
alternative label: Turvapuhelimet, sosiaalipalvelut (37.23+)
alternative label: Vangit, vapautuneiden vankien huolto (37.23)
alternative label: Vapautuneiden vankien huolto (37.23)
alternative label: Vuxenomsorg (37.23+) @sv
broader: Sosiaaliturvapolitiikka
in scheme: YKL - Yleisten kirjastojen luokitusjärjestelmä
narrower: Vanhuspalvelut
narrower: Vammaispalvelut
notation: 37.23
scope note: Hit allmänna verk om socialtjänst och socialt vårdarbete Hemservice och hemtjänst i allmänhet Socialt arbete med vuxna Omsorg av frigivna fångar @sv
scope note: Tähän sosiaalipalvelua ja sosiaalista huoltotyötä koskevat yleisteokset Kodinhoitoapu ja kotipalvelu yleensä Aikuissosiaalityö Vapautuneiden vankien huolto

Vanhuspalvelut
type: Concept
References: Aikuisiän ja vanhuuden psykologia
References: Elämänfilosofia. Elämäntaito
References: Perhesosiologia
References: Ikäryhmien asema yhteiskunnassa
References: Vanhusten terveydenhoito. Vanhusten taudit
type: YKL-luokka
alternative label: Arbete med de äldre (37.232) @sv
alternative label: Gerontologi, socialgerontologi (37.232) @sv
alternative label: Gerontologia, sosiaaligerontologia (37.232)
alternative label: Hemtjänst, åldringar (37.232) @sv
alternative label: Hemvårdsstöd, åldringar (37.232) @sv
alternative label: Hoivakodit (37.232)
alternative label: Institutionsvård, åldringar (37.232) @sv
alternative label: Kommunalhem (37.232) @sv
alternative label: Kotihoidon tuki, vanhukset (37.232)
alternative label: Kotihuolto, vanhukset (37.232)
alternative label: Kunnalliskodit (37.232)
alternative label: Laitoshoito, vanhukset (37.232)
alternative label: Närståendevård av åldringar (37.232) @sv
alternative label: Omaishoito, vanhusten (37.232)
alternative label: Service för äldre (37.232) @sv
alternative label: Servicehus (37.232) @sv
alternative label: Socialgerontologi (37.232) @sv
alternative label: Sosiaaligerontologia (37.232)
alternative label: Vanhainkodit (37.232)
alternative label: Vanhukset, huolto (37.232)
alternative label: Vanhukset, kodinhoitoapu (37.232)
alternative label: Vanhukset, kotipalvelu (37.232)
alternative label: Vanhukset, palvelutalotoiminta (37.232)
alternative label: Vanhukset, sosiaaligerontologia (37.232)
alternative label: Vanhukset, sosiaalipalvelu (37.232)
alternative label: Vanhuspalvelut (37.232)
alternative label: Vanhusten huolto (37.232)
alternative label: Vanhustenhuolto (37.232)
alternative label: Vanhustentalotoiminta (37.232)
alternative label: Vanhustyö (37.232)
alternative label: Vårdhem (37.232) @sv
alternative label: Äldreomsorg (37.232) @sv
alternative label: Ålderdomshem (37.232) @sv
alternative label: Åldringar, hemservice (37.232) @sv
alternative label: Åldringar, hemtjänst (37.232) @sv
alternative label: Åldringar, omsorg (37.232) @sv
alternative label: Åldringar, servicehus (37.232) @sv
alternative label: Åldringar, socialgerontologi (37.232) @sv
alternative label: Åldringar, socialtjänst (37.232) @sv
alternative label: Åldringsvård (37.232) @sv
broader: Sosiaalipalvelut
in scheme: YKL - Yleisten kirjastojen luokitusjärjestelmä
notation: 37.232
preferred label: Social services for the elderly @en
preferred label: Äldreservice @sv
scope note: Hem- och institutionsvård av äldre i allmänhet Socialgerontologi Hemvårdshjälp och hemtjänst för äldre Servicebostäder för äldre Ålderdomshem Om verket behandlar åldringar ur flera olika synvinklar, ges företräde åt klass 37.232 @sv
scope note: Vanhusten koti- ja laitoshuolto yleensä Vanhustyö. Sosiaaligerontologia Vanhusten kodinhoitoapu ja kotipalvelu Vanhustentalot. Vanhusten palvelutalotoiminta Vanhainkodit Jos teos koskee vanhuksia ja vanhuksena elämistä useista eri näkökulmista, annetaan etusija luokalle 37.232

Vammaispalvelut
type: Concept
References: Erityisopetus. Erityiskasvatus. Erityiskoulut
References: Erityisopetus. Erityiskasvatus, kehitysvammaiset
References: Sairaiden ja vammaisten apuvälineet
References: Elimet. Taudit
References: Optiset ja lääketieteelliset laitteet
References: Sisustusoppaat
References: Asuinrakennukset
References: Kuntoliikunta. Kuntourheilu
alternative label: Aistivammaiset, sosiaalihuolto (37.233)
alternative label: Blinda, socialvård (37.233) @sv
alternative label: CP-handikapp, socialvård (37.233) @sv
alternative label: CP-skadade, socialvård (37.233) @sv
alternative label: CP-vammaiset, sosiaalihuolto (37.233)
alternative label: CP-vammaisuus, sosiaalihuolto (37.233)
alternative label: Dagvård, handikappade (37.233) @sv
alternative label: Downin syndrooma, sosiaalihuolto (37.233)
alternative label: Downs syndrom, socialvård (37.233) @sv
alternative label: Handikapp (37.233) @sv
alternative label: Handikappade (37.233) @sv
alternative label: Handikappade barn, omsorg (37.233) @sv
alternative label: Handikappade, att leva som handikappad (37.233) @sv
alternative label: Handikappade, dagvård (37.233) @sv
alternative label: Handikappade, hemservice (37.233) @sv
alternative label: Handikappade, hemtjänst (37.233) @sv
alternative label: Handikappade, hemvård (37.233) @sv
alternative label: Handikappade, institutionsvård (37.233) @sv
alternative label: Handikappade, socialvård (37.233) @sv
alternative label: Handikappade, ställning i samhället (37.233) @sv
alternative label: Handikappade, vård (37.233) @sv
alternative label: Handikappades ställning (37.233) @sv
alternative label: Handikappvård (37.233) @sv
alternative label: Hemvård, handikappade (37.233) @sv
alternative label: Hemvårdsstöd, handikappade (37.233) @sv
alternative label: Hörselskadade (37.233) @sv
alternative label: Hörselskadade, socialvård (37.233) @sv
alternative label: Institutionsvård, handikappade (37.233) @sv
alternative label: Invalider, socialvård (37.233) @sv
alternative label: Invalidit, sosiaalihuolto (37.233)
alternative label: Kehitysvammaiset (37.233)
alternative label: Kehitysvammaiset, sosiaalihuolto (37.233)
alternative label: Kortväxta, vård av handikappade (37.233) @sv
alternative label: Kotihoidon tuki, vammaiset (37.233)
alternative label: Kotihoito, vammaiset (37.233)
alternative label: Krigsinvalider, social omsorg (37.233) @sv
alternative label: Kuulovammaiset (37.233)
alternative label: Kuulovammaiset, sosiaalihuolto (37.233)
alternative label: Laitoshoito, vammaiset (37.233)
alternative label: Liikuntavammaiset (37.233)
alternative label: Liikuntavammaiset, sosiaalihuolto (37.233)
alternative label: Lyhytkasvuiset, vammaishuolto (37.233)
alternative label: Monivammaisuus (37.233)
alternative label: Näkövammaiset (37.233)
alternative label: Näkövammaiset, sosiaalihuolto (37.233)
alternative label: Omaishoito, vammaisten (37.233)
alternative label: Päivähoito, vammaiset (37.233)
alternative label: Sokeat, sosiaalihuolto (37.233)
alternative label: Sotainvalidihuolto (37.233)
alternative label: Sotainvalidijärjestöt (37.233+)
alternative label: Sotavammaiset, sosiaalihuolto (37.233)
alternative label: Vammaisena eläminen (37.233)
alternative label: Vammaiset (37.233)
alternative label: Vammaiset, asema yhteiskunnassa (37.233)
alternative label: Vammaiset, huolto (37.233)
alternative label: Vammaiset, kodinhoitoapu (37.233)
alternative label: Vammaiset, kotihoito (37.233)
alternative label: Vammaiset, kotipalvelu (37.233)
alternative label: Vammaiset, laitoshoito (37.233)
alternative label: Vammaiset, päivähoito (37.233)
alternative label: Vammaiset, sosiaalihuolto (37.233)
alternative label: Vammaishuolto (37.233)
alternative label: Vammaisten asema (37.233)
alternative label: Vammaisten huolto (37.233)
alternative label: Vammaisten lasten huolto (37.233)
alternative label: Vammaisuus (37.233)
broader: Sosiaalipalvelut
in scheme: YKL - Yleisten kirjastojen luokitusjärjestelmä
notation: 37.233
scope note: Handikapp och handikappades liv i allmänhet. Hem- och institutionsvård för handikappade i allmänhet. Hemservice, hemtjänst och dagvård för handikappade. Vård av syn-, hörsel-, tal- och rörelseskadade. Invalidvärd. Vård av krigsinvalider. Vård av handikappade barn. Om verket handlar om handikappade ur flera olika synvinklar, ges företräde åt klass 37.233. Om verket behandlar både vård och undervisning av utvecklingsstörda, ges företräde åt klass 38.555 @sv
scope note: Vammaisuus ja vammaisena eläminen yleensä. Vammaisten koti- ja laitoshoito yleensä. Vammaisten kodinhoitoapu ja kotipalvelu. Vammaisten päivähoito. Aisti- ja liikuntavammaisten huolto. Invalidihuolto. Sotainvalidihuolto. Kehitysvammaisten huolto. Tähän myös vammaisten lasten huolto. Jos teos koskee vammaisia useista eri näkökulmista, annetaan etusija luokalle 37.233. Jos teos koskee sekä kehitysvammaisten huoltoa että opetusta, annetaan etusija luokalle 38.555

Perhepolitiikka
type: Concept
References: Ihmissuhteiden psykologia
References: Sielunhoito
References: Perhesosiologia
References: Väestötiede. Väestöpolitiikka
References: Perhe- ja holhousoikeus
References: Perhe- ja kotikasvatus
References: Nuorisotyö. Lapsityö
References: Seksologia
References: Perhe-, ryhmä- ja ympäristöterapiat
References: Raskaus. Sikiönkehitys. Synnytys
References: Lasten terveydenhoito. Lastentaudit
alternative label: Abort, familjepolitik (37.4) @sv
alternative label: Abortti, perhepolitiikka (37.4)
alternative label: Adoptio, perhepolitiikka (37.4+)
alternative label: Adoption, familjepolitik (37.4+) @sv
alternative label: Adoptivbarn, familjepolitik (37.4+) @sv
alternative label: Avioero, perhepolitiikka (37.4+)
alternative label: Avioliitto, perhepolitiikka (37.4+)
alternative label: Avioliittoneuvonta (37.4+)
alternative label: Aviottomat lapset, perhepolitiikka (37.4+)
alternative label: Avoliitto, perheneuvonta (37.4+)
alternative label: Avoliitto, perhepolitiikka (37.4+)
alternative label: Barn, familjepolitik (37.4+) @sv
alternative label: Barnbegränsning, familjepolitik (37.4) @sv
alternative label: Barnbidrag (37.4) @sv
alternative label: Elatustuki, perhepolitiikka (37.4)
alternative label: Ensamförsörjare, familjepolitik (37.4+) @sv
alternative label: Ensikodit (37.4)
alternative label: Ensikoti-hemmen (37.4) @sv
alternative label: Faderskapsledighet, familjepolitik (37.4) @sv
alternative label: Familjearbete (37.4) @sv
alternative label: Familjeförberedelse (37.4) @sv
alternative label: Familjeledighet, familjepolitik (37.4) @sv
alternative label: Familjeplanering, familjepolitik (37.4) @sv
alternative label: Familjepolitik (37.4+) @sv
alternative label: Familjerehabilitering (37.4+) @sv
alternative label: Familjerådgivning (37.4+) @sv
alternative label: Familjerådgivningsbyråer (37.4+) @sv
alternative label: Familjeutgifter, utjämning (37.4) @sv
alternative label: Familjevåld (37.4+) @sv
alternative label: Födelsekontroll, familjeplanering (37.4) @sv
alternative label: Hoitovapaa (37.4)
alternative label: Hoitovapaa, perhepolitiikka (37.4)
alternative label: Isyysloma, perhepolitiikka (37.4)
alternative label: Isyysvapaa, perhepolitiikka (37.4)
alternative label: Kesäsiirtolat (37.4)
alternative label: Lapset, perhepolitiikka (37.4+)
alternative label: Lapsilisät (37.4)
alternative label: Lapsirajoitus, perhepolitiikka (37.4)
alternative label: Lähisuhdeväkivalta (37.4+)
alternative label: Neuvolat, avioliittoneuvolat (37.4+)
alternative label: Neuvolat, perheneuvolat (37.4+)
alternative label: Ottolapset, perhepolitiikka (37.4+)
alternative label: Parisuhdeväkivalta (37.4+)
alternative label: Perhekuntoutus (37.4+)
alternative label: Perhekustannusten tasaus (37.4)
alternative label: Perheneuvolat (37.4+)
alternative label: Perheneuvonta (37.4+)
alternative label: Perhepolitiikka (37.4+)
alternative label: Perhesuunnittelu, perhepolitiikka (37.4)
alternative label: Perhetyö (37.4)
alternative label: Perhevalmennus (37.4)
alternative label: Perhevapaa, perhepolitiikka (37.4)
alternative label: Perheväkivalta (37.4+)
alternative label: Syntyvyyden säännöstely, perhesuunnittelu (37.4)
alternative label: Turvakodit (37.4)
alternative label: Vanhempainloma (37.4)
alternative label: Väkivalta, perheväkivalta (37.4+)
alternative label: Yksinhuoltajat, perhepolitiikka (37.4+)
alternative label: Äitiysavustus (37.4)
alternative label: Äitiysloma, perhepolitiikka (37.4)
alternative label: Äitiysvapaa, perhepolitiikka (37.4)
broader: SOSIAALIPOLITIIKKA
in scheme: YKL - Yleisten kirjastojen luokitusjärjestelmä
narrower: Päivähoitopalvelut
narrower: Lasten ja nuorten huolto ja suojelu
notation: 37.4
scope note: Hit allmänna verk om familjepolitik Hit och till underklasserna socialpolitiska stödåtgärder för familjer Utjämning av familjeutgifter. Barnbidrag. Underhållsbidrag Moderskapsunderstöd. Föräldraledighet Familje- och äktenskapsrådgivning samt familje-och äktenskapsrådgivningsbyråer Familjeplanering Skyddshem. Ensikoti-rörelsen. Adoption Hit och till underklasserna också familjevåld Om verket innehåller både familjepolitik och familjesociologi, ges företräde åt klass 37.4+ @sv
scope note: Tähän perhepolitiikan yleisteokset Tähän ja alaluokkiin perheitä koskevat sosiaalipoliittiset tukitoimet Perhekustannusten tasaus. Lapsilisät. Elatustuki Äitiysavustus. Äitiys- ja isyysloma Perhe- ja avioliittoneuvonta ja -neuvolat Perhesuunnittelu Turvakodit. Ensikodit. Adoptio Tähän ja alaluokkiin myös perheväkivalta Jos teos koskee sekä perhepolitiikkaa että perhesosiologiaa, annetaan etusija luokalle 37.4+

Päivähoitopalvelut
type: Concept
References: Kristillinen opetus ja kasvatus
References: Esiopetus
type: YKL-luokka
alternative label: Barn, dagvård (37.41) @sv
alternative label: Barnträdgårdar (37.41) @sv
alternative label: Daghem, barn (37.41) @sv
alternative label: Dagvård, barn (37.41) @sv
alternative label: Erityispäivähoito (37.41)
alternative label: Familjedagvård (37.41) @sv
alternative label: Hemvård, barndagvård (37.41) @sv
alternative label: Hemvårdsstöd, barndagvård (37.41) @sv
alternative label: Kotihoidon tuki, lasten päivähoito (37.41)
alternative label: Kotihoito, lasten päivähoito (37.41)
alternative label: Lapset, päivähoito (37.41)
alternative label: Lastentarhat (37.41)
alternative label: Leikkikoulut (37.41)
alternative label: Leikkipuistotoiminta, päivähoito (37.41)
alternative label: Lekparksverksamhet, dagvård (37.41) @sv
alternative label: Lekskolor (37.41) @sv
alternative label: Musiikkileikkikoulut (37.41)
alternative label: Musiklekskolor (37.41) @sv
alternative label: Ohjattu leikkipuistotoiminta (37.41)
alternative label: Organiserad lekparksverksamhet (37.41) @sv
alternative label: Perhepäivähoito (37.41)
alternative label: Päivähoito, lapset (37.41)
alternative label: Päiväkodit, lapset (37.41)
alternative label: Specialdagvård (37.41) @sv
broader: Perhepolitiikka
in scheme: YKL - Yleisten kirjastojen luokitusjärjestelmä
notation: 37.41
preferred label: Dagvårdstjänster @sv
preferred label: Daycare services @en
scope note: Daghem. Lekskolor Familjedagvård. Hemvård. Hemvårdsstöd Organiserad lekparksverksamhet @sv
scope note: Päiväkodit. Lastentarhat Perhepäivähoito. Kotihoito. Kotihoidon tuki Ohjattu leikkipuistotoiminta

Lasten ja nuorten huolto ja suojelu
type: Concept
References: Perhesosiologia
References: Ikäryhmien asema yhteiskunnassa
References: Perhe- ja holhousoikeus
References: Työ. Työelämä
References: Päihdepolitiikka. Päihdehuolto
References: Perhe- ja kotikasvatus
References: Erityisopetus. Erityiskasvatus. Erityiskoulut
References: Nuorisotyö. Lapsityö
References: Perhe-, ryhmä- ja ympäristöterapiat
type: YKL-luokka
alternative label: Adoptivbarn, barnskydd (37.42) @sv
alternative label: Avioero, lastensuojelu (37.42)
alternative label: Aviottomat lapset, lastensuojelu (37.42)
alternative label: Barnhem (37.42) @sv
alternative label: Barnomsorg, socialpolitik (37.42) @sv
alternative label: Barnskydd (37.42) @sv
alternative label: Fadderverksamhet, barn och ungdomar (37.42) @sv
alternative label: Familjehem (37.42) @sv
alternative label: Familjevåld, barnskydd (37.42) @sv
alternative label: Flickhem (37.42) @sv
alternative label: Fostran i fosterhem (37.42) @sv
alternative label: Gromning (37.42) @sv
alternative label: Grooming (37.42)
alternative label: Huoltajuus, sijaishuolto (37.42)
alternative label: Huoltolaitokset, lastensuojelu (37.42)
alternative label: Huostaanotto, lastensuojelu (37.42)
alternative label: Incest, barnskydd (37.42) @sv
alternative label: Insesti, lastensuojelu (37.42)
alternative label: Kasvatuslaitokset (37.42)
alternative label: Kummitoiminta, lapset ja nuoret (37.42)
alternative label: Lastenhuolto, sosiaalipolitiikka (37.42)
alternative label: Lastenkodit (37.42)
alternative label: Lastensuojelu (37.42)
alternative label: Lockande i sexuella syften, barn (37.42) @sv
alternative label: Nuorten suojelu (37.42)
alternative label: Nuortenhuolto (37.42)
alternative label: Omhändertagande, barnskydd (37.42) @sv
alternative label: Ottolapset, lastensuojelu (37.42)
alternative label: Perheväkivalta, lastensuojelu (37.42)
alternative label: Poikakodit (37.42)
alternative label: Pojkhem (37.42) @sv
alternative label: Seksuaalinen houkuttelu, lapset (37.42)
alternative label: Seksuaalinen hyväksikäyttö, lastensuojelu (37.42)
alternative label: Sexuellt utnyttjande, barnskydd (37.42) @sv
alternative label: Sijaishuolto (37.42)
alternative label: Sijaiskasvatus (37.42)
alternative label: Sijaiskodit (37.42)
alternative label: Skilsmässa, barnskydd (37.42) @sv
alternative label: Socialarbete, barnskydd (37.42) @sv
alternative label: Sosiaalityö, lastensuojelu (37.42)
alternative label: Tyttökodit (37.42)
alternative label: Unga, skydd av unga (37.42) @sv
alternative label: Ungdomsvård (37.42) @sv
alternative label: Unicef (37.42)
alternative label: Uppfostringsanstalter (37.42) @sv
alternative label: Utomäktenskapliga barn, barnskydd (37.42) @sv
alternative label: Vård i fosterhem (37.42) @sv
alternative label: Vårdinrättningar, barnskydd (37.42) @sv
alternative label: Vårdnad om barn, vård i fosterhem (37.42) @sv
broader: Perhepolitiikka
in scheme: YKL - Yleisten kirjastojen luokitusjärjestelmä
notation: 37.42
preferred label: Barn- och ungdomsomsorg. Barn- och ungdomsskydd @sv
preferred label: Care and protection of children and young people @en
scope note: Barnhem. Omhändertagande Fosterhem. Fostran i fosterhem Hit också familjevåld och incest ur barn- och ungdomsskyddets synvinkel Om verket innehåller både barn- och ungdomsskydd och familjepolitik, ges företräde åt klass 37.42 @sv
scope note: Sijaiskasvatus. Sijaiskodit. Huostaanotto. Lastenkodit Tähän myös perheväkivalta ja insesti lasten ja nuorten suojelun kannalta Jos teos koskee sekä lasten ja nuorten suojelua että perhepolitiikkaa, annetaan etusija luokalle 37.42

Asuntopolitiikka
type: Concept
References: Asemakaava- ja rakentamislainsäädäntö
References: Asunto- ja kiinteistönkauppaoikeus
References: Huoneen- ja maanvuokralainsäädäntö
References: ALUESUUNNITTELU. ALUEPOLITIIKKA
References: Asuinalueiden suunnittelu
References: Talonrakennus
References: Asuinrakennukset
alternative label: Andrabostäder (37.5) @sv
alternative label: Arava, asuntopolitiikka (37.5)
alternative label: Arava, bostadspolitik (37.5) @sv
alternative label: Aravalainat (37.5)
alternative label: Aravalån (37.5) @sv
alternative label: Asuinalueet, asuntopolitiikka (37.5)
alternative label: Asuminen (37.5)
alternative label: Asumisen sosiologia (37.5)
alternative label: Asumistuki (37.5)
alternative label: Asunnonhankinta (37.5)
alternative label: Asunnontarkastus (37.5)
alternative label: Asunnonvaltaus (37.5)
alternative label: Asunnonvälitys (37.5)
alternative label: Asunnot, asuntopolitiikka (37.5)
alternative label: Asunnottomuus (37.5)
alternative label: Asunto-olot, asuntopolitiikka (37.5)
alternative label: Asuntoavustukset, asuntopolitiikka (37.5)
alternative label: Asuntojen käyttö (37.5)
alternative label: Asuntokysymys (37.5)
alternative label: Asuntolainat, asuntopolitiikka (37.5)
alternative label: Asuntolatoiminta (37.5)
alternative label: Asuntomarkkinat (37.5)
alternative label: Asuntopolitiikka (37.5)
alternative label: Asuntopula (37.5)
alternative label: Asuntorahoitus, asuntopolitiikka (37.5)
alternative label: Asuntotuotantopolitiikka (37.5)
alternative label: Boende (37.5) @sv
alternative label: Boendets sociologi (37.5) @sv
alternative label: Bostadsanskaffning (37.5) @sv
alternative label: Bostadsanvändning (37.5) @sv
alternative label: Bostadsbidrag (37.5) @sv
alternative label: Bostadsbrist (37.5) @sv
alternative label: Bostadsfinansiering, bostadspolitik (37.5) @sv
alternative label: Bostadsfrågan (37.5) @sv
alternative label: Bostadsförhållanden, bostadspolitik (37.5) @sv
alternative label: Bostadsförmedling (37.5) @sv
alternative label: Bostadsinspektion (37.5) @sv
alternative label: Bostadslån, bostadspolitik (37.5) @sv
alternative label: HITAS, asuntopolitiikka (37.5)
alternative label: Huoneenvuokra, asuntopolitiikka (37.5)
alternative label: Kakkosasunnot (37.5)
alternative label: Kerrostalot, asuntopolitiikka (37.5)
alternative label: Kesäasunnot, asuntopolitiikka (37.5)
alternative label: Kesämökit, asuntopolitiikka (37.5)
alternative label: Kiinteistönvälitys (37.5)
alternative label: Konttoristuminen (37.5)
alternative label: Kunnallinen asuntopolitiikka (37.5)
alternative label: Loma-asunnot, asuntopolitiikka (37.5)
alternative label: Omakotitalot, asuntopolitiikka (37.5)
alternative label: Omistusasunnot, asuntopolitiikka (37.5)
alternative label: Opiskelija-asunnot, asuntopolitiikka (37.5)
alternative label: Paritalot, asuntopolitiikka (37.5)
alternative label: Peruskorjausavustukset ja -lainat (37.5)
alternative label: Pientalot, asuntopolitiikka (37.5)
alternative label: Rakennuslainat, asuntopolitiikka (37.5)
alternative label: Rakennustuotanto, asuntopolitiikka (37.5)
alternative label: Rivitalot, asuntopolitiikka (37.5)
alternative label: Tontit, asuntopolitiikka (37.5)
alternative label: Tyhjät asunnot, asuntopolitiikka (37.5)
alternative label: Työsuhdeasunnot, asuntopolitiikka (37.5)
alternative label: Vammaiset, asuntopolitiikka (37.5)
alternative label: Vammaisten asunnot, asuntopolitiikka (37.5)
alternative label: Vapaa-ajan asunnot, asuntopolitiikka (37.5)
alternative label: Vuokra-asunnot, asuntopolitiikka (37.5)
alternative label: Vuokrasäännöstely, asuntopolitiikka (37.5)
alternative label: Yhteisöasuminen (37.5)
alternative label: lyhytvuokraus, asuntopolitiikka (37.5)
broader: SOSIAALIPOLITIIKKA
in scheme: YKL - Yleisten kirjastojen luokitusjärjestelmä
notation: 37.5
scope note: Asumisen sosiologia. Asuntokysymys. Asuntotuotanto Omistus-, vuokra- ja työsuhdeasunnot. Yhteisöasuminen Asunnonhankinta. Asunnonvälitys. Vuokrasäännöstely Rakennus- ja asuntolainat sekä -avustukset. Asumistuki Asuntojen käyttö. Tyhjät asunnot. Asunnon valtaus Asuntopula. Asunnottomuus. Asuntolatoiminta
scope note: Boendets sociologi. Bostadsfrågan. Bostadsproduktion Ägarbostäder, hyresbostäder och tjänstebostäder. Kollektivboende Att skaffa bostad. Bostadsförmedling. Hyresreglering Bygg- och bostadslån samt -bidrag. Boendestöd Användning av bostäder. Tomma bostäder. Bostadsockupation Bostadsbrist. Bostadslöshet. Härbärgenas verksamhet @sv

Päihdepolitiikka. Päihdehuolto
type: Concept
References: Päihteiden ja piristeiden käyttö
type: YKL-luokka
alternative label: Ehkäisevä päihdetyö (37.6+)
alternative label: Förebyggande missbruksarbete (37.6+) @sv
alternative label: Missbrukarvård (37.6+) @sv
alternative label: Missbruksarbete (37.6+) @sv
alternative label: Nuoriso-ongelmat, päihdepolitiikka (37.6+)
alternative label: Päihdehuolto (37.6+)
alternative label: Päihdekasvatus (37.6+)
alternative label: Päihdeongelmat (37.6)
alternative label: Päihdepolitiikka (37.6+)
alternative label: Päihdetyö (37.6+)
alternative label: Päihteet, käyttö, sosiaalipolitiikka (37.6+)
alternative label: Rusmedel, bruk, socialpolitik (37.6+) @sv
alternative label: Rusmedelspolitik (37.6+) @sv
alternative label: Rusmedelsproblem (37.6) @sv
alternative label: Ungdomsproblem, rusmedelspolitik (37.6+) @sv
broader: SOSIAALIPOLITIIKKA
in scheme: YKL - Yleisten kirjastojen luokitusjärjestelmä
narrower: Alkoholipolitiikka
narrower: Huumausainepolitiikka
notation: 37.6
preferred label: Alcohol and narcotics policy. Care of abusers @en
preferred label: Alkohol- och narkotikapolitik. Missbrukarvård @sv
scope note: Hit och till underklasserna användning av rusmedel samt alkohol- och narkotikabrukare ur social och socialpolitisk synvinkel Hit och till underklasserna också missbruksarbete och förebyggande missbruksarbete Om verket behandlar rusmedel ur både social och medicinsk synvinkel, ges företräde åt klass 37.6+ @sv
scope note: Tähän ja alaluokkiin päihteiden käyttö ja käyttäjät sosiaaliselta ja sosiaalipoliittiselta kannalta Tähän ja alaluokkiin myös päihdekasvatus ja päihdetyö Jos teos koskee päihteitä sekä sosiaaliselta että lääketieteen kannalta, annetaan etusija luokalle 37.6+

Alkoholipolitiikka
type: Concept
References: Kriminologia. Kriminaalisosiologia
References: Elinkeino-oikeus
References: Rikosoikeus
References: Alkoholiriippuvuus. Alkoholinkäyttö
References: Nautintoaineteollisuus
References: Juomat
type: YKL-luokka
alternative label: A-hem (37.61) @sv
alternative label: A-klinikat (37.61)
alternative label: A-kliniker (37.61) @sv
alternative label: A-kodit (37.61)
alternative label: AA-liike (37.61)
alternative label: AA-rörelsen (37.61) @sv
alternative label: Absolutism, nykterhetsfrågan (37.61) @sv
alternative label: Absolutismi, raittiuskysymys (37.61)
alternative label: Akutvårdstationer (37.61) @sv
alternative label: Alkoholikulttuuri, alkoholipolitiikka (37.61)
alternative label: Alkoholipolitiikka (37.61)
alternative label: Alkoholism, alkoholpolitik (37.61) @sv
alternative label: Alkoholismi, alkoholipolitiikka (37.61)
alternative label: Alkoholisosiologia (37.61)
alternative label: Alkoholistihuolto (37.61)
alternative label: Alkoholistvård (37.61) @sv
alternative label: Alkoholkultur, alkoholpolitik (37.61) @sv
alternative label: Alkoholpolitik (37.61) @sv
alternative label: Alkoholsociologi (37.61) @sv
alternative label: Drycker, alkoholpolitik (37.61) @sv
alternative label: Dryckeskultur, alkoholpolitik (37.61) @sv
alternative label: Förbudslagar, alkoholpolitik (37.61) @sv
alternative label: Juomakulttuuri, alkoholipolitiikka (37.61)
alternative label: Juomat, alkoholipolitiikka (37.61)
alternative label: Katkaisuasematoiminta (37.61)
alternative label: Kieltolait, alkoholipolitiikka (37.61)
alternative label: Nykterhetsfrågan (37.61) @sv
alternative label: Nykterhetspolitik (37.61) @sv
alternative label: Nykterhetsrörelser (37.61) @sv
alternative label: Nykterhetsundervisning (37.61) @sv
alternative label: Raittiuskysymys (37.61)
alternative label: Raittiusliikkeet (37.61)
alternative label: Raittiusopetus (37.61)
alternative label: Raittiuspolitiikka (37.61)
alternative label: Selviämisasematoiminta (37.61)
alternative label: Spritdrycker, socialpolitik (37.61) @sv
alternative label: Tillnyktringsstationer (37.61) @sv
alternative label: Väkijuomat, sosiaalipolitiikka (37.61)
broader: Päihdepolitiikka. Päihdehuolto
in scheme: YKL - Yleisten kirjastojen luokitusjärjestelmä
notation: 37.61
preferred label: Alcohol policy @en
preferred label: Alkoholpolitik @sv
scope note: Alkoholbruk som social fråga Alkoholsociologi. Alkoholistvård Akutvårds- och tillnyktringsstationernas verksamhet A-kliniker. A-hem. AA-rörelsen Nykterhetsfrågan. Nykterhetsrörelsen @sv
scope note: Alkoholin käyttö sosiaalisena kysymyksenä Alkoholisosiologia. Alkoholistihuolto Katkaisu- ja selviämisasematoiminta A-klinikat. A-kodit. AA-liike Raittiuskysymys. Raittiusliike

Huumausainepolitiikka
type: Concept
References: Kriminologia. Kriminaalisosiologia
References: Julkis- ja hallinto-oikeus
References: Rikosoikeus
References: Lääkehoito. Lääkeaineoppi
References: Huumeriippuvuus
References: Kemianteollisuus
type: YKL-luokka
alternative label: Huumausainepolitiikka (37.62)
alternative label: Huumeiden käyttäjät, sosiaalinen huolto (37.62)
alternative label: Huumeiden vastainen sosiaalinen työ (37.62)
alternative label: Lääkkeet, väärinkäyttö, sosiaalipolitiikka (37.62)
alternative label: Mediciner, missbruk, socialpolitik (37.62) @sv
alternative label: Narkomaanihuolto (37.62)
alternative label: Narkomaner, socialvård (37.62) @sv
alternative label: Narkomani, socialpolitik (37.62) @sv
alternative label: Narkomania, sosiaalipolitiikka (37.62)
alternative label: Narkomanvård (37.62) @sv
alternative label: Narkotika, socialt arbete mot narkotika (37.62) @sv
alternative label: Narkotikapolitik (37.62) @sv
broader: Päihdepolitiikka. Päihdehuolto
in scheme: YKL - Yleisten kirjastojen luokitusjärjestelmä
notation: 37.62
preferred label: Narcotics policy @en
preferred label: Narkotikapolitik @sv
scope note: Bruk av narkotika och läkemedel som social fråga Narkomanvård Socialt arbete i kampen mot narkotika @sv
scope note: Huumaus- ja lääkeaineiden käyttö sosiaalisena kysymyksenä Huumeiden käyttäjien huolto. Narkomaanihuolto Huumeiden vastainen sosiaalinen työ

Yksityinen avustus- ja huoltotyö
type: Concept
References: Diakonia. Sisälähetys. Evankelioiminen
References: Protestanttiset kirkot ja yhteisöt
References: URN:NBN:fi:au:ykl:32.206
type: YKL-luokka
alternative label: Auttaminen, yksityinen avustustoiminta (37.7)
alternative label: Auttamistyö, yksityinen avustustoiminta (37.7)
alternative label: Avustustoiminta, yksityinen (37.7)
alternative label: Fadderverksamhet, frivilligt arbete (37.7) @sv
alternative label: Hjälp, privat hjälpverksamhet (37.7) @sv
alternative label: Hjälparbete, privat hjälpverksamhet (37.7) @sv
alternative label: Hjälpverksamhet, privat (37.7) @sv
alternative label: Hyväntekeväisyystyö (37.7)
alternative label: Katastrofhjälp, privat hjälpverksamhet (37.7) @sv
alternative label: Katastrofiapu, yksityinen avustustoiminta (37.7)
alternative label: Kummitoiminta, vapaaehtoistyö (37.7)
alternative label: Lähimmäispalvelu, yksityinen (37.7)
alternative label: Privat biståndsarbete (37.7) @sv
alternative label: Privat vårdarbete (37.7) @sv
alternative label: Sociala företag, privat hjälp- och vårdarbete (37.7) @sv
alternative label: Sosiaaliset yritykset, yksityinen avustus- ja huoltotyö (37.7)
alternative label: Välgörenhetsarbete (37.7) @sv
alternative label: Väntjänst, privat (37.7) @sv
alternative label: Yksityinen avustustyö (37.7)
alternative label: Yksityinen huoltotyö (37.7)
alternative label: Ystäväpalvelu, yksityinen (37.7)
broader: SOSIAALIPOLITIIKKA
in scheme: YKL - Yleisten kirjastojen luokitusjärjestelmä
notation: 37.7
preferred label: Privat hjälp- och vårdarbete @sv
preferred label: Private aid and welfare work @en
scope note: Hit allmänt hjälp-, vård- och välgörenhetsarbete som sköts av privata organisationer eller privatpersoner. Närståendevård och väntjänst. Privat hjälp- och vårdarbete inom specialområden klassificeras enligt område. Till exempel Röda Korset, Emmausrörelsen samt Lions-, Rotary- och Zontarörelsen 37.706 @sv
scope note: Tähän yksityisten järjestöjen ja henkilöiden avustus-, huolto- ja hyväntekeväisyystyö yleensä Lähimmäis- ja ystäväpalvelu Erikoisalojen yksityinen avustus- ja huoltotyö luokitetaan alan mukaan Esimerkiksi Punainen Risti, Emmaus-liike sekä Lions-, Rotary- ja Zontajärjestöt 37.706

Kuluttajapolitiikka
type: Concept
References: Kauppaoikeus
References: Elintaso. Kulutus
References: Markkinointi. Kauppa
type: YKL-luokka
alternative label: Ekokulutus, kuluttajanoppaat (37.8)
alternative label: Ekologinen kulutus, kuluttajanoppaat (37.8)
alternative label: Ekologisk konsumtion, konsumenthandböcker (37.8) @sv
alternative label: Ekonomisk fostran, konsumentfostran (37.8) @sv
alternative label: Henkilökohtainen taloudenhoito, kuluttajaneuvonta (37.8)
alternative label: Hållbar konsumtion, konsumenthandböcker (37.8) @sv
alternative label: Kestävä kulutus, kuluttajanoppaat (37.8)
alternative label: Kilpailuttaminen, kuluttajan oppaat (37.8)
alternative label: Konkurrensutsättning, konsumenthandledningar (37.8) @sv
alternative label: Konsumentfostran (37.8) @sv
alternative label: Konsumenthandböcker (37.8) @sv
alternative label: Konsumentkunskap (37.8) @sv
alternative label: Konsumentombudsman (37.8) @sv
alternative label: Konsumentpolitik (37.8) @sv
alternative label: Konsumentrådgivning (37.8) @sv
alternative label: Konsumentskydd (37.8) @sv
alternative label: Konsumentupplysning (37.8) @sv
alternative label: Kooperativa föreningar (37.8) @sv
alternative label: Kuluttaja-asiamies (37.8)
alternative label: Kuluttajakasvatus (37.8)
alternative label: Kuluttajaneuvonta (37.8)
alternative label: Kuluttajanoppaat (37.8)
alternative label: Kuluttajansuoja (37.8)
alternative label: Kuluttajanvalistus (37.8)
alternative label: Kuluttajapolitiikka (37.8)
alternative label: Kuluttajatietous (37.8)
alternative label: Kulutusosuuskunnat (37.8)
alternative label: Personlig ekonomi, konsumentrådgivning (37.8) @sv
alternative label: Produktsäkerhet, konsumentpolitik (37.8) @sv
alternative label: Talouskasvatus, kuluttajakasvatus (37.8)
alternative label: Tuoteturvallisuus, kuluttajapolitiikka (37.8)
alternative label: Ympäristötietoinen kulutus, kuluttajanoppaat (37.8)
broader: SOSIAALIPOLITIIKKA
in scheme: YKL - Yleisten kirjastojen luokitusjärjestelmä
notation: 37.8
preferred label: Consumer policy @en
preferred label: Konsumentpolitik @sv
scope note: Hit allmänna verk om konsumentpolitik Konsumentskydd. Konsumentupplysning Konsumentfostran. Konsumentrådgivning Konsumentandelslag Hit också allmänna konsumenthandböcker Konsumentpolitiska frågor kring en enskild produkt klassificeras enligt produkt @sv
scope note: Tähän kuluttajapolitiikan yleisteokset Kuluttajansuoja. Kuluttajanvalistus Kuluttajakasvatus. Kuluttajaneuvonta Kulutusosuuskunnat Tähän myös yleiset kuluttajan oppaat Tiettyä tuotetta koskevat kuluttajapoliittiset kysymykset luokitetaan ko. tuotteen luokkaan

KASVATUS. OPETUS. KASVATUSTIEDE
type: Concept
References: KIRJASTOTOIMI. KIRJASTOTIEDE. INFORMATIIKKA
References: Elämänfilosofia. Elämäntaito
References: Kristillinen opetus ja kasvatus
References: Sukupuolten ja seksuaalisten ryhmien asema yhteiskunnassa
References: Kansainvälinen yhteistyö
References: Rauhankysymys. Rauhantutkimus
References: OIKEUSTIEDE
References: Sotilaskoulutus
References: Ympäristönsuojelu. Luonnonsuojelu
References: Henkilökohtainen terveydenhoito
References: Ravinto-oppi. Ruokavaliot
References: Seksologia
References: TAIDE. TAIDEHISTORIA
alternative label: Arbetspraktik, studier (38+) @sv
alternative label: Eettinen kasvatus (38+)
alternative label: Empatiakasvatus (38+)
alternative label: Empatiuppfostran (38+) @sv
alternative label: Etisk fostran (38+) @sv
alternative label: Finansiering av studier (38+) @sv
alternative label: Harjoittelu, opiskelu (38+)
alternative label: Inlärning i arbete, utbildning (38+) @sv
alternative label: Inlärningsmiljö (38+) @sv
alternative label: Kannustus, kasvatus (38+)
alternative label: Kansalaiskasvatus (38+)
alternative label: Kasvatus (38+)
alternative label: Kasvatusoppi, yl. (38)
alternative label: Kasvatuspolitiikka, yl. (38)
alternative label: Kasvatuspsykologia, yl. (38)
alternative label: Kasvatussosiologia, yl. (38)
alternative label: Kasvatustiede, yl. (38)
alternative label: Konservatorier (38+) @sv
alternative label: Konservatoriot (38+)
alternative label: Koulutuspolitiikka, yl. (38)
alternative label: Koulutustarve (38+)
alternative label: Kreativitetsfostran (38+) @sv
alternative label: Luovuuskasvatus (38+)
alternative label: Läroanstalter, allm. (38) @sv
alternative label: Medborgarfostran (38+) @sv
alternative label: Opetustoimi, yl. (38)
alternative label: Opinto-ohjaajan työ (38+)
alternative label: Opinto-ohjaus (38+)
alternative label: Opintojen rahoitus (38+)
alternative label: Opintolainat (38+)
alternative label: Opintotuki (38+)
alternative label: Opiskelijavaihto (38+)
alternative label: Opiskelu ulkomailla (38+)
alternative label: Oppilaitokset, yl. (38)
alternative label: Oppimisympäristö (38+)
alternative label: Palvelut, koulutuspalvelut (38+)
alternative label: Pedagogiikka, yl. (38)
alternative label: Pedagogik, allm. (38) @sv
alternative label: Pedagogisk psykologi, allm. (38) @sv
alternative label: Placering i arbetslivet, läroanstalter (38+) @sv
alternative label: Praktik, studier (38+) @sv
alternative label: Samlevnadskunskap (38+) @sv
alternative label: Service, utbildningstjänster (38+) @sv
alternative label: Stimulerande fostran (38+) @sv
alternative label: Studentutbyte (38+) @sv
alternative label: Studiehandledarens arbete (38+) @sv
alternative label: Syrjäytyminen, koulutuspolitiikka (38+)
alternative label: Työharjoittelu, opiskelu (38+)
alternative label: Työhönsijoittuminen, oppilaitokset (38+)
alternative label: Työssä oppiminen, koulutus (38+)
alternative label: Työssäoppiminen, koulutus (38+)
alternative label: Virikekasvatus (38+)
alternative label: Yhteisökasvatus (38+)
broader: YHTEISKUNTA
in scheme: YKL - Yleisten kirjastojen luokitusjärjestelmä
narrower: Perhe- ja kotikasvatus
narrower: Opetusoppi
narrower: Opiskelutekniikka
narrower: Yliopistot. Korkeakoulut
narrower: Koululaitos
narrower: Aikuiskoulutus. Vapaa sivistystyö
narrower: Nuorisotyö. Lapsityö
narrower: Ammatinvalinta
notation: 38
scope note: Hit allmänna verk om fostran, pedagogik, pedagogisk psykologi och pedagogisk sociologi. Hit också allmän pedagogisk politik och utbildningspolitik samt allmänna verk om pedagogiska system och utbildningssystem i olika länder. Hit och till underklasserna också samlevnadskunskap, kreativitetsfostran och empatifostran. Hit och till underklasserna också studiestöd och finansiering av studier. Fostran inom specialområden klassificeras enligt område. Pedagogisk filosofi 38.01 @sv
scope note: Tähän kasvatuksen, kasvatusopin, kasvatustieteen, pedagogiikan, kasvatuspsykologian ja kasvatussosiologian yleisteokset. Tähän myös yleinen kasvatus- ja koulutuspolitiikka sekä eri maiden kasvatus- ja koulutusjärjestelmiä koskevat yleisteokset. Tähän ja alaluokkiin myös yhteisö-, luovuus- ja empatiakasvatus. Tähän ja alaluokkiin myös opintotuki ja opintojen rahoitus. Erikoisaloihin liittyvä kasvatus luokitetaan alan mukaan. Kasvatusfilosofia 38.01

Perhe- ja kotikasvatus
type: Concept
References: Lapsuuden ja nuoruuden psykologia
References: Ihmissuhteiden psykologia
References: Perhesosiologia
References: Perhepolitiikka
References: Koululaitos
References: Esiopetus
References: Seksologia
References: Perhe-, ryhmä- ja ympäristöterapiat
References: Lasten terveydenhoito. Lastentaudit
type: YKL-luokka
alternative label: Asocialt beteende, familjefostran och hemuppfostran (38.1) @sv
alternative label: Asocialt beteende, uppfostringsrådgivning (38.1) @sv
alternative label: Barn, utveckling, pedagogisk psykologi (38.1) @sv
alternative label: Barns utveckling, pedagogisk psykologi (38.1) @sv
alternative label: Barnuppfostran (38.1) @sv
alternative label: Barnuppfostran, pedagogisk psykologi (38.1) @sv
alternative label: Beteendestörningar, familjefostran och hemuppfostran (38.1) @sv
alternative label: Beteendestörningar, uppfostringsrådgivning (38.1) @sv
alternative label: Familjefostran (38.1) @sv
alternative label: Föräldraguider, barnuppfostran (38.1) @sv
alternative label: Föräldraskap, handledningar i uppfostringsfrågor (38.1) @sv
alternative label: Handledningar i uppfostringsfrågor, föräldrar (38.1) @sv
alternative label: Kasvatusneuvolat (38.1)
alternative label: Kasvatusneuvonta (38.1)
alternative label: Kasvatusoppaat (38.1)
alternative label: Kasvatusoppaat, vanhemmat (38.1)
alternative label: Kotikasvatus (38.1)
alternative label: Kristen fostran, hemuppfostran (38.1) @sv
alternative label: Kristillinen kasvatus, kotikasvatus (38.1)
alternative label: Käyttäytymishäiriöt, kasvatusneuvonta (38.1)
alternative label: Käyttäytymishäiriöt, perhe- ja kotikasvatus (38.1)
alternative label: Käytännöllinen kasvatus (38.1)
alternative label: Käytöshäiriöt, kasvatusneuvonta (38.1)
alternative label: Käytöshäiriöt, perhe- ja kotikasvatus (38.1)
alternative label: Lapsen kehitys, kasvatuspsykologia (38.1)
alternative label: Lapset, kehitys, kasvatuspsykologia (38.1)
alternative label: Lastenkasvatus (38.1)
alternative label: Lastenkasvatus, kasvatuspsykologia (38.1)
alternative label: Murrosikä, koti- ja perhekasvatus (38.1)
alternative label: Neuvolat, kasvatusneuvolat (38.1)
alternative label: Nuorisopoliklinikat, kasvatusneuvolat (38.1)
alternative label: Ongelmakäyttäytyminen, kasvatusneuvonta (38.1)
alternative label: Ongelmakäyttäytyminen, perhe- ja kotikasvatus (38.1)
alternative label: Perhekasvatus (38.1)
alternative label: Praktisk fostran (38.1) @sv
alternative label: Problembeteende, familjefostran och hemuppfostran (38.1) @sv
alternative label: Problembeteende, uppfostringsrådgivning (38.1) @sv
alternative label: Puberteetti, koti- ja perhekasvatus (38.1)
alternative label: Pubertet, hem- och familjefostran (38.1) @sv
alternative label: Pubertet, hemuppfostran och familjefostran (38.1) @sv
alternative label: Religionsfostran, hemuppfostran (38.1) @sv
alternative label: Rådgivningsbyråer för uppfostringsfrågor (38.1) @sv
alternative label: Småbarnsfostran, familje- och hemuppfostran (38.1) @sv
alternative label: Ungdomspolikliniker, rådgivningsbyråer för uppfostringsfrågor (38.1) @sv
alternative label: Uppfostran i hemmet (38.1) @sv
alternative label: Uppfostran, handböcker (38.1) @sv
alternative label: Uppfostringsrådgivning (38.1) @sv
alternative label: Uskontokasvatus, kotikasvatus (38.1)
alternative label: Vanhemmuus, kasvatusoppaat (38.1)
alternative label: Vanhempainoppaat, lasten kasvatus (38.1)
alternative label: Varhaiskasvatus, perhe- ja kotikasvatus (38.1)
broader: KASVATUS. OPETUS. KASVATUSTIEDE
in scheme: YKL - Yleisten kirjastojen luokitusjärjestelmä
notation: 38.1
preferred label: Familjefostran och hemuppfostran @sv
preferred label: Family upbringing @en
scope note: Uppfostringsråd till föräldrar Uppfostran under de första åren ur familjefostrans och hemuppfostrans synvinkel Barn i lek- och skolåldern samt tonåringar ur familjefostrans och hemuppfostrans synvinkel Hit också pedagogisk forskning kring familjefostran och hemuppfostran Hit också rådgivning och rådgivningsbyråer för uppfostringsfrågor Om verket innehåller familjefostran, hemuppfostran och barnpsykologi, ges företräde åt klass 38.1 @sv
scope note: Vanhemmille tarkoitetut kasvatusoppaat Varhaiskasvatus perhe- ja kotikasvatuksen kannalta Leikki-, koulu- ja murrosikäiset perhe- ja kotikasvatuksen kannalta Tähän myös perhe- ja kotikasvatusta koskeva kasvatustieteellinen tutkimus Tähän myös kasvatusneuvonta ja kasvatusneuvolat Jos teoksessa on sekä perhe- ja kotikasvatusta että lapsipsykologiaa, annetaan etusija luokalle 38.1

Opetusoppi
type: Concept
References: Oppimisen psykologia
References: Eri alojen opetusoppi
References: Koululaitos
References: Erityisopetus. Erityiskasvatus. Erityiskoulut
References: Aikuiskoulutus. Vapaa sivistystyö
type: YKL-luokka
alternative label: Alkuopetus, opetusoppi (38.2+)
alternative label: Debatt, didaktik (38.2+) @sv
alternative label: Didaktiikka (38.2+)
alternative label: Didaktik (38.2+) @sv
alternative label: Draamakasvatus (38.2+)
alternative label: Draamapedagogiikka (38.2+)
alternative label: Dramafostran (38.2+) @sv
alternative label: Dramapedagogik (38.2+) @sv
alternative label: Elementarundervisning, didaktik (38.2+) @sv
alternative label: Elevbedömning (38.2+) @sv
alternative label: Erityisopetus, opetusoppi (38.2+)
alternative label: Esiopetus, opetusoppi (38.2+)
alternative label: Förskoleundervisning, didaktik (38.2+) @sv
alternative label: Grupparbete, undervisningsmetoder (38.2+) @sv
alternative label: Havainto-opetus (38.2+)
alternative label: Hemundervisning (38.2+) @sv
alternative label: Informaatiolukutaito, opetusoppi (38.2+)
alternative label: Informationskompetens, didaktik (38.2+) @sv
alternative label: Inlärning, didaktik (38.2+) @sv
alternative label: Kotiopetus (38.2+)
alternative label: Lukutaito, opetusoppi (38.2+)
alternative label: Läsfärdighet, didaktik (38.2+) @sv
alternative label: Medialukutaito, opetusoppi (38.2+)
alternative label: Medieläsfärdighet, didaktik (38.2+) @sv
alternative label: Opettaminen, opetusoppi (38.2+)
alternative label: Opetus, opetusoppi (38.2+)
alternative label: Opetusmenetelmät (38.2+)
alternative label: Opetusoppi (38.2+)
alternative label: Opetussuunnitelmat (38.2+)
alternative label: Opiskelumotivaatio, opetusoppi (38.2+)
alternative label: Oppilasarviointi (38.2+)
alternative label: Oppilasarvostelu (38.2+)
alternative label: Oppiminen, opetusoppi (38.2+)
alternative label: Ryhmätyö, opetusmenetelmät (38.2+)
alternative label: Specialundervisning, didaktik (38.2+) @sv
alternative label: Studiemotivation, didaktik (38.2+) @sv
alternative label: Suggestopedi, undervisningsmetoder (38.2+) @sv
alternative label: Suggestopedia, opetusmenetelmät (38.2+)
alternative label: Timresurssystem (38.2+) @sv
alternative label: Tuntikehysjärjestelmä (38.2+)
alternative label: Undervisning på främmande språk (38.2+) @sv
alternative label: Undervisning, didaktik (38.2+) @sv
alternative label: Undervisningsmetoder (38.2+) @sv
alternative label: Undervisningsplaner (38.2+) @sv
alternative label: Vieraskielinen opetus (38.2+)
alternative label: Väittely, didaktiikka (38.2+)
alternative label: Åskådningsundervisning (38.2+) @sv
broader: KASVATUS. OPETUS. KASVATUSTIEDE
in scheme: YKL - Yleisten kirjastojen luokitusjärjestelmä
narrower: Oppimateriaalit. Opetusvälineet
narrower: Eri alojen opetusoppi
notation: 38.2
preferred label: Didactics @en
preferred label: Didaktik @sv
scope note: Hit oavsett läroinrättning allmänna verk om didaktik och undervisningsmetoder Hit t.ex. grupparbete och suggestopedi som allmänna undervisningsmetoder Hit också oavsett läroinrättning allmänna verk om undervisningsplaner eller elevbedömning Didaktik, undervisningsmetoder, undervisningsplaner och elevbedömning inom ett enskilt område eller läroämne 38.29+ Verk som inte är allmänna verk om didaktik men behandlar didaktik inom två eller flera specialområden förs till klassen 38.29 @sv
scope note: Tähän oppilaitoksesta riippumatta opetusoppia tai opetusmenetelmiä koskevat yleisteokset Tähän esim. ryhmätyö ja suggestopedia yleisinä opetusmenetelminä Tähän myös oppilaitoksesta riippumatta opetusmenetelmät, opetussuunnitelmat ja oppilasarviointi Tietyn alan tai aineen opetusoppi, opetusmenetelmät, opetussuunnitelmat tai oppilasarviointi 38.29+ Teokset, jotka eivät ole opetusopin yleisteoksia, mutta koskevat kahden tai useamman erikoisalan opetusoppia, sijoitetaan luokkaan 38.29

Oppimateriaalit. Opetusvälineet
type: Concept
References: Kielten ja kirjallisuuden opetusoppi
type: YKL-luokka
alternative label: AV-aineisto, opetusvälineet (38.22)
alternative label: AV-apparatur, läromedel (38.22) @sv
alternative label: AV-laitteisto, opetusvälineet (38.22)
alternative label: AV-material, läromedel (38.22) @sv
alternative label: AV-tekniikka, opetusvälineet (38.22)
alternative label: AV-teknik, läromedel (38.22) @sv
alternative label: AV-utrustning, läromedel (38.22) @sv
alternative label: AV-välineet, opetusvälineet (38.22)
alternative label: Arbetsprojektorer, undervisningsmateriel (38.22) @sv
alternative label: Audiovisuaalinen aineisto, opetusvälineet (38.22)
alternative label: Audiovisuaalinen laitteisto, opetusvälineet (38.22)
alternative label: Audiovisuaalinen tekniikka, opetusvälineet (38.22)
alternative label: Audiovisuaaliset välineet, opetusvälineet (38.22)
alternative label: Audiovisuell apparatur, läromedel (38.22) @sv
alternative label: Audiovisuell teknik, läromedel (38.22) @sv
alternative label: Audiovisuell utrustning, läromedel (38.22) @sv
alternative label: Audiovisuella material, läromedel (38.22) @sv
alternative label: Digitaalinen oppimateriaali (38.22+)
alternative label: Digitala läromedel (38.22+) @sv
alternative label: Kouluradio (38.22)
alternative label: Koulutelevisio (38.22)
alternative label: Ljudupptagningar, undervisningsmateriel (38.22) @sv
alternative label: Läroböcker, undervisningsmateriel (38.22) @sv
alternative label: Läromedel (38.22) @sv
alternative label: Opetuselokuvat, opetusvälineet (38.22)
alternative label: Opetusvideot, opetusvälineet (38.22)
alternative label: Opetusvälineet (38.22)
alternative label: Oppikirjat, opetusvälineet (38.22)
alternative label: Oppimateriaalit (38.22)
alternative label: Piirtoheittimet, opetusvälineet (38.22)
alternative label: Projektorer, undervisningsmaterial (38.22) @sv
alternative label: Projektorit, opetusvälineet (38.22)
alternative label: Radio, opetusvälineet (38.22)
alternative label: Radio, undervisningsmateriel (38.22) @sv
alternative label: Skolradio (38.22) @sv
alternative label: Skoltelevision (38.22) @sv
alternative label: TV, undervisningsmateriel (38.22) @sv
alternative label: Televisio, opetusvälineet (38.22)
alternative label: Undervisningsfilmer, undervisningsmateriel (38.22) @sv
alternative label: Undervisningsmateriel (38.22) @sv
alternative label: Undervisningsvideor, undervisningsmateriel (38.22) @sv
alternative label: Video, opetusvälineet (38.22)
alternative label: Video, undervisningsmateriel (38.22) @sv
alternative label: Äänitteet, opetusvälineet (38.22)
broader: Opetusoppi
in scheme: YKL - Yleisten kirjastojen luokitusjärjestelmä
narrower: Tietotekniikan käyttö opetuksessa
notation: 38.22
preferred label: Study materials. Teaching aids @en
preferred label: Undervisningsmaterial. Läromedel @sv
scope note: Hit oavsett läroinrättning allmänna verk om undervisningsmaterial eller läromedel Hit allmänna verk om läroböcker, AV-material, skolradio och skoltelevision Undervisningsmaterial och läromedel som används i undervisningen inom ett särskilt område eller ämne 38.29+ @sv
scope note: Tähän oppilaitoksesta riippumatta oppimateriaaleja tai opetusvälineitä koskevat yleisteokset Tähän oppikirjoja, av-välineitä, kouluradiota tai koulutelevisiota koskevat yleisteokset Tietyn alan tai aineen opetukseen liittyvät oppimateriaalit ja opetusvälineet 38.29+

Tietotekniikan käyttö opetuksessa
type: Concept
References: Sovellettujen tieteiden opetusoppi
References: TIETOTEKNIIKKA. TIETOLIIKENNE. VIESTINTÄTEKNIIKKA. TEKOÄLY
type: YKL-luokka
alternative label: Datorstödd inlärning (38.221) @sv
alternative label: Datorstödd undervisning (38.221) @sv
alternative label: E-lärande (38.221) @sv
alternative label: Nätpedagogik (38.221) @sv
alternative label: Nätstudier (38.221) @sv
alternative label: Nätundervisning (38.221) @sv
alternative label: Opetusteknologia (38.221)
alternative label: Tietokoneavusteinen opetus (38.221)
alternative label: Tietokoneavusteinen opiskelu (38.221)
alternative label: Undervisningsteknologi (38.221) @sv
alternative label: Verkko-opetus (38.221)
alternative label: Verkko-opiskelu (38.221)
alternative label: Verkko-oppimateriaali (38.221)
alternative label: Verkko-oppiminen (38.221)
alternative label: Verkkopedagogiikka (38.221)
alternative label: Webbläromedel (38.221) @sv
broader: Oppimateriaalit. Opetusvälineet
in scheme: YKL - Yleisten kirjastojen luokitusjärjestelmä
notation: 38.221
preferred label: Datateknik i undervisningen @sv
preferred label: Use of information technology in teaching @en
scope note: Hit oavsett läroinrättning allmänna verk om datorstödd undervisning Datateknik och datanät i undervisningeni allmänhet Nätundervisning, inlärning i nätet och nätpedagogik i allmänhet Datateknik i undervisningen inom ett särskilt område 38.29+ @sv
scope note: Tähän oppilaitoksesta riippumatta tietokoneavusteisen opetuksen yleisteokset Tietotekniikan ja tietoverkkojen käyttö opetuksessa yleensä Verkko-opetus, verkko-oppiminen ja verkkopedagogiikka yleensä Tietotekniikan käyttö tietyn alan opetuksessa 38.29+

Eri alojen opetusoppi
type: Concept
References: Opetusoppi
References: Oppimateriaalit. Opetusvälineet
References: Tietotekniikan käyttö opetuksessa
type: YKL-luokka
alternative label: Ainedidaktiikka (38.29+)
alternative label: Aineopetus (38.29+)
alternative label: Biblioteksvetenskap, didaktik (38.29) @sv
alternative label: Informatiikka, opetusoppi (38.29)
alternative label: Informatik, didaktik (38.29) @sv
alternative label: Informationssökning, didaktik (38.29+) @sv
alternative label: Joukkoviestintä, opetusoppi (38.29)
alternative label: Kirjastotiede, opetusoppi (38.29)
alternative label: Masskommunikation, didaktik (38.29) @sv
alternative label: Mediakasvatus, opetusoppi (38.29)
alternative label: Mediefostran, didaktik (38.29) @sv
alternative label: Omgivningslära, didaktik (38.29) @sv
alternative label: Tiedonhaku, opetusoppi (38.29+)
alternative label: Ympäristöoppi, opetusoppi (38.29)
alternative label: Ämnesdidaktik (38.29+) @sv
alternative label: Ämnesundervisning (38.29+) @sv
broader: Opetusoppi
in scheme: YKL - Yleisten kirjastojen luokitusjärjestelmä
narrower: Filosofian ja psykologian opetusoppi
narrower: Uskonnon opetusoppi
narrower: Yhteiskuntatieteiden opetusoppi
narrower: Maantieteen ja kansatieteen opetusoppi
narrower: Matematiikan, luonnontieteiden ja lääketieteen opetusoppi
narrower: Sovellettujen tieteiden opetusoppi
narrower: Taiteiden ja urheilun opetusoppi
narrower: Kielten ja kirjallisuuden opetusoppi
narrower: Historian opetusoppi
notation: 38.29
preferred label: Didactics in different fields @en
preferred label: Didaktik inom olika områden @sv
scope note: Hit och till underklasserna oavsett läroinrättning didaktik, undervisningsmetoder, undervisningsplaner och elevbedömning inom olika områden Hit och till underklasserna också verk om undervisningsmaterial, läromedel, läroböcker, AV-material, datateknik, skolradio och skol-TV för undervisning inom olika områden eller inom olika ämnen Hit även verk som inte är allmänna verk om didaktik men behandlar didaktik inom två eller flera specialområden Hit didaktik inom specialområden som hör till huvudklass 0 Biblioteksvetenskapens, informatikens och masskommunikationens didaktik. Omgivningslärans didaktik @sv
scope note: Tähän ja alaluokkiin oppilaitoksesta riippumatta eri alojen tai aineiden opetusoppi, opetusmenetelmät, opetussuunnitelmat ja oppilasarvostelu Tähän ja alaluokkiin myös eri alojen tai aineiden opetukseen liittyviä oppimateriaaleja, opetusvälineitä, oppikirjoja, av-aineistoa, tietotekniikkaa, kouluradiota tai koulutelevisiota koskevat teokset Tähän myös teokset, jotka eivät ole opetusopin yleisteoksia, mutta koskevat kahden tai useamman erikoisalan opetusoppia Tähän pääluokkaan 0 kuuluvien erikoisalojen opetusoppi Kirjastotieteen ja informatiikan sekä joukkotiedotuksen opetusoppi. Ympäristöopin opetusoppi

Filosofian ja psykologian opetusoppi
type: Concept
type: YKL-luokka
alternative label: Elämänkatsomustieto, opetusoppi (38.291)
alternative label: Etiikka, opetusoppi (38.291)
alternative label: Etik, didaktik (38.291) @sv
alternative label: Filosofi, didaktik (38.291) @sv
alternative label: Filosofia, opetusoppi (38.291)
alternative label: Livsåskådningskunskap, didaktik (38.291) @sv
alternative label: Psykologi, didaktik (38.291) @sv
alternative label: Psykologia, opetusoppi (38.291)
broader: Eri alojen opetusoppi
in scheme: YKL - Yleisten kirjastojen luokitusjärjestelmä
notation: 38.291
preferred label: Didactics in philosophy and psychology @en
preferred label: Didaktik i filosofi och psykologi @sv
scope note: Hit didaktik inom specialområden som hör till huvudklass 1 Livsåskådningskunskapens och etikens didaktik @sv
scope note: Tähän pääluokkaan 1 kuuluvien erikoisalojen opetusoppi Elämänkatsomustiedon ja etiikan opetusoppi

Uskonnon opetusoppi
type: Concept
type: YKL-luokka
alternative label: Kirkkohistoria, opetusoppi (38.292)
alternative label: Kristendom, didaktik (38.292) @sv
alternative label: Kristinusko, opetusoppi (38.292)
alternative label: Kyrkohistoria, didaktik (38.292) @sv
alternative label: Religion, didaktik (38.292) @sv
alternative label: Uskonto, opetusoppi (38.292)
broader: Eri alojen opetusoppi
in scheme: YKL - Yleisten kirjastojen luokitusjärjestelmä
notation: 38.292
preferred label: Didactics in religious instruction @en
preferred label: Religionens didaktik @sv
scope note: Hit didaktik inom specialområden som hör till huvudklass 2 Kyrkohistoriens didaktik @sv
scope note: Tähän pääluokkaan 2 kuuluvien erikoisalojen opetusoppi Kirkkohistorian opetusoppi

Yhteiskuntatieteiden opetusoppi
type: Concept
References: Eri alojen opetusoppi
type: YKL-luokka
alternative label: Fostran till internationalism, didaktik (38.293) @sv
alternative label: Fredsfostran, didaktik (38.293) @sv
alternative label: Hembygdslära, didaktik (38.293) @sv
alternative label: Kansainvälisyyskasvatus, opetusoppi (38.293)
alternative label: Kansalaistaito, opetusoppi (38.293)
alternative label: Kotiseutuoppi, opetusoppi (38.293)
alternative label: Medborgarfärdighet, didaktik (38.293) @sv
alternative label: Rauhankasvatus, opetusoppi (38.293)
alternative label: Samhällslära, didaktik (38.293) @sv
alternative label: Samhällsvetenskaper, didaktik (38.293) @sv
alternative label: Yhteiskuntaoppi, opetusoppi (38.293)
alternative label: Yhteiskuntatieteet, opetusoppi (38.293)
broader: Eri alojen opetusoppi
in scheme: YKL - Yleisten kirjastojen luokitusjärjestelmä
notation: 38.293
preferred label: Didactics in the social sciences @en
preferred label: Samhällsvetenskapernas didaktik @sv
scope note: Hit didaktik inom specialområden som hör till huvudklass 3 Didaktik inom olika områden inom samhällsvetenskaperna Didaktik i medborgarkunskap och samhällslära @sv
scope note: Tähän pääluokkaan 3 kuuluvien erikoisalojen opetusoppi Yhteiskuntatieteiden eri alojen opetusoppi Kansalaistaidon ja yhteiskuntaopin opetusoppi

Maantieteen ja kansatieteen opetusoppi
type: Concept
type: YKL-luokka
alternative label: Etnologi, didaktik (38.294) @sv
alternative label: Geografi, didaktik (38.294) @sv
alternative label: Kansatiede, opetusoppi (38.294)
alternative label: Maantiede, opetusoppi (38.294)
alternative label: Maantieto, opetusoppi (38.294)
broader: Eri alojen opetusoppi
in scheme: YKL - Yleisten kirjastojen luokitusjärjestelmä
notation: 38.294
preferred label: Didactics in geography and ethnology @en
preferred label: Geografins och etnologins didaktik @sv
scope note: Hit didaktik inom specialområden som hör till huvudklass 4 @sv
scope note: Tähän pääluokkaan 4 kuuluvien erikoisalojen opetusoppi

Matematiikan, luonnontieteiden ja lääketieteen opetusoppi
type: Concept
References: Eri alojen opetusoppi
type: YKL-luokka
alternative label: Biologi, didaktik (38.295) @sv
alternative label: Biologia, opetusoppi (38.295)
alternative label: Fysiikka, opetusoppi (38.295)
alternative label: Fysik, didaktik (38.295) @sv
alternative label: Hälsokunskap, didaktik (38.295) @sv
alternative label: Hälsolära, didaktik (38.295) @sv
alternative label: Kemi, didaktik (38.295) @sv
alternative label: Kemia, opetusoppi (38.295)
alternative label: Luonnontieteet, opetusoppi (38.295)
alternative label: Lääketiede, opetusoppi (38.295)
alternative label: Matematiikka, opetusoppi (38.295)
alternative label: Matematik, didaktik (38.295) @sv
alternative label: Medicin, didaktik (38.295) @sv
alternative label: Naturvetenskaper, didaktik (38.295) @sv
alternative label: Terveysoppi, opetusoppi (38.295)
alternative label: Terveystieto, opetusoppi (38.295)
broader: Eri alojen opetusoppi
in scheme: YKL - Yleisten kirjastojen luokitusjärjestelmä
notation: 38.295
preferred label: Didactics in mathematics and the natural sciences @en
preferred label: Matematikens, naturvetenskapernas och medicinens didaktik @sv
scope note: Hit didaktik inom specialområden som hör till huvudklass 5 Didaktik inom olika områden inom naturvetenskaperna och medicinen Fysikens, kemins, biologins och hälsolärans didaktik @sv
scope note: Tähän pääluokkaan 5 kuuluvien erikoisalojen opetusoppi Luonnontieteen ja lääketieteen eri alojen opetusoppi Fysiikan, kemian, biologian ja terveystiedon opetusoppi

Sovellettujen tieteiden opetusoppi
type: Concept
type: YKL-luokka
alternative label: Ammattiaineet, opetusoppi (38.296)
alternative label: Företagarfostran, didaktik (38.296) @sv
alternative label: Företagarutbildning, didaktik (38.296) @sv
alternative label: Företagsekonomi, didaktik (38.296) @sv
alternative label: Gårdsbruk, didaktik (38.296) @sv
alternative label: Handarbeten, didaktik (38.296) @sv
alternative label: Huslig ekonomi, didaktik (38.296) @sv
alternative label: Industriella yrken, didaktik (38.296) @sv
alternative label: Informationsteknik, didaktik (38.296) @sv
alternative label: Kaupalliset aineet, opetusoppi (38.296)
alternative label: Konekirjoitus, opetusoppi (38.296)
alternative label: Kotitalous, opetusoppi (38.296)
alternative label: Käsityöt, opetusoppi (38.296)
alternative label: Liikenne, opetusoppi (38.296)
alternative label: Liiketalous, opetusoppi (38.296)
alternative label: Maatilatalous, opetusoppi (38.296)
alternative label: Maskinskrivning, didaktik (38.296) @sv
alternative label: Matpedagogik, skolan (38.296+) @sv
alternative label: Merkantila ämnen, didaktik (38.296) @sv
alternative label: Näring, uppfostran, skolan (38.296) @sv
alternative label: Ravitsemus, kasvatus, koulu (38.296)
alternative label: Ruokakasvatus, koulu (38.296+)
alternative label: Sovelletut tieteet, opetusoppi (38.296)
alternative label: Tekniikka, opetusoppi (38.296)
alternative label: Teknik, didaktik (38.296) @sv
alternative label: Tekninen työ, opetusoppi (38.296)
alternative label: Tekniskt arbete, didaktik (38.296) @sv
alternative label: Teknologiakasvatus, opetusoppi (38.296)
alternative label: Teknologifostran, didaktik (38.296) @sv
alternative label: Tekstiilityö, opetusoppi (38.296)
alternative label: Teollisuusammatit, opetusoppi (38.296)
alternative label: Textilarbete, didaktik (38.296) @sv
alternative label: Tietotekniikka, opetusoppi (38.296)
alternative label: Tillämpade vetenskaper, didaktik (38.296) @sv
alternative label: Trafik, didaktik (38.296) @sv
alternative label: Yrittäjyyskasvatus, opetusoppi (38.296)
alternative label: Yrittäjäkoulutus, opetusoppi (38.296)
alternative label: Yrkesämnen, didaktik (38.296) @sv
broader: Eri alojen opetusoppi
in scheme: YKL - Yleisten kirjastojen luokitusjärjestelmä
notation: 38.296
preferred label: Didactics in the applied sciences @en
preferred label: Didaktik i tillämpade vetenskaper @sv
scope note: Hit didaktik inom specialområden som hör till huvudklass 6 Didaktik inom olika områden i tillämpade vetenskaper, teknik, industri, företagsekonomi och trafik Yrkesämnenas didaktik Didaktik i databranschen, merkantila ämnen, huslig ekonomi, lantbruksekonomi, tekniska verk, textilarbeten och maskinskrivning @sv
scope note: Tähän pääluokkaan 6 kuuluvien erikoisalojen opetusoppi Sovellettujen tieteiden, tekniikan, teollisuuden, liiketalouden ja liikenteen eri alojen opetusoppi Ammattiaineiden opetusoppi Kaupallisten aineiden, kotitalouden, maatilatalouden, teknisen työn, tekstiilityön ja konekirjoituksen opetusoppi

Taiteiden ja urheilun opetusoppi
type: Concept
type: YKL-luokka
alternative label: Bildkonst, didaktik (38.297) @sv
alternative label: Dans, didaktik (38.297) @sv
alternative label: Elokuva, opetusoppi (38.297)
alternative label: Film, didaktik (38.297) @sv
alternative label: Gymnastik och idrott, didaktik (38.297) @sv
alternative label: Gymnastik, didaktik (38.297) @sv
alternative label: Idrott, didaktik (38.297) @sv
alternative label: Konst, didaktik (38.297) @sv
alternative label: Konstundervisning, didaktik (38.297) @sv
alternative label: Konstämnen, didaktik (38.297) @sv
alternative label: Koululiikunta, opetusoppi (38.297)
alternative label: Kuvataiteet, opetusoppi (38.297)
alternative label: Laulu, opetusoppi (38.297)
alternative label: Liikunta, opetusoppi (38.297)
alternative label: Motion, didaktik (38.297) @sv
alternative label: Musiikin opetusoppi (38.297)
alternative label: Musiikki, opetusoppi (38.297)
alternative label: Musiikkikasvatus (38.297)
alternative label: Musiikkiliikunta, musiikkikasvatus (38.297)
alternative label: Musiikkipedagogiikka (38.297)
alternative label: Musik, didaktik (38.297) @sv
alternative label: Musikens didaktik (38.297) @sv
alternative label: Musikfostran (38.297) @sv
alternative label: Musikgymnastik, musikfostran (38.297) @sv
alternative label: Musikpedagogik (38.297) @sv
alternative label: Piirustus, opetusoppi (38.297)
alternative label: Sång, didaktik (38.297) @sv
alternative label: Taideaineet, opetusoppi (38.297)
alternative label: Taideopetus, opetusoppi (38.297)
alternative label: Taiteet, opetusoppi (38.297)
alternative label: Tanssi, opetusoppi (38.297)
alternative label: Teaterkonst, didaktik (38.297) @sv
alternative label: Teatteritaide, opetusoppi (38.297)
alternative label: Teckning, didaktik (38.297) @sv
alternative label: Urheilu, opetusoppi (38.297)
alternative label: Voimistelu, opetusoppi (38.297)
broader: Eri alojen opetusoppi
in scheme: YKL - Yleisten kirjastojen luokitusjärjestelmä
notation: 38.297
preferred label: Didactics in art and sports @en
preferred label: Didaktik i konst och idrott @sv
scope note: Hit didaktik inom specialområden som hör till huvudklass 7 Konstämnenas och musikens didaktik Gymnastikens didaktik @sv
scope note: Tähän pääluokkaan 7 kuuluvien erikoisalojen opetusoppi Taideaineiden ja musiikin opetusoppi Liikunnan ja voimistelun opetusoppi

Kielten ja kirjallisuuden opetusoppi
type: Concept
type: YKL-luokka
alternative label: Främmande språk, didaktik (38.298) @sv
alternative label: Informaatiolukutaito, opetusoppi, äidinkieli (38.298)
alternative label: Informationskompetens, didaktik, modersmål (38.298) @sv
alternative label: Kielet, opetusoppi (38.298)
alternative label: Kielikylpy (38.298)
alternative label: Kielilaboratoriot (38.298)
alternative label: Kielistudiot (38.298)
alternative label: Kirjallisuus, opetusoppi (38.298)
alternative label: Kirjoittaminen, opetusoppi (38.298)
alternative label: Litteratur, didaktik (38.298) @sv
alternative label: Lukeminen, opetusoppi (38.298)
alternative label: Lukemisvaikeudet, äidinkielen opetusoppi (38.298)
alternative label: Lukutaito, opetusoppi, äidinkieli (38.298)
alternative label: Läsfärdighet, didaktik, modersmål (38.298) @sv
alternative label: Läsning, didaktik (38.298) @sv
alternative label: Lässvårigheter, modersmålets didaktik (38.298) @sv
alternative label: Medialukutaito, opetusoppi, äidinkieli (38.298)
alternative label: Medieläsfärdighet, didaktik, modersmål (38.298) @sv
alternative label: Modersmål, didaktik (38.298) @sv
alternative label: Oikeinkirjoitus, opetusoppi (38.298)
alternative label: Ordkonstfostran, allm. (38.298) @sv
alternative label: Rättskrivning, didaktik (38.298) @sv
alternative label: Sanataidekasvatus, yl. (38.298)
alternative label: Skrivande, didaktik (38.298) @sv
alternative label: Språk, didaktik (38.298) @sv
alternative label: Språkbad (38.298) @sv
alternative label: Språklaboratorier (38.298) @sv
alternative label: Språkstudior (38.298) @sv
alternative label: Vieraat kielet, opetusoppi (38.298)
alternative label: Äidinkieli, opetusoppi (38.298)
broader: Eri alojen opetusoppi
in scheme: YKL - Yleisten kirjastojen luokitusjärjestelmä
notation: 38.298
preferred label: Didactics in language and literature @en
preferred label: Didaktik i språk och litteratur @sv
scope note: Hit didaktik inom specialområden som hör till huvudklass 8 Läsandets och skrivandets didaktik Modersmåls- och språkdidaktik Språkstudior. Språkbad @sv
scope note: Tähän pääluokkaan 8 kuuluvien erikoisalojen opetusoppi Lukemisen ja kirjoittamisen opetusoppi Äidinkielen ja vieraiden kielten opetusoppi Kielistudiot. Kielikylpy

Historian opetusoppi
type: Concept
type: YKL-luokka
alternative label: Historia, didaktik (38.299) @sv
alternative label: Historia, opetusoppi (38.299)
broader: Eri alojen opetusoppi
in scheme: YKL - Yleisten kirjastojen luokitusjärjestelmä
notation: 38.299
preferred label: Didactics in history @en
preferred label: Historiens didaktik @sv
scope note: Hit didaktik inom specialområden som hör till huvudklass 9 @sv
scope note: Tähän pääluokkaan 9 kuuluvien erikoisalojen opetusoppi

Opiskelutekniikka
type: Concept
References: Tiedeoppi. Tieteenfilosofia
References: Opetusoppi
References: Suomen kieli
References: Ruotsin kieli
type: YKL-luokka
alternative label: Anteckningar, studieteknik (38.3) @sv
alternative label: Avhandlingsteknik, handböcker för studerande (38.3) @sv
alternative label: Avhandlingsteknik, studerande (38.3) @sv
alternative label: Datorstödd inlärning, studieteknik (38.3) @sv
alternative label: Författande av vetenskaplig text, vägledningar i avhandlingsteknik för studerande (38.3) @sv
alternative label: Informationssökning, avhandlingsteknik, studerande (38.3) @sv
alternative label: Informationssökning, studieteknik (38.3) @sv
alternative label: Kirjoittaminen, tutkielmat (38.3)
alternative label: Lukeminen, lukemistekniikka (38.3)
alternative label: Lärdomsprov, handledning (38.3) @sv
alternative label: Läsande, lästeknik (38.3) @sv
alternative label: Muistiinpanot, opiskelutekniikka (38.3)
alternative label: Nätstudier, studieteknik (38.3) @sv
alternative label: Opinnäytteet, laadintaohjeet (38.3)
alternative label: Opiskelutekniikka (38.3)
alternative label: Pikaluku (38.3)
alternative label: Pro gradu -tutkielmat, laadinta (38.3)
alternative label: Pro gradu-avhandlingar, utarbetning (38.3) @sv
alternative label: Skrivande, lärdomsprov (38.3) @sv
alternative label: Snabbläsning (38.3) @sv
alternative label: Studieteknik (38.3) @sv
alternative label: Tiedonhaku, opiskelutekniikka (38.3)
alternative label: Tiedonhaku, tutkielman laadinta, opiskelijat (38.3)
alternative label: Tieteellinen kirjoittaminen, opiskelijoille tarkoitetut tutkielman laatimisoppaat (38.3)
alternative label: Tietokoneavusteinen opiskelu, opiskelutekniikka (38.3)
alternative label: Tutkielman laadinta, opiskelijat (38.3)
alternative label: Tutkielman laatimisoppaat, opiskelijoille tarkoitetut (38.3)
alternative label: Verkko-opiskelu, opiskelutekniikka (38.3)
broader: KASVATUS. OPETUS. KASVATUSTIEDE
in scheme: YKL - Yleisten kirjastojen luokitusjärjestelmä
notation: 38.3
preferred label: Studieteknik @sv
preferred label: Study techniques @en
scope note: Hit studieteknik oavsett läroinrättning och läroämne Läsandets teknik. Snabbläsning Hit också handledningar för studenter i avhandlingsteknik Om verket innehåller både studieteknik och vetenskapsteori, ges företräde åt klass 38.3 @sv
scope note: Tähän opiskelutekniikka oppilaitoksesta ja oppiaineesta riippumatta Lukemisen tekniikka. Pikaluku Tähän myös opiskelijoille tarkoitetut tutkielmien laatimisoppaat Jos teoksessa on sekä opiskelutekniikkaa että tiedeoppia, annetaan etusija luokalle 38.3

Yliopistot. Korkeakoulut
type: Concept
References: Tiedepolitiikka
References: Poliittiset järjestelmät
References: Opetusoppi
References: Opiskelutekniikka
References: Koululaitos
References: Aikuiskoulutus. Vapaa sivistystyö
References: Sotilaskoulutus
References: Kulttuurirakennukset
alternative label: Aikuiskoulutus, korkea-aste, yl. (38.4+)
alternative label: Ammattikorkeakoulut (38.4+)
alternative label: Arbetspraktik, högskolestudier (38.4+) @sv
alternative label: Auskultering (38.4+) @sv
alternative label: Auskultointi (38.4+)
alternative label: Avoin yliopisto (38.4+)
alternative label: Eläinlääketieteelliset korkeakoulut (38.4+)
alternative label: Fortbildning, högsskolenivån (38.4+) @sv
alternative label: Handelshögskolor (38.4+) @sv
alternative label: Harjoittelu, korkeakouluopiskelu (38.4+)
alternative label: Högre utbildning (38.4+) @sv
alternative label: Högskoleförvaltning (38.4+) @sv
alternative label: Högskolelagstiftning (38.4+) @sv
alternative label: Högskolepolitik (38.4+) @sv
alternative label: Högskolestudier (38.4+) @sv
alternative label: Högskolestudier, finansiering (38.4+) @sv
alternative label: Högskolor (38.4+) @sv
alternative label: Internationellt studentutbyte (38.4+) @sv
alternative label: Jatkokoulutus, korkea-aste (38.4+)
alternative label: Kansainvälinen opiskelijavaihto (38.4+)
alternative label: Kauppakorkeakoulut (38.4+)
alternative label: Kesäyliopistot (38.4+)
alternative label: Konstskolor, högskolor (38.4+) @sv
alternative label: Konststudier, högskolor (38.4+) @sv
alternative label: Korkea-asteen koulutus (38.4+)
alternative label: Korkeakouluhallinto (38.4+)
alternative label: Korkeakoululainsäädäntö (38.4+)
alternative label: Korkeakouluopinnot (38.4+)
alternative label: Korkeakouluopinnot, rahoitus (38.4+)
alternative label: Korkeakoulupolitiikka (38.4+)
alternative label: Korkeakoulut (38.4+)
alternative label: Koulutuspolitiikka, yliopistot ja korkeakoulut (38.4+)
alternative label: Lärare, utbildning på högskolenivå (38.4+) @sv
alternative label: Lärarutbildning (38.4+) @sv
alternative label: Läroanstalter, universitet och högskolor (38.4+) @sv
alternative label: Nationer, studentkårer (38.4+) @sv
alternative label: Omskolning, högskolenivån (38.4+) @sv
alternative label: Opettajankoulutus (38.4+)
alternative label: Opettajat, korkea-asteen koulutus (38.4+)
alternative label: Opetusharjoittelu (38.4+)
alternative label: Opiskelijajärjestöt, yliopistot ja korkeakoulut (38.4+)
alternative label: Opiskelijatoiminta, yliopistot ja korkeakoulut (38.4+)
alternative label: Opiskelu ulkomailla, korkeakoulut (38.4+)
alternative label: Opiskelu, korkeakoulut (38.4+)
alternative label: Opiskelumotivaatio, korkea-asteen koulutus (38.4+)
alternative label: Oppilaitokset, yliopistot ja korkeakoulut (38.4+)
alternative label: Osakunnat (38.4+)
alternative label: Praktik, högskolestudier (38.4+) @sv
alternative label: Sommaruniversitet (38.4+) @sv
alternative label: Studentnationer (38.4+) @sv
alternative label: Studentorganisationer (38.4+) @sv
alternative label: Taidekoulut, korkeakoulut (38.4+)
alternative label: Taideopinnot, korkeakoulut (38.4+)
alternative label: Teatterikoulut, korkea-asteen koulutus (38.4+)
alternative label: Teknilliset korkeakoulut (38.4+)
alternative label: Työharjoittelu, korkeakouluopiskelu (38.4+)
alternative label: Täydennyskoulutus, korkea-aste (38.4+)
alternative label: Uudelleenkoulutus, korkea-aste (38.4+)
alternative label: Yliopisto-opinnot (38.4+)
alternative label: Yliopisto-opinnot, rahoitus (38.4+)
alternative label: Yliopistohallinto (38.4+)
alternative label: Yliopistolainsäädäntö (38.4+)
alternative label: Yliopistot (38.4+)
alternative label: Ylioppilasjärjestöt (38.4+)
alternative label: Ylioppilasosakunnat (38.4+)
broader: KASVATUS. OPETUS. KASVATUSTIEDE
in scheme: YKL - Yleisten kirjastojen luokitusjärjestelmä
narrower: Yksittäiset yliopistot ja korkeakoulut
notation: 38.4
scope note: Hit allmänna verk om universitets- och högskoleväsen i olika länder Administration och organisation i universitet och högskolor Universitets- och högskolelagstiftning Forskning och undervisning inom olika områden inom universitet och högskolor Studier vid universitet och högskolor och finansiering av studierna Studentverksamhet och internationellt studentutbyte Hit och till underklasserna även vuxen- och påbyggnadsutbildning, öppna universitet, sommaruniversitet, yrkeshögskolor, särskild betygsundervisning och annan utvidgad verksamhet vid universitet och högskolor Lärarutbildning Verk om enskilda universitet eller högskolor 38.41 @sv
scope note: Tähän eri maiden yliopisto- tai korkeakoululaitosta koskevat yleisteokset Yliopistojen ja korkeakoulujen lainsäädäntö, hallinto ja organisaatio Yliopistojen ja korkeakoulujen eri alojen tutkimus- ja opetustoiminta Yliopisto- ja korkeakouluopinnot ja niiden rahoitus Tähän ja alaluokkiin myös yliopistojen ja korkeakoulujen tarjoama aikuis- ja jatkokoulutus, avoimet yliopistot, kesäyliopistot, ammattikorkeakoulut, erillinen arvosanaopetus ja muu laajennettu toiminta Opettajankoulutus Yksittäistä yliopistoa tai korkeakoulua koskevat teokset 38.41

Yksittäiset yliopistot ja korkeakoulut
type: Concept
type: YKL-luokka
alternative label: Aalto-universitetet (38.41) @sv
alternative label: Aalto-yliopisto (38.41)
alternative label: Handelshögskolan (38.41) @sv
alternative label: Helsingfors universitet (38.41) @sv
alternative label: Helsingin yliopisto (38.41)
alternative label: Joensuu universitet (38.41) @sv
alternative label: Joensuun yliopisto (38.41)
alternative label: Jyväskylä universitet (38.41) @sv
alternative label: Jyväskylän yliopisto (38.41)
alternative label: Kauppakorkeakoulu (38.41)
alternative label: Konstindustriella högskolan (38.41) @sv
alternative label: Lapin yliopisto (38.41)
alternative label: Lappeenrannan teknillinen yliopisto (38.41)
alternative label: Lapplands universitet (38.41) @sv
alternative label: Oulun yliopisto (38.41)
alternative label: Sibelius-Akademin (38.41) @sv
alternative label: Sibelius-Akatemia (38.41)
alternative label: Svenska handelshögskolan (38.41)
alternative label: Taideteollinen korkeakoulu (38.41)
alternative label: Tammerfors universitet (38.41) @sv
alternative label: Tampereen yliopisto (38.41)
alternative label: Teaterhögskolan (38.41) @sv
alternative label: Teatterikorkeakoulu (38.41)
alternative label: Teknillinen korkeakoulu (38.41)
alternative label: Tekniska högskolan (38.41) @sv
alternative label: Turun yliopisto (38.41)
alternative label: Uleåborgs universitet (38.41) @sv
alternative label: Villmanstrands tekniska universitet (38.41) @sv
alternative label: Åbo akademi (38.41)
alternative label: Åbo universitet (38.41) @sv
broader: Yliopistot. Korkeakoulut
in scheme: YKL - Yleisten kirjastojen luokitusjärjestelmä
notation: 38.41
preferred label: Enskilda universitet och högskolor @sv
preferred label: Individual universities and institutions of higher education @en
scope note: Hit verk om enskilda universitet eller högskolor, deras lagstiftning, administration, organisation, fakulteter eller institutioner Hit också forskning och undervisning samt lärarutbildning på olika områden inom enskilda universitet eller högskolor Hit också studentverksamhet vid enskilda universitet och högskolor samt internationellt studentutbyte Hit vuxen- och påbyggnadsutbildning, öppet universitet, sommaruniversitet, särskild betygsundervisning samt annan utvidgad verksamhet vid ett enskilt universitet eller en enskild högskola Allmänna seriella publikationer som utges av ett enskilt universitet eller en enskild högskola 38.41052 Seriella publikationer och undersökningar inom specialområden klassificeras enligt område Nationer och allmänna studentorganisationer vid ett universitet eller en högskola 38.4106 @sv
scope note: Tähän teokset, jotka koskevat jotakin yksittäistä yliopistoa tai korkeakoulua, sen lainsäädäntöä, hallintoa, organisaatiota, tiedekuntia tai laitoksia Tähän myös yksittäisen yliopiston tai korkeakoulun harjoittama eri alojen tutkimus- ja opetustoiminta sekä opettajankoulutus Tähän myös yksittäisen yliopiston tai korkeakoulun opiskelijatoiminta ja kansainvälinen opiskelijavaihto Tähän myös yksittäisen yliopiston tai korkeakoulun tarjoama aikuis- ja jatkokoulutus, avoin yliopisto, kesäyliopisto, erillinen arvosanaopetus ja muu laajennettu toiminta Tietyn yliopiston tai korkeakoulun yleiset sarjajulkaisut 38.41052 Erikoisalojen sarjajulkaisut ja tutkimukset luokitetaan alan mukaan Tietyn yliopiston tai korkeakoulun osakunnat ja yleiset ylioppilasjärjestöt 38.4106

Koululaitos
type: Concept
References: Päivänsanat. Kristilliset päivänavaukset
References: Opetusoppi
References: Yliopistot. Korkeakoulut
References: Aikuiskoulutus. Vapaa sivistystyö
References: Hotelli- ja ravintolatalous. Suurkeittiöt. Ateriapalvelut
References: Kulttuurirakennukset
References: Elämäkerralliset hakuteokset, Yhteiskuntaelämän, kasvatuksen ja maanpuolustuksen edustajat
alternative label: Aamunavaukset, yl. (38.5+)
alternative label: Arbetspraktik, skolväsen (38.5+) @sv
alternative label: Asocialt beteende, skoluppfostran (38.5+) @sv
alternative label: Beteendestörningar, skoluppfostran (38.5+) @sv
alternative label: Elevhem (38.5+) @sv
alternative label: Elevmobbning (38.5+) @sv
alternative label: Elevorganisationer (38.5+) @sv
alternative label: Harjoittelu, koululaitos (38.5+)
alternative label: Informaatiolukutaito, koululaitos (38.5+)
alternative label: Kasvatusoppaat, opettajille tarkoitetut (38.5+)
alternative label: Kiusaaminen, koulu (38.5+)
alternative label: Kouluasuntolat (38.5+)
alternative label: Kouludemokratia (38.5+)
alternative label: Kouluhallinto (38.5+)
alternative label: Koulukasvatus (38.5+)
alternative label: Koulukerhotoiminta (38.5+)
alternative label: Koulukiusaaminen (38.5+)
alternative label: Koulukuraattorin työ (38.5+)
alternative label: Koulukuri (38.5+)
alternative label: Koulukypsyys (38.5+)
alternative label: Koululainsäädäntö (38.5+)
alternative label: Koululaiset, koululaitos (38.5+)
alternative label: Koululaisjärjestöt (38.5+)
alternative label: Koululaitos (38.5+)
alternative label: Koululiikunta (38.5+)
alternative label: Koulumatrikkelit (38.5+)
alternative label: Koulumuodot (38.5+)
alternative label: Koulun ja kodin yhteistyö (38.5+)
alternative label: Kouluneuvostot (38.5+)
alternative label: Koulupelko (38.5+)
alternative label: Koulupinnaus (38.5+)
alternative label: Koulupolitiikka (38.5+)
alternative label: Koulupsykologia (38.5+)
alternative label: Koulupsykologin työ (38.5+)
alternative label: Koulusuunnittelu (38.5+)
alternative label: Koulutoimi (38.5+)
alternative label: Koulutuspolitiikka, koululaitos (38.5+)
alternative label: Kouluväkivalta (38.5+)
alternative label: Käyttäytymishäiriöt, koulukasvatus (38.5+)
alternative label: Käytöshäiriöt, koulukasvatus (38.5+)
alternative label: Lukutaito, koululaitos (38.5+)
alternative label: Medialukutaito, koululaitos (38.5+)
alternative label: Murrosikä, koulukasvatus (38.5+)
alternative label: Ongelmakäyttäytyminen, koulukasvatus (38.5+)
alternative label: Opettajan työ (38.5+)
alternative label: Opettajat, koululaitos (38.5+)
alternative label: Opettajat, opettajan työ (38.5+)
alternative label: Opettajuus (38.5+)
alternative label: Opettaminen, opettajan työ (38.5+)
alternative label: Opetus, opettajan työ (38.5+)
alternative label: Opetustoimi, koululaitos (38.5+)
alternative label: Opiskelu ulkomailla, koululaitos (38.5+)
alternative label: Opiskelu, koululaitos (38.5+)
alternative label: Opiskelumotivaatio, perusasteen koulutus (38.5+)
alternative label: Oppilaitokset, koulut ja opistot (38.5+)
alternative label: Oppilashuolto, koulut ja opistot (38.5+)
alternative label: Puberteetti, koulukasvatus (38.5+)
alternative label: Päivänavaukset (38.5+)
alternative label: Taideaineet, koululaitos (38.5+)
alternative label: Työharjoittelu, koululaitos (38.5+)
alternative label: Vaaratilanteet, koulukiusaaminen (38.5+)
broader: KASVATUS. OPETUS. KASVATUSTIEDE
in scheme: YKL - Yleisten kirjastojen luokitusjärjestelmä
narrower: Esiopetus
narrower: Peruskoulut
narrower: Keskiasteen koulutus. Toisen asteen koulutus
narrower: Erityisopetus. Erityiskasvatus. Erityiskoulut
narrower: Erikois- ja kokeilukoulut
narrower: Erityislahjakkaiden opetus
notation: 38.5
scope note: Hit och till underklasserna skolväsen, skolor, skolformer, skollagstiftning, skoladministration, skoldemokrati och skolplanering i olika länder Hit och till underklasserna också lärarens, skolpsykologens, skolkuratorns och studiehandledarens arbete samt skoluppfostran, skolpsykologi och uppfostringshandböcker för lärare Hit och till underklasserna också samarbete mellan hem och skola samt klubbverksamhet i skolorna Hit och till underklasserna också elevvård, elevhem, skoldisciplin, våld i skolan, skolångest och skolkning Hit och till underklasserna också skolmognad Hit och till underklasserna också skolornas morgonsamlingar i allmänhet Om verket innehåller både religiösa och andra morgonsamlingar, ges företräde åt klass 38.5+ Skolmatriklar 38.503, 38.5203 och 38.5403 etc. @sv
scope note: Tähän ja alaluokkiin eri maiden koululaitokset, koulut, koulumuodot, koululainsäädäntö, kouluhallinto, kouludemokratia ja koulusuunnittelu Tähän ja alaluokkiin myös opettajan, koulupsykologin, koulukuraattorin ja opinto-ohjaajan työ sekä koulukasvatus, koulupsykologia ja opettajille tarkoitetut kasvatusoppaat Tähän ja alaluokkiin myös koulun ja kodin yhteistyö ja koulujen kerhotoiminta Tähän ja alaluokkiin myös oppilashuolto, kouluasuntolat, koulukuri, kouluväkivalta, koulupelko ja koulupinnaus Tähän ja alaluokkiin myös koulukypsyys Tähän ja alaluokkiin myös koulujen päivänavaukset yleensä Jos teoksessa on sekä uskonnollisia että muita kuin uskonnollisia päivänavauksia, annetaan etusija luokalle 38.5+ Koulujen matrikkelit 38.503, 38.5203 ja 38.5403, jne.

Esiopetus
type: Concept
References: Päivähoitopalvelut
type: YKL-luokka
alternative label: Alkuopetus, esikoulu (38.51)
alternative label: Avoin varhaiskasvatus (38.51)
alternative label: Barnträdgårdslärarens arbete (38.51) @sv
alternative label: Elementarundervisning, förskola (38.51) @sv
alternative label: Esiasteen koulutus (38.51)
alternative label: Esikoulukasvatus (38.51)
alternative label: Esikoulut (38.51)
alternative label: Esiopetus (38.51)
alternative label: Förskolefostran (38.51) @sv
alternative label: Förskolepedagogik (38.51) @sv
alternative label: Förskoleundervisning (38.51) @sv
alternative label: Förskolor (38.51) @sv
alternative label: Förstadieundervisning (38.51) @sv
alternative label: Lastentarhanopettajan työ (38.51)
alternative label: Småbarnsfostran (38.51) @sv
alternative label: Småbarnsfostran, lagstiftning (38.51) @sv
alternative label: Varhaiskasvatus (38.51)
alternative label: Varhaiskasvatus, esikoulu (38.51)
alternative label: Varhaiskasvatus, lainsäädäntö (38.51)
alternative label: Öppen småbarnsforstran (38.51) @sv
broader: Koululaitos
in scheme: YKL - Yleisten kirjastojen luokitusjärjestelmä
notation: 38.51
preferred label: Förskoleundervisning @sv
preferred label: Preschool education @en
scope note: Esikoulut. Esikoulukasvatus Lastentarhanopettajan työ Varhaiskasvatus yleensä
scope note: Förskolor. Fostran i förskolan Barnträdgårdslärarens arbete Förskolepedagogik @sv

Peruskoulut
type: Concept
References: Päivähoitopalvelut
References: Keskiasteen koulutus. Toisen asteen koulutus
References: Ammatillinen koulutus
References: Erityisopetus. Erityiskasvatus. Erityiskoulut
References: Erikois- ja kokeilukoulut
type: YKL-luokka
alternative label: Ala-asteet, peruskoulu (38.52)
alternative label: Alakoulu, peruskoulu (38.52)
alternative label: Alkuopetus, peruskoulu (38.52)
alternative label: Basundervisning (38.52) @sv
alternative label: Eftermiddagsverksamhet, skolelever (38.52) @sv
alternative label: Elementarundervisning, grundskola (38.52) @sv
alternative label: Elevhandledning (38.52) @sv
alternative label: Enhetsskolor (38.52) @sv
alternative label: Folkskolor (38.52) @sv
alternative label: Grundskolenivå, utbildning på (38.52) @sv
alternative label: Grundskolor (38.52) @sv
alternative label: Grundskolor, högstadier (38.52) @sv
alternative label: Grundskolor, lågstadier (38.52) @sv
alternative label: Högstadier, grundskolan (38.52) @sv
alternative label: Högstadiet, grundskolan (38.52) @sv
alternative label: Iltapäivätoiminta, koululaiset (38.52)
alternative label: Kansakoulut (38.52)
alternative label: Kansalaiskoulut (38.52)
alternative label: Koululaiset, iltapäivätoiminta (38.52)
alternative label: Leirikoulut, peruskoulut (38.52)
alternative label: Lyceer (38.52) @sv
alternative label: Lyseot (38.52)
alternative label: Lägerskolor, grundskolor (38.52) @sv
alternative label: Läroverk (38.52) @sv
alternative label: Lågstadier, grundskolan (38.52) @sv
alternative label: Lågstadiet, grundskolan (38.52) @sv
alternative label: Medborgarskolor (38.52) @sv
alternative label: Oppikoulut (38.52)
alternative label: Oppilaanohjaus (38.52)
alternative label: Perusasteen koulutus (38.52)
alternative label: Peruskoulut (38.52)
alternative label: Peruskoulut, ala-asteet (38.52)
alternative label: Peruskoulut, yläasteet (38.52)
alternative label: Perusopetus (38.52)
alternative label: Samskolor (38.52) @sv
alternative label: Skolelever, eftermiddagsverksamhet (38.52) @sv
alternative label: Stödundervisning, grundskola (38.52) @sv
alternative label: Tukiopetus, peruskoulu (38.52)
alternative label: Utbyteselever, grundskolor (38.52) @sv
alternative label: Vaihto-oppilastoiminta, peruskoulut (38.52)
alternative label: Yhteiskoulut (38.52)
alternative label: Yhtenäiskoulut (38.52)
alternative label: Yläasteet, peruskoulu (38.52)
alternative label: Yläkoulu, peruskoulu (38.52)
broader: Koululaitos
in scheme: YKL - Yleisten kirjastojen luokitusjärjestelmä
notation: 38.52
preferred label: Comprehensive schools @en
preferred label: Grundskolor @sv
scope note: Basundervisning. Grundskolans låg- och högstadier Folkskolor. Medborgarskolor. Läroverk Lägerskolor. Elevutbyte Hit också skoluppfostran, lärarens arbete och elevvård ur grundskolans synvinkel Skolmognadstest i grundskolan 38.5201 @sv
scope note: Perusopetus. Peruskoulun ala- ja ylä-aste. Peruskoulun ala- ja yläkoulu Kansakoulut. Kansalaiskoulut. Oppikoulut yleensä Peruskoulun leirikoulut ja vaihto-oppilastoiminta Tähän myös koulukasvatus, opettajan työ ja oppilashuolto peruskoulun kannalta Peruskoulun koulukypsyystestit 38.5201

Keskiasteen koulutus. Toisen asteen koulutus
type: Concept
References: Työvoimapolitiikka
References: Yliopistot. Korkeakoulut
References: Peruskoulut
References: Aikuiskoulutus. Vapaa sivistystyö
References: Ammatinvalinta
References: Henkilöstöpolitiikka
type: YKL-luokka
alternative label: Aikuiskoulutus, keskiaste,yl. (38.54+)
alternative label: Emäntäkoulut (38.54)
alternative label: Handelsläroverk (38.54) @sv
alternative label: Hushållsskolor (38.54) @sv
alternative label: Husmorsskolor (38.54) @sv
alternative label: Kauppaoppilaitokset (38.54)
alternative label: Keskiaste, koulutus ja oppilaitokset (38.54+)
alternative label: Kieliopistot (38.54)
alternative label: Konststudier, mellanstadiet (38.54) @sv
alternative label: Kotitalousoppilaitokset (38.54)
alternative label: Lantbruksläroanstalter (38.54) @sv
alternative label: Lantbruksskolor (38.54) @sv
alternative label: Lantmannaskolor (38.54) @sv
alternative label: Maamieskoulut (38.54)
alternative label: Maatalouskoulut (38.54)
alternative label: Maatalousoppilaitokset (38.54)
alternative label: Mellanstadiet, utbildning och läroanstalter (38.54+) @sv
alternative label: Nuorisoasteen koulutus (38.54+)
alternative label: Opiskelumotivaatio, toisen asteen koulutus (38.54+)
alternative label: Puutarhakoulut (38.54)
alternative label: Sairaanhoito-opistot (38.54)
alternative label: Sjukvårdsinstitut (38.54) @sv
alternative label: Språkinstitut (38.54) @sv
alternative label: Studiemotivation, andra stadiets utbildning (38.54+) @sv
alternative label: Taideopinnot, keskiaste (38.54)
alternative label: Talouskoulut (38.54)
alternative label: Teaterskolor, utbildning på mellanstadiet (38.54) @sv
alternative label: Teatterikoulut, keskiasteen koulutus (38.54)
alternative label: Teknilliset koulut (38.54)
alternative label: Teknilliset opistot (38.54)
alternative label: Teknilliset oppilaitokset (38.54)
alternative label: Tekniska institut (38.54) @sv
alternative label: Tekniska läroanstalter (38.54) @sv
alternative label: Tekniska skolor (38.54) @sv
alternative label: Toisen asteen koulutus (38.54+)
alternative label: Trädgårdsskolor (38.54) @sv
alternative label: Ungdomsstadiet, utbildning på (38.54+) @sv
alternative label: Utbildning på andra stadiet (38.54+) @sv
alternative label: Vuxenutbildning, mellanstadiet, allm. (38.54+) @sv
broader: Koululaitos
in scheme: YKL - Yleisten kirjastojen luokitusjärjestelmä
narrower: Lukiot
narrower: Ammatillinen koulutus
notation: 38.54
preferred label: Intermediate grade education. Secondary education @en
preferred label: Utbildning på mellanstadiet. Utbildning på andra stadiet @sv
scope note: Hit allmänna verk om utbildning på mellanstadiet eller andra stadiet, som behandlar både gymnasiet och yrkesutbildning Hit och till underklasserna utbildning på mellanstadiet och andra stadiet Hit och till underklasserna även skoluppfostran, lärarens arbete och elevvård ur mellanstadiets eller andra stadiets synvinkel @sv
scope note: Tähän keski- tai toisen asteen koulutuksen yleisteokset, jotka koskevat sekä lukiota että ammatillista koulutusta Tähän ja alaluokkiin keski- ja toisen asteen koulutus Tähän ja alaluokkiin myös koulukasvatus, opettajan työ ja oppilashuolto keski- tai toisen asteen koulutuksen kannalta

Lukiot
type: Concept
References: Peruskoulut
References: Ammatillinen koulutus
References: Aikuiskoulutus. Vapaa sivistystyö
type: YKL-luokka
alternative label: Aikuiskoulutus, lukio (38.541)
alternative label: Gymnasier (38.541) @sv
alternative label: Kesälukiot (38.541)
alternative label: Leirikoulut, lukiot (38.541)
alternative label: Lukiot (38.541)
alternative label: Lägerskolor, gymnasier (38.541) @sv
alternative label: Sommargymnasier (38.541) @sv
alternative label: Studentexamen (38.541) @sv
alternative label: Studentskrivningar (38.541) @sv
alternative label: Utbyteselever, gymnasier (38.541) @sv
alternative label: Vaihto-oppilastoiminta, lukiot (38.541)
alternative label: Vuxenutbildning, gymnasiet (38.541) @sv
alternative label: Ylioppilaskirjoitukset (38.541)
alternative label: Ylioppilastutkinto (38.541)
broader: Keskiasteen koulutus. Toisen asteen koulutus
in scheme: YKL - Yleisten kirjastojen luokitusjärjestelmä
notation: 38.541
preferred label: Gymnasier @sv
preferred label: Upper secondary schools @en
scope note: Hit även sommar-, kvälls- och vuxengymnasier samt gymnasieundervisning ur vuxenutbildningens synvinkel Specialgymnasier Allmänna verk om studentskrivningar Elevutbyte mellan gymnasier Hit också skoluppfostran, lärarens arbete och elevvård ur gymnasiernas synvinkel @sv
scope note: Tähän myös kesä-, ilta- ja aikuislukiot sekä lukio-opetus aikuiskoulutuksen kannalta Erikoislukiot Ylioppilaskirjoituksia koskevat yleisteokset Lukioiden vaihto-oppilastoiminta Tähän myös koulukasvatus, opettajan työ ja oppilashuolto lukion kannalta

Ammatillinen koulutus
type: Concept
References: KIRJASTOTOIMI. KIRJASTOTIEDE. INFORMATIIKKA
References: Työvoimapolitiikka
References: Yliopistot. Korkeakoulut
References: Lukiot
References: Aikuiskoulutus. Vapaa sivistystyö
References: Ammatinvalinta
References: Sotilaskoulutus
References: Henkilöstöpolitiikka
type: YKL-luokka
alternative label: Aikuiskoulutus, ammatillinen, yl (38.542)
alternative label: Ammatillinen aikuiskoulutus (38.542)
alternative label: Ammatillinen kehitys, ammatillinen aikuiskoulutus (38.542)
alternative label: Ammatillinen koulutus (38.542)
alternative label: Ammatillinen täydennyskoulutus (38.542)
alternative label: Ammattikasvatus (38.542)
alternative label: Ammattikoulut (38.542)
alternative label: Ammattikoulutus (38.542)
alternative label: Ammattiopetus, keskiasteen koulutus (38.542)
alternative label: Ammattitaito, ammatillinen aikuiskoulutus (38.542)
alternative label: Fackutbildning (38.542) @sv
alternative label: Fortbildning, yrkesinriktad (38.542) @sv
alternative label: Handelsinstitut (38.542) @sv
alternative label: Handelsskolor (38.542) @sv
alternative label: Inlärning i arbete, yrkesinriktad utbildning (38.542) @sv
alternative label: Institut, undervisningsanstalter (38.542) @sv
alternative label: Jatkokoulutus, ammatillinen koulutus (38.542)
alternative label: Kauppakoulut (38.542)
alternative label: Kauppaopistot (38.542)
alternative label: Konstskolor, yrkesinriktad utbildning (38.542) @sv
alternative label: Läroavtalsutbildning (38.542) @sv
alternative label: Läroinrättningar inom konstbranschen, yrkesinriktad utbildning (38.542) @sv
alternative label: Musiikkiopistot, ammatillinen koulutus (38.542)
alternative label: Musiikkioppilaitokset, ammatillinen koulutus (38.542)
alternative label: Musikinstitut, yrkesinriktad utbildning (38.542) @sv
alternative label: Musikläroanstalter, yrkesinriktad utbildning (38.542) @sv
alternative label: Omskolning, yrkesmässig (38.542) @sv
alternative label: Opistot (38.542)
alternative label: Oppisopimuskoulutus (38.542)
alternative label: Professionell utveckling, yrkesinriktad vuxenutbildning (38.542) @sv
alternative label: Taidekoulut, ammatillinen koulutus (38.542)
alternative label: Taideoppilaitokset, ammatillinen koulutus (38.542)
alternative label: Työssä oppiminen, ammatillinen koulutus (38.542)
alternative label: Työssäoppiminen, ammatillinen koulutus (38.542)
alternative label: Täydennyskoulutus, ammatillinen (38.542)
alternative label: Uudelleenkoulutus, ammatillinen (38.542)
alternative label: Vidareutbildning, yrkesutbildning (38.542) @sv
alternative label: Vuxenutbildning, yrkesinriktad, allm. (38.542) @sv
alternative label: Yrkesinriktad fortbildning (38.542) @sv
alternative label: Yrkesinriktad utbildning (38.542) @sv
alternative label: Yrkesinriktad vuxenutbildning (38.542) @sv
alternative label: Yrkesskicklighet, yrkesinriktad vuxenutbildning (38.542) @sv
alternative label: Yrkesskolor (38.542) @sv
alternative label: Yrkesundervisning, mellanstadieutbildning (38.542) @sv
alternative label: Yrkesutbildning (38.542) @sv
broader: Keskiasteen koulutus. Toisen asteen koulutus
in scheme: YKL - Yleisten kirjastojen luokitusjärjestelmä
notation: 38.542
preferred label: Vocational training @en
preferred label: Yrkesutbildning @sv
scope note: Hit yrkesskolor för olika fackområden, läroinrättningar på institutnivå och läroavtalsutbildning Hit även yrkesinriktad vuxenutbildning Handelsskolor och -institut Musikläroinrättningar och läroinrättningar inom konstbranbschen när det gäller yrkesinriktad utbildning Hit också skoluppfostran, lärarens arbete och elevvård ur yrkesläroanstalternas synvinkel @sv
scope note: Tähän eri alojen ammattikoulut, opistotasoiset oppilaitokset sekä oppisopimuskoulutus Tähän myös ammatillinen aikuiskoulutus Kauppakoulut ja -opistot Taide- ja musiikkioppilaitokset ammatillisen koulutuksen kannalta Tähän myös koulukasvatus, opettajan työ ja oppilashuolto ammatillisten koulujen kannalta

Erityisopetus. Erityiskasvatus. Erityiskoulut
type: Concept
References: Oppimisen psykologia
References: Vammaispalvelut
References: Opetusoppi
References: Erityislahjakkaiden opetus
References: Elimet. Taudit
References: Syöpätaudit
type: YKL-luokka
alternative label: AAC-menetelmät, erityisopetus (38.55+)
alternative label: AKK-metoden, specialundervisning (38.55+) @sv
alternative label: Aistivammaiset, erityisopetus (38.55+)
alternative label: Alternativ och kompletterande kommunikation, specialundervisning (38.55+) @sv
alternative label: Ammatillinen erityisopetus (38.55+)
alternative label: Anstaltsuppfostran (38.55+) @sv
alternative label: Apukoulut, erityisopetus (38.55+)
alternative label: Elevassistentens arbete (38.55+) @sv
alternative label: Erityiskasvatus (38.55+)
alternative label: Erityiskoulut (38.55+)
alternative label: Erityisluokat (38.55+)
alternative label: Erityisopetus (38.55+)
alternative label: Erityispedagogiikka (38.55+)
alternative label: Handikappade, specialundervisning (38.55+) @sv
alternative label: Handikappade, yrkesutbildning (38.55+) @sv
alternative label: Handikapputbildning (38.55+) @sv
alternative label: Harjaantumiskoulut (38.55+)
alternative label: Hjälpskolor, specialundervisning (38.55+) @sv
alternative label: Inlärningssvårigheter, specialundervisning (38.55+) @sv
alternative label: Kehityshäiriöt, erityisopetus (38.55+)
alternative label: Kouluavustajan työ (38.55+)
alternative label: Koulukodit (38.55+)
alternative label: Laitoskasvatus (38.55+)
alternative label: Leikkiterapia, erityiskasvatus (38.55+)
alternative label: Lekterapi, specialpedagogik (38.55+) @sv
alternative label: Observationsklasser, specialundervisning (38.55+) @sv
alternative label: Oppimisvaikeudet, erityisopetus (38.55+)
alternative label: Puhetta tukeva ja korvaava kommunikaatio, erityisopetus (38.55+)
alternative label: Sairaalakoulut (38.55+)
alternative label: Sjukhusskolor (38.55+) @sv
alternative label: Skolhem (38.55+) @sv
alternative label: Specialklasser (38.55+) @sv
alternative label: Specialpedagogik (38.55+) @sv
alternative label: Specialskolor, specialundervisning (38.55+) @sv
alternative label: Specialundervisning (38.55+) @sv
alternative label: Specialyrkesutbildning (38.55+) @sv
alternative label: Stödundervisning, specialundervisning (38.55+) @sv
alternative label: Syn- och hörselskadade, specialundervisning (38.55+) @sv
alternative label: Tarkkailuluokat, erityisopetus (38.55+)
alternative label: Terapi, specialpedagogik (38.55+) @sv
alternative label: Terapia, erityiskasvatus (38.55+)
alternative label: Träningsskolor (38.55+) @sv
alternative label: Tuettu kommunikointi, erityisopetus (38.55+)
alternative label: Tukiopetus, erityisopetus (38.55+)
alternative label: Utvecklingsstörningar, specialundervisning (38.55+) @sv
alternative label: Vammaiset, ammattikoulutus (38.55+)
alternative label: Vammaiset, erityisopetus (38.55+)
alternative label: Vammaiskoulutus (38.55+)
broader: Koululaitos
in scheme: YKL - Yleisten kirjastojen luokitusjärjestelmä
narrower: Erityisopetus. Erityiskasvatus, luku-, kirjoitus- ja puhehäiriöiset
narrower: Erityisopetus. Erityiskasvatus, kuulovammaiset
narrower: Erityisopetus. Erityiskasvatus, näkövammaiset
narrower: Erityisopetus. Erityiskasvatus, liikuntavammaiset
narrower: Erityisopetus. Erityiskasvatus, kehitysvammaiset
notation: 38.55
preferred label: Special education. Special pedagogy. Special schools @en
preferred label: Specialundervisning. Specialpedagogik. Specialskolor @sv
scope note: Erityis- ja tarkkailuluokat yleensä. Erityiskoulut yleensä. Koulukodit yleensä Vammaiskoulutus yleensä Tähän ja alaluokkiin myös vammaisten ammattikoulutus Tähän ja alaluokkiin myös koulukasvatus, opettajan ja kouluavustajan työ sekä oppilashuolto erityisopetuksen ja erityiskoulujen kannalta
scope note: Special- och observationsklasser i allmänhet. Hjälpskolor i allmänhet. Skolhem i allmänhet Utbildning för handikappade i allmänhet Hit och till underklasserna också yrkesutbildning för handikappade Hit och till underklasserna också skoluppfostran, lärarens och skolgångsbiträdets arbete samt elevvård ur specialundervisningens och specialskolornas synvinkel @sv

Erityisopetus. Erityiskasvatus, luku-, kirjoitus- ja puhehäiriöiset
type: Concept
References: Oppimisen psykologia
References: Hermosto. Neurologia
References: Ilmaisutaito. Puhetaito. Lausuntataide
type: YKL-luokka
alternative label: Dysartri, specialundervisning (38.551) @sv
alternative label: Dysartria, erityisopetus (38.551)
alternative label: Dysfasi, specialundervisning (38.551) @sv
alternative label: Dysfasia, erityisopetus (38.551)
alternative label: Dysleksia, erityisopetus (38.551)
alternative label: Dyslexi, specialundervisning (38.551) @sv
alternative label: Dyslogi, specialundervisning (38.551) @sv
alternative label: Dyslogia, erityisopetus (38.551)
alternative label: Kirjoitushäiriöt, erityisopetus (38.551)
alternative label: Kirjoitusvaikeudet, erityisopetus (38.551)
alternative label: Logopedi (38.551) @sv
alternative label: Logopedia (38.551)
alternative label: Lukemisvaikeudet, erityisopetus (38.551)
alternative label: Lukihäiriöiset, erityisopetus (38.551)
alternative label: Lukuhäiriöt, erityisopetus (38.551)
alternative label: Lässvårigheter (38.551) @sv
alternative label: Lässvårigheter, specialundervisning (38.551) @sv
alternative label: Ordblindhet (38.551) @sv
alternative label: Puhehäiriöt, erityisopetus (38.551)
alternative label: Puheopetus (38.551)
alternative label: Puheterapia (38.551)
alternative label: Puheviat, erityisopetus (38.551)
alternative label: Sanasokeus (38.551)
alternative label: Skrivstörningar, specialundervisning (38.551) @sv
alternative label: Skrivsvårigheter, specialundervisning (38.551) @sv
alternative label: Stamning, talterapi (38.551) @sv
alternative label: Talfel, specialundervisning (38.551) @sv
alternative label: Talrubbningar, specialundervisning (38.551) @sv
alternative label: Talterapi (38.551) @sv
alternative label: Talundervisning (38.551) @sv
alternative label: Änkyttäminen, puheterapia (38.551)
alternative label: Änkytys, puheterapia (38.551)
broader: Erityisopetus. Erityiskasvatus. Erityiskoulut
in scheme: YKL - Yleisten kirjastojen luokitusjärjestelmä
notation: 38.551
preferred label: Special education. special pedagogy, reading, writing and speech disorders @en
preferred label: Specialundervisning. Specialpedagogik, läs-, skriv- och talsvårigheter @sv
scope note: Puheopetus. Puheterapia
scope note: Talpedagogik. Talterapi @sv

Erityisopetus. Erityiskasvatus, kuulovammaiset
type: Concept
References: Vammaispalvelut
References: Aistinelimet. Silmätaudit. Kurkku-, nenä- ja korvataudit
References: Viittomakieli
type: YKL-luokka
alternative label: Döva, skolor (38.552) @sv
alternative label: Döva, specialundervisning (38.552) @sv
alternative label: Hörselskadade, skolor (38.552) @sv
alternative label: Hörselskadade, specialutbildning (38.552) @sv
alternative label: Kuulovammaiset, erityisopetus (38.552)
alternative label: Kuulovammaisten koulut (38.552)
alternative label: Kuurojen koulut (38.552)
alternative label: Kuurot, erityisopetus (38.552)
broader: Erityisopetus. Erityiskasvatus. Erityiskoulut
in scheme: YKL - Yleisten kirjastojen luokitusjärjestelmä
notation: 38.552
preferred label: Special education. Special pedagogy, hearing-impaired @en
preferred label: Specialundervisning. Specialpedagogik, hörselskadade @sv
scope note: Kuulovammaisten koulut
scope note: Skolor för hörselskadade @sv

Erityisopetus. Erityiskasvatus, näkövammaiset
type: Concept
References: Vammaispalvelut
References: Aistinelimet. Silmätaudit. Kurkku-, nenä- ja korvataudit
type: YKL-luokka
alternative label: Blinda, specialundervisning (38.553) @sv
alternative label: Blindskolor (38.553) @sv
alternative label: Blindskrift (38.553) @sv
alternative label: Dövblinda, specialundervisning (38.553) @sv
alternative label: Kuurosokeat, erityisopetus (38.553)
alternative label: Näkövammaiset, erityisopetus (38.553)
alternative label: Näkövammaiset, koulut (38.553)
alternative label: Pistekirjoitus (38.553)
alternative label: Punktskrift (38.553) @sv
alternative label: Sokeainkirjoitus (38.553)
alternative label: Sokeainkoulut (38.553)
alternative label: Sokeat, erityisopetus (38.553)
alternative label: Synskadade, skolor (38.553) @sv
alternative label: Synskadade, specialundervisning (38.553) @sv
broader: Erityisopetus. Erityiskasvatus. Erityiskoulut
in scheme: YKL - Yleisten kirjastojen luokitusjärjestelmä
notation: 38.553
preferred label: Special education. Special pedagogy, visually impaired @en
preferred label: Specialundervisning. Specialpedagogik, synskadade @sv
scope note: Dövblinda Skolor för synskadade. Blindskrift @sv
scope note: Kuurosokeat Näkövammaisten koulut. Sokeainkirjoitus

Erityisopetus. Erityiskasvatus, liikuntavammaiset
type: Concept
References: Vammaispalvelut
References: Liikuntaelimet. Liikuntaelinten taudit
type: YKL-luokka
alternative label: Dyspraksia, erityisopetus (38.554)
alternative label: Dyspraxi, specialundervisning (38.554) @sv
alternative label: Invalider, specialundervisning (38.554) @sv
alternative label: Invalidit, erityisopetus (38.554)
alternative label: Liikuntavammaiset, erityisopetus (38.554)
alternative label: Liikuntavammaiset, koulut (38.554)
alternative label: Rörelsehandikappade, skolor (38.554) @sv
alternative label: Rörelsehandikappade, specialundervisning (38.554) @sv
broader: Erityisopetus. Erityiskasvatus. Erityiskoulut
in scheme: YKL - Yleisten kirjastojen luokitusjärjestelmä
notation: 38.554
preferred label: Special education. Special pedagogy, physically disabled @en
preferred label: Specialundervisning. Specialpedagogik, rörelsehindrade @sv
scope note: Liikuntavammaisten koulut. Invalidikoulut
scope note: Skolor för rörelsehindrade. Invalidskolor @sv

Erityisopetus. Erityiskasvatus, kehitysvammaiset
type: Concept
References: Vammaispalvelut
References: Hermosto. Neurologia
type: YKL-luokka
alternative label: CP-handikapp, specialundervisning (38.555) @sv
alternative label: CP-skadade, specialundervisning (38.555) @sv
alternative label: CP-vammaiset, erityisopetus (38.555)
alternative label: CP-vammaisuus, erityisopetus (38.555)
alternative label: Downin syndrooma, erityisopetus (38.555)
alternative label: Downs syndrom, specialpedagogik (38.555) @sv
alternative label: Kehitysvammaiset, erityisopetus (38.555)
alternative label: Kehitysvammaiset, koulut (38.555)
alternative label: MBD-barn, specialundervisning (38.555) @sv
alternative label: MBD-lapset, erityisopetus (38.555)
alternative label: Oligofreni, specialundervisning (38.555) @sv
alternative label: Oligofrenia, erityisopetus (38.555)
alternative label: Utvecklingsstörda, skolor (38.555) @sv
alternative label: Utvecklingsstörda, specialundervisning (38.555) @sv
broader: Erityisopetus. Erityiskasvatus. Erityiskoulut
in scheme: YKL - Yleisten kirjastojen luokitusjärjestelmä
notation: 38.555
preferred label: Special education. Special pedagogy, developmentally disabled @en
preferred label: Specialundervisning. Specialpedagogik, utvecklingsstörda @sv
scope note: Kehitysvammaisten koulut Tähän myös teokset, jotka koskevat sekä kehitysvammaisten opetusta että huoltoa
scope note: Skolor för utvecklingsstörda Hit också verk som behandlar både undervisning och vård av utvecklingsstörda @sv

Erikois- ja kokeilukoulut
type: Concept
References: Opetusoppi
type: YKL-luokka
alternative label: Erikoiskoulut (38.58)
alternative label: Freinet-koulut (38.58)
alternative label: Freinet-skolor (38.58) @sv
alternative label: Försöksskolor (38.58) @sv
alternative label: Kokeilukoulut (38.58)
alternative label: Montessori-koulut (38.58)
alternative label: Montessori-menetelmä (38.58)
alternative label: Montessori-pedagogiikka (38.58)
alternative label: Montessorimetod (38.58) @sv
alternative label: Montessoripedagogik (38.58) @sv
alternative label: Montessoriskolor (38.58) @sv
alternative label: Specialskolor, experimentskolor (38.58) @sv
alternative label: Steiner-koulut (38.58)
alternative label: Steiner-pedagogiikka (38.58)
alternative label: Steinerpedagogik (38.58) @sv
alternative label: Steinerskolor (38.58) @sv
alternative label: Summerhill-koulu (38.58)
alternative label: Summerhillskolan (38.58) @sv
alternative label: Waldorfkoulut (38.58)
alternative label: Waldorfskolor (38.58) @sv
broader: Koululaitos
in scheme: YKL - Yleisten kirjastojen luokitusjärjestelmä
notation: 38.58
preferred label: Special and experimental schools @en
preferred label: Special- och experimentskolor @sv
scope note: Hit t.ex. Montessori-, Steiner-, Waldorf- och Freinetskolor samt deras pedagogik @sv
scope note: Tähän esim. Montessori-, Steiner-, Waldorf- ja Freinet-koulut sekä niiden pedagogiikka

Erityislahjakkaiden opetus
type: Concept
References: Ajattelun, älykkyyden, luovuuden ja lahjakkuuden psykologia
type: YKL-luokka
alternative label: Erityislahjakkaiden opetus (38.59)
alternative label: Specialbegåvade, undervisning (38.59) @sv
broader: Koululaitos
in scheme: YKL - Yleisten kirjastojen luokitusjärjestelmä
notation: 38.59
preferred label: Teaching of the exceptionally gifted @en
preferred label: Undervisning av specialbegåvade @sv
scope note: Hit undervisning av specialbegåvade oavsett läroinrättning och område @sv
scope note: Tähän erityislahjakkaiden opetus oppilaitoksesta ja alasta riippumatta

Aikuiskoulutus. Vapaa sivistystyö
type: Concept
References: YLEINEN KULTTUURIPOLITIIKKA
References: Kristillinen opetus ja kasvatus
References: Työvoimapolitiikka
References: Opetusoppi
References: Yliopistot. Korkeakoulut
References: Keskiasteen koulutus. Toisen asteen koulutus
References: Lukiot
References: Ammatillinen koulutus
References: Nuorisotyö. Lapsityö
References: Ammatinvalinta
alternative label: Aikuiskasvatus, yl. (38.6+)
alternative label: Aikuiskoulutus, yl. (38.6+)
alternative label: Aikuisopetus,yl. (38.6+)
alternative label: Aikuispedagogiikka,yl. (38.6+)
alternative label: Ammatillinen kehitys, aikuiskoulutus (38.6+)
alternative label: Ammattitaito, aikuiskoulutus (38.6+)
alternative label: Arbetspraktik, vuxenutbildning (38.6+) @sv
alternative label: Elinikäinen koulutus (38.6+)
alternative label: Folkbildningsarbete (38.6+) @sv
alternative label: Fortbildning (38.6+) @sv
alternative label: Fritt bildningsarbete (38.6+) @sv
alternative label: Fritt folkbildningsarbete (38.6+) @sv
alternative label: Föreläsningsverksamhet, fritt bildningsarbete (38.6+) @sv
alternative label: Harjoittelu, aikuiskoulutus (38.6+)
alternative label: Inlärning, livslångt lärande (38.6+) @sv
alternative label: Jatkokoulutus (38.6+)
alternative label: Jatkuva koulutus (38.6+)
alternative label: Kansansivistystyö (38.6+)
alternative label: Konstskolor, vuxenutbildning (38.6+) @sv
alternative label: Koulutuspolitiikka, aikuiskoulutus (38.6+)
alternative label: Livslång utbildning (38.6+) @sv
alternative label: Luentotoiminta, vapaa sivistystyö (38.6+)
alternative label: Lärare, vuxenutbildning (38.6+) @sv
alternative label: Läroanstalter, vuxenutbildning (38.6+) @sv
alternative label: Läroinrättningar inom konstbranschen, vuxenutbildning (38.6+) @sv
alternative label: Musiikkiopistot, aikuiskoulutus (38.6+)
alternative label: Musiikkioppilaitokset, aikuiskoulutus (38.6+)
alternative label: Musikinstitut, vuxenutbildning (38.6+) @sv
alternative label: Musikläroanstalter, vuxenutbildning (38.6+) @sv
alternative label: Omskolning (38.6+) @sv
alternative label: Opettajat, aikuiskoulutus (38.6+)
alternative label: Opiskelu ulkomailla, aikuiskoulutus (38.6+)
alternative label: Opiskelu, aikuiskoulutus (38.6+)
alternative label: Opiskelumotivaatio, aikuiskoulutus (38.6+)
alternative label: Oppilaitokset, aikuiskoulutus (38.6+)
alternative label: Oppiminen, elinikäinen oppiminen (38.6+)
alternative label: Praktik, vuxenutbildning (38.6+) @sv
alternative label: Professionell utveckling, vuxenutbildning (38.6+) @sv
alternative label: Setlementtityö (38.6+)
alternative label: Settlement (38.6) @sv
alternative label: Settlementarbete (38.6+) @sv
alternative label: Studiemotivation, vuxenutbildning (38.6+) @sv
alternative label: Studier utomlands, vuxenutbildning (38.6+) @sv
alternative label: Studier, vuxenutbildning (38.6+) @sv
alternative label: Sysselsättningsfrämjande utbildning, vuxenutbildning (38.6+) @sv
alternative label: Taidekoulut, aikuiskoulutus (38.6+)
alternative label: Taideoppilaitokset, aikuiskoulutus (38.6+)
alternative label: Työharjoittelu, aikuiskoulutus (38.6+)
alternative label: Työllistämiskoulutus, aikuiskoulutus (38.6+)
alternative label: Täydennyskoulutus (38.6+)
alternative label: Utbildningspolitik, vuxenutbildning (38.6+) @sv
alternative label: Uudelleenkoulutus (38.6+)
alternative label: Vapaa kansansivistystyö (38.6+)
alternative label: Vapaa sivistystyö (38.6+)
alternative label: Vapaaopistot (38.6)
alternative label: Vidareutbildning (38.6+) @sv
alternative label: Vuxenfostran, allm. (38.6+) @sv
alternative label: Vuxenundervisning,allm. (38.6+) @sv
alternative label: Vuxenutbildning, allm. (38.6+) @sv
alternative label: Yrkesskicklighet, vuxenutbildning (38.6+) @sv
broader: KASVATUS. OPETUS. KASVATUSTIEDE
in scheme: YKL - Yleisten kirjastojen luokitusjärjestelmä
narrower: Kansanopistot. Kansankorkeakoulut
narrower: Kansalaisopistot. Työväenopistot
narrower: Kansansivistysjärjestöt
narrower: Itseopiskelu. Opintokerhotoiminta
notation: 38.6
scope note: Hit och till underklasserna allmänna verk om vuxenutbildning, vuxenpedagogik, vuxenundervisning, omskolning, återkommande utbildning och livslång utbildning Hit och till underklasserna allmänbildande utbildning Hit och till underklasserna även settlementarbete Hit och till underklasserna också fritt bildningsarbete Hit och till underklasserna även allmänna verk om lärarens arbete ur vuxenutbildningens och det fria bildningsarbetets synvinkel Vuxenutbildning som syftar till examen, yrkeskompetens eller ett vitsord vid ett universitet eller en högskola klassificeras efter läroinrättning eller examen Hit vuxenutbilding samt bildnings- och kulturverksamhet inom musik. Vuxenutbildning samt bildnings- och kulturverksamhet inom övriga specialområden klassificeras enligt område @sv
scope note: Tähän ja alaluokkiin aikuiskoulutuksen, aikuiskasvatuksen, aikuisopetuksen, uudelleenkoulutuksen, jatkuvan koulutuksen ja elinikäisen koulutuksen yleisteokset Tähän ja alaluokkiin yleissivistävä aikuiskoulutus Tähän ja alaluokkiin myös setlementtityö Tähän ja alaluokkiin myös vapaa sivistystyö Tähän ja alaluokkiin myös opettajan työ aikuiskoulutuksen ja vapaan sivistystyön kannalta yleensä Tutkintoon, ammattipätevyyteen tai yliopisto- tai korkeakouluarvosanaan tähtäävä aikuiskoulutus sijoitetaan oppilaitoksen tai tutkinnon mukaiseen luokkaan Tähän musiikkia koskeva aikuiskoulutus sekä vapaa sivistys- ja kulttuuritoiminta. Muiden erikoisalojen aikuiskoulutus ja vapaa sivistys- ja kulttuuritoiminta luokitetaan alan mukaan

Kansanopistot. Kansankorkeakoulut
type: Concept
References: Yliopistot. Korkeakoulut
References: Keskiasteen koulutus. Toisen asteen koulutus
References: Lukiot
References: Ammatillinen koulutus
type: YKL-luokka
alternative label: Folkhögskolor (38.61) @sv
alternative label: Kansankorkeakoulut (38.61)
alternative label: Kansanopistot (38.61)
broader: Aikuiskoulutus. Vapaa sivistystyö
in scheme: YKL - Yleisten kirjastojen luokitusjärjestelmä
notation: 38.61
preferred label: Folk high schools. Folk academies @en
preferred label: Folkhögskolor. Folkakademier @sv
scope note: Allmänna verk om folkhögskolor och folkakademier Allmänbildande undervisning vid folkhögskolor och folkakademier Studier vid folkhögskolor och folkakademier som syftar till examen, yrkeskompetens eller ett vitsord vid ett universitet eller en högskola klassificeras efter examen @sv
scope note: Kansanopistoja ja kansankorkeakouluja koskevat yleisteokset Kansanopistoissa ja kansankorkeakouluissa annettava yleissivistävä opetus Tutkintoon, ammattipätevyyteen tai yliopisto- tai korkeakouluarvosanaan tähtäävät kansanopisto- ja kansankorkeakouluopinnot sijoitetaan tutkinnon mukaiseen luokkaan

Kansalaisopistot. Työväenopistot
type: Concept
References: Yliopistot. Korkeakoulut
References: Keskiasteen koulutus. Toisen asteen koulutus
References: Lukiot
References: Ammatillinen koulutus
type: YKL-luokka
alternative label: Arbetarinstitut (38.62) @sv
alternative label: Kansalaisopistot (38.62)
alternative label: Medborgarinstitut (38.62) @sv
alternative label: Työväenopistot (38.62)
broader: Aikuiskoulutus. Vapaa sivistystyö
in scheme: YKL - Yleisten kirjastojen luokitusjärjestelmä
notation: 38.62
preferred label: Adult education centres. Worker's institutes @en
preferred label: Medborgarinstitut. Arbetarinstitut @sv
scope note: Allmänna verk om medborgar- och arbetarinstitut Medborgar- och arbetarinstitutens allmänbildande utbildning Studier vid medborgar- och arbetarinstitut som syftar till examen, yrkeskompetens eller ett vitsord vid ett universitet eller en högskola klassificeras efter examen @sv
scope note: Kansalais- ja työväenopistoja koskevat yleisteokset Kansalais- ja työväenopistojen yleissivistävä opetus Tutkintoon, ammattipätevyyteen tai yliopisto- tai korkeakouluarvosanaan tähtäävät kansalais- ja työväenopisto-opinnot sijoitetaan tutkinnon mukaiseen luokkaan

Kansansivistysjärjestöt
type: Concept
References: Kansalaistoiminta ja –aktivismi. Järjestötoiminta. Kokoustekniikka.
References: Nuorisotyö. Lapsityö
type: YKL-luokka
alternative label: Arbetarnas bildningsorganisationer (38.63) @sv
alternative label: Folkbildningsorganisationer (38.63) @sv
alternative label: Kansansivistysjärjestöt (38.63)
alternative label: Kansanvalistusseura (38.63)
alternative label: Svenska utbildningsförbund (38.63)
alternative label: Työväen sivistysjärjestöt (38.63)
broader: Aikuiskoulutus. Vapaa sivistystyö
in scheme: YKL - Yleisten kirjastojen luokitusjärjestelmä
notation: 38.63
preferred label: Folkbildningsorganisationer @sv
preferred label: Liberal adult education organisations @en
scope note: Kansanvalistusseura. Työväen sivistysjärjestöt Muotoluokkaa 06 ei käytetä luokan 38.63 yhteydessä
scope note: Svenska bildningsförbundet Arbetarnas bildningsorganisationer Formtillägget 06 används inte i samband med klassen 38.63 @sv

Itseopiskelu. Opintokerhotoiminta
type: Concept
References: Elämänfilosofia. Elämäntaito
References: Yliopistot. Korkeakoulut
References: Keskiasteen koulutus. Toisen asteen koulutus
References: Lukiot
References: Ammatillinen koulutus
type: YKL-luokka
alternative label: Distansstudier (38.64) @sv
alternative label: Etäopiskelu (38.64)
alternative label: Itseopiskelu (38.64)
alternative label: Kirjeopiskelu (38.64)
alternative label: Korrespondensstudier (38.64) @sv
alternative label: Opintokerhotoiminta (38.64)
alternative label: Självstudium (38.64) @sv
alternative label: Studiecirklar (38.64) @sv
broader: Aikuiskoulutus. Vapaa sivistystyö
in scheme: YKL - Yleisten kirjastojen luokitusjärjestelmä
notation: 38.64
preferred label: Independent study. Study circles @en
preferred label: Självstudier. Studiecirklar @sv
scope note: Allmänna verk om självstudier och studiecirklar samt distans- och korrespondensundervisning Allmänbildande självstudier och studiecirklar samt distans- och korrespondensundervisning Självstudier, studiecirklar och distans- och korrespondensundervisning som syftar till examen, yrkeskompetens eller ett vitsord vid ett universitet eller en högskola klassificeras efter examen @sv
scope note: Itseopiskelua ja opintokerhotoimintaa sekä etä-ja kirjeopiskelua koskevat yleisteokset Yleissivistävä itseopiskelu, opintokerhotoiminta sekä etä- ja kirjeopiskelu Tutkintoon, ammattipätevyyteen tai yliopisto- tai korkeakouluarvosanaan tähtäävä itseopiskelu ja opintokerhotoiminta sekä etä- ja kirjeopiskelu sijoitetaan tutkinnon mukaiseen luokkaan

Nuorisotyö. Lapsityö
type: Concept
References: Lasten ja nuorten kulttuuritoiminta
References: Kristillinen opetus ja kasvatus
References: Elämäntapojen sosiologia. Kulttuurisosiologia
References: Perhesosiologia
References: Poliittiset järjestelmät
References: Ikäryhmien asema yhteiskunnassa
References: Työ. Työelämä
References: Perhepolitiikka
References: Ammatinvalinta
type: YKL-luokka
alternative label: Barnarbete (38.7+) @sv
alternative label: Flickarbete (38.7+) @sv
alternative label: Gängarbete (38.7) @sv
alternative label: Jengityö (38.7)
alternative label: Kommunalt ungdomsarbete (38.7) @sv
alternative label: Kunnallinen nuorisotyö (38.7)
alternative label: Lapsityö (38.7+)
alternative label: Nuoriso-ohjaajan työ (38.7)
alternative label: Nuoriso-ongelmat, nuorisotyö (38.7+)
alternative label: Nuorisotyö (38.7+)
alternative label: Poikatyö (38.7+)
alternative label: Pojkarbete (38.7+) @sv
alternative label: Tyttötyö (38.7+)
alternative label: Ungdomsarbete (38.7+) @sv
alternative label: Ungdomsledarens arbete (38.7) @sv
alternative label: Ungdomsproblem, ungdomsarbete (38.7+) @sv
broader: KASVATUS. OPETUS. KASVATUSTIEDE
in scheme: YKL - Yleisten kirjastojen luokitusjärjestelmä
narrower: Partioliike
notation: 38.7
preferred label: Ungdomsarbete. Barnarbete @sv
preferred label: Youth work. Child work @en
scope note: Hit privat och kommunalt barn- och ungdomsarbete och gängarbete i allmänhet Barn- och ungdomsarbetets organisation. Handledningar för barn- och ungdomsarbetare Kultur- och hobbyverksamhet för barn och ungdomar inom olika områden klassificeras enligt område Ungdomsorganisationer och ungdomsföreningar i allmänhet 38.706 @sv
scope note: Tähän yksityinen ja kunnallinen lapsityö, nuorisotyö ja jengityö yleensä Lapsi- ja nuorisotyön organisaatio. Lapsi- ja nuorisotyöntekijän oppaat Lasten ja nuorten eri alojen kulttuuri- ja harrastustoiminta luokitetaan alan mukaan Nuorisojärjestöt ja -seurat yleensä 38.706

Partioliike
type: Concept
type: YKL-luokka
alternative label: Partiolaisen oppaat (38.71)
alternative label: Partioliike (38.71)
alternative label: Partiolippukunnat (38.71)
alternative label: Partionjohtajan oppaat (38.71)
alternative label: Scouthandböcker (38.71) @sv
alternative label: Scoutkårer (38.71) @sv
alternative label: Scoutledarens handböcker (38.71) @sv
alternative label: Scoutrörelsen (38.71) @sv
broader: Nuorisotyö. Lapsityö
in scheme: YKL - Yleisten kirjastojen luokitusjärjestelmä
notation: 38.71
preferred label: Scout movement @en
preferred label: Scoutrörelsen @sv
scope note: Partioliikkeen organisaatio. Partiolippukunnat Partiolaisen ja partionjohtajan oppaat Muotoluokkaa 06 ei käytetä luokan 38.71 yhteydessä
scope note: Scoutrörelsens organisation. Scoutkårer Handböcker för scouter och scoutledare Formtillägget 06 används inte i samband med klassen 38.71 @sv

Ammatinvalinta
type: Concept
References: Työvoimapolitiikka
References: Keskiasteen koulutus. Toisen asteen koulutus
type: YKL-luokka
alternative label: Ammatinvaihto (38.8)
alternative label: Ammatinvalinnan ohjaus (38.8)
alternative label: Ammatinvalinnan oppaat (38.8)
alternative label: Ammatinvalinnan psykologia (38.8)
alternative label: Ammatinvalinnanohjaajan työ (38.8)
alternative label: Ammatinvalinnanohjaus (38.8)
alternative label: Ammatinvalinta (38.8)
alternative label: Karriärbyte (38.8) @sv
alternative label: Karriärvägledning (38.8) @sv
alternative label: Lämplighetstest, yrkesval (38.8) @sv
alternative label: Soveltuvuuskokeet, ammatinvalinta (38.8)
alternative label: Uranvaihto (38.8)
alternative label: Uraohjaus (38.8)
alternative label: Yrkesbyte (38.8) @sv
alternative label: Yrkesval (38.8) @sv
alternative label: Yrkesvalets psykologi (38.8) @sv
alternative label: Yrkesvalsguider (38.8) @sv
alternative label: Yrkesvägledarens arbete (38.8) @sv
alternative label: Yrkesvägledning (38.8) @sv
broader: KASVATUS. OPETUS. KASVATUSTIEDE
in scheme: YKL - Yleisten kirjastojen luokitusjärjestelmä
notation: 38.8
preferred label: Vocational guidance @en
preferred label: Yrkesval @sv
scope note: Hit handledningar i yrkesval för olika områden och yrken Hit också yrkesvägledning i skolorna Yrkesvalets psykologi Yrkesvägledarens arbete Karriärbyte och karriärplanering Yrken inom olika områden klassificeras enligt område @sv
scope note: Tähän eri alojen ja ammattien ammatinvalintaoppaat Tähän myös koulujen tarjoama ammatinvalinnanohjaus Ammatinvalinnan psykologia Ammatinvalinnanohjaajan työ Uranvaihto ja urasuunnittelu Eri alojen ammatit luokitetaan alan mukaan

MAANPUOLUSTUS
type: Concept
References: Siirtolaiset. Pakolaiset
References: Kansainvälinen politiikka
References: Rauhankysymys. Rauhantutkimus
References: Kansainvälinen oikeus
References: Julkis- ja hallinto-oikeus
References: Palo- ja pelastustoimi
References: Vammaispalvelut
References: Yleinen sotahistoria
References: MAAILMANHISTORIA. EUROOPAN HISTORIA
References: SUOMEN HISTORIA
References: POHJOISMAIDEN HISTORIA
References: KESKI-EUROOPAN HISTORIA
References: BRITTEINSAARTEN HISTORIA
References: ETELÄ-EUROOPAN HISTORIA
References: ITÄ-EUROOPAN HISTORIA
References: MUIDEN MAANOSIEN HISTORIA
References: Elämäkerrat. Muistelmat, sotamuistelmat
References: Elämäkerralliset hakuteokset, Yhteiskuntaelämän, kasvatuksen ja maanpuolustuksen edustajat
alternative label: Armeijan sosiologia (39+)
alternative label: Armeijat (39+)
alternative label: Aselajit (39+)
alternative label: Asevelvollisuus (39+)
alternative label: Huoltovarmuus (39+)
alternative label: Informaatiosodankäynti (39+)
alternative label: Joukko-osastot, puolustusvoimat (39+)
alternative label: Kiusaaminen, armeija (39+)
alternative label: Kotirintama, maanpuolustus (39+)
alternative label: Kotirintama, siviiliväestön asema sodassa (39+)
alternative label: Kriisinhallinta, sotilaalliset toimet (39+)
alternative label: Kriisivalmius, maanpuolustus (39+)
alternative label: Kutsunnat (39+)
alternative label: Kyberturvallisuus (39+)
alternative label: Liikekannallepano (39+)
alternative label: Linnoitustaito (39+)
alternative label: Maanpuolustus (39+)
alternative label: Meripuolustus (39+)
alternative label: Operaatiot, sotilaallinen strategia ja taktiikka (39+)
alternative label: Propaganda, sotapropaganda (39+)
alternative label: Psykologinen sodankäynti (39+)
alternative label: Puolustushallinto (39+)
alternative label: Puolustuslaitos (39+)
alternative label: Puolustuspolitiikka (39+)
alternative label: Puolustusvoimat (39+)
alternative label: Rauhanturvajoukot, YK (39+)
alternative label: Simputus, armeija (39+)
alternative label: Sota-aika, maanpuolustus (39+)
alternative label: Sotalaitos (39+)
alternative label: Sotapoliisi (39+)
alternative label: Sotapropaganda (39+)
alternative label: Sotarikokset, yl. (39+)
alternative label: Sotarikollisuus (39+)
alternative label: Sotataito (39+)
alternative label: Sotatiede (39+)
alternative label: Sotavangit (39+)
alternative label: Sotaveteraanit (39+)
alternative label: Sotaväki (39+)
alternative label: Sotilashallinto (39+)
alternative label: Sotilasmaantiede (39+)
alternative label: Sotilasoperaatiot, strategia ja taktiikka (39+)
alternative label: Sotilaspapisto (39+)
alternative label: Sotilaspapit (39+)
alternative label: Sotilaspsykologia (39+)
alternative label: Sotilastukikohdat (39+)
alternative label: Strategia, sotataito (39+)
alternative label: Taktiikka, sotataito (39+)
alternative label: Valmiussuunnittelu, maanpuolustus (39+)
alternative label: Vapaaehtoinen maanpuolustus (39+)
alternative label: Varuskunnat (39+)
broader: YHTEISKUNTA
in scheme: YKL - Yleisten kirjastojen luokitusjärjestelmä
narrower: Aseistus. Asevarustelu. Asekauppa
narrower: Huolto
narrower: Maavoimat. Maasodankäynti
narrower: Merivoimat. Merisodankäynti
narrower: Ilmavoimat. Ilmasodankäynti
narrower: Sotilaskoulutus
notation: 39
scope note: Hit olika länders försvarspolitik och försvar samt allmänna verk om ländernas arméer. Hit och till underklasserna krigskonst och krigsvetenskap samt strategi och taktik. Hit och till underklasserna också försvarsmakten, militäradministration, militärpolis, värnplikt, uppbåd, mobilisering och frivilligt försvar. Hit och till underklasserna också militärpsykologi och psykologisk krigföring. Hit och till underklasserna också krigsveteraner, krigsfångar, hemmafronten och civilbefolkningens ställning i krig. Hit och till underklasserna också krigsförbrytelser. Hit och till underklasserna också fredsbevarande styrkor. Skyddskårerna och Lotta Svärd -organisationen 39.06. Försvarsorganisationer 39.06. Krigsveteranorganisationer 39.06. Allmänna historiska verk om krigskonst, krigsvetenskap och olika länders försvarsmakter 39.09 @sv
scope note: Tähän eri maiden harjoittamaa puolustuspolitiikkaa ja maanpuolustusta sekä niiden armeijoita koskevat yleisteokset. Tähän ja alaluokkiin sotataito ja sotatiede sekä strategia ja taktiikka. Tähän ja alaluokkiin myös puolustusvoimat, sotilashallinto, sotapoliisi, asevelvollisuus, kutsunnat, liikekannallepano ja vapaaehtoinen maanpuolustus. Tähän ja alaluokkiin myös armeijan sosiologia . Tähän ja alaluokkiin myös sotilaspsykologia ja psykologinen sodankäynti. Tähän ja alaluokkiin myös sotaveteraanit, sotavangit, kotirintama ja siviiliväestön asema sodassa. Tähän ja alaluokkiin myös sotarikollisuus. Tähän ja alaluokkiin myös rauhanturvajoukot . Suojeluskunta- ja lottajärjestöt 39.06. Maanpuolustusjärjestöt 39.06. Sotaveteraanijärjestöt 39.06. Sotataidon, sotatieteen ja eri maiden puolustuslaitosten historia yleensä 39.09

Aseistus. Asevarustelu. Asekauppa
type: Concept
References: Rauhankysymys. Rauhantutkimus
References: Merivoimat. Merisodankäynti
References: Ilmavoimat. Ilmasodankäynti
References: METALLITEOLLISUUS. KONETEKNIIKKA. LIIKENNEVÄLINEET SÄHKÖTEKNIIKKA
References: Metsästys
References: Ammunta
alternative label: Ampuma-aseet (39.1)
alternative label: Armén, beväpning (39.1) @sv
alternative label: Aseet (39.1)
alternative label: Aseet, keräily (39.1)
alternative label: Aseistus (39.1)
alternative label: Asekauppa, sotilaalliselta kannalta (39.1)
alternative label: Aseoppi (39.1)
alternative label: Asepuvut (39.1)
alternative label: Aserajoitukset, sotilaalliselta kannalta (39.1)
alternative label: Asetekniikka (39.1)
alternative label: Asevarikot (39.1)
alternative label: Asevarustelu, sotilaalliselta kannalta (39.1)
alternative label: Atomenergi, militär användning (39.1) @sv
alternative label: Atomiaseet, aseteknologia (39.1)
alternative label: Atomiaseet, asevarustelu (39.1)
alternative label: Atomienergia, sotilaallinen käyttö (39.1)
alternative label: Atomvapen, upprustning (39.1) @sv
alternative label: Atomvapen, vapenteknologi (39.1) @sv
alternative label: Ballistiikka, aseteknologia (39.1)
alternative label: Ballistik, vapenteknologi (39.1) @sv
alternative label: Beväpning (39.1) @sv
alternative label: Biologinen sodankäynti (39.1)
alternative label: Biologiset aseet (39.1)
alternative label: Biologisk krigföring (39.1) @sv
alternative label: Biologiska vapen (39.1) @sv
alternative label: Dräkter, uniformer (39.1) @sv
alternative label: Gevär, vapenteknologi (39.1) @sv
alternative label: Hagelgevär, vapenteknologi (39.1) @sv
alternative label: Handeldvapen (39.1) @sv
alternative label: Haulikot, aseteknologia (39.1)
alternative label: Hyökkäysvaunut (39.1)
alternative label: Kanoner (39.1) @sv
alternative label: Kemialliset aseet (39.1)
alternative label: Kemiska vapen (39.1) @sv
alternative label: Kiväärit, aseteknologia (39.1)
alternative label: Konventionella vapen (39.1) @sv
alternative label: Krigsmateriel (39.1) @sv
alternative label: Kryssningsmissiler, vapenteknologi och upprustning (39.1) @sv
alternative label: Kärnenergi, militärt utnyttjande (39.1) @sv
alternative label: Kärnkraft, militärt utnyttjande (39.1) @sv
alternative label: Kärnvapen, vapenteknologi och upprustning (39.1) @sv
alternative label: Käsiaseet (39.1)
alternative label: Maavoimat, aseistus (39.1)
alternative label: Militära uniformer (39.1) @sv
alternative label: Missiler, vapenteknologi och upprustning (39.1) @sv
alternative label: Ohjukset, aseteknologia ja asevarustelu (39.1)
alternative label: Pansarvagnar (39.1) @sv
alternative label: Panssarivaunut (39.1)
alternative label: Pistoler, vapenteknologi (39.1) @sv
alternative label: Pistoolit, aseteknologia (39.1)
alternative label: Puukot, aseet (39.1)
alternative label: Puvut, asepuvut (39.1)
alternative label: Risteilyohjukset, aseteknologia ja asevarustelu (39.1)
alternative label: Räjähdysaineet, aseteknologia (39.1)
alternative label: Skjutvapen (39.1) @sv
alternative label: Slidknivar, vapen (39.1) @sv
alternative label: Sotakalusto (39.1)
alternative label: Sotilaspuvut (39.1)
alternative label: Sprängämnen, vapenteknologi (39.1) @sv
alternative label: Stridsgaser (39.1) @sv
alternative label: Stridsvagnar (39.1) @sv
alternative label: Taistelukaasut (39.1)
alternative label: Tankit (39.1)
alternative label: Tavanomaiset aseet (39.1)
alternative label: Tykit (39.1)
alternative label: Ydinaseet, aseteknologia ja asevarustelu (39.1)
alternative label: Ydinenergia, sotilaallinen käyttö (39.1)
alternative label: Ydinvoima, sotilaallinen käyttö (39.1)
broader: MAANPUOLUSTUS
in scheme: YKL - Yleisten kirjastojen luokitusjärjestelmä
notation: 39.1
scope note: Hit allmänna verk om vapen, om att samla vapen och om vapenteknik Konventionella vapen. Ballistik Handvapen. Pansarvagnar. Kanoner. Raketer Kärnvapen. Biologiska vapen Övrig krigsmateriel och krigsutrustning Uniformer. Vapendepåer Hit också upprustning och vapenhandel ur militär synvinkel @sv
scope note: Tähän myös aseita, aseiden keräilyä tai asetekniikkaa koskevat yleisteokset Tavanomaiset aseet. Ballistiikka Käsiaseet. Hyökkäysvaunut. Tykit. Ohjukset Ydinaseet. Biologiset aseet. Kemialliset aseet Muut taisteluvälineet ja -varusteet Asepuvut. Asevarikot Tähän myös asevarustelu ja asekauppa sotilaalliselta kannalta

Huolto
type: Concept
References: Vammaispalvelut
References: URN:NBN:fi:au:ykl:37.706
References: URN:NBN:fi:au:ykl:39.06
References: Aseistus. Asevarustelu. Asekauppa
References: Merivoimat. Merisodankäynti
References: Ilmavoimat. Ilmasodankäynti
References: Yleinen terveydenhoito
type: YKL-luokka
alternative label: Armén, underhåll (39.2) @sv
alternative label: Fältartister (39.2) @sv
alternative label: Försörjningsberedskap, truppförsörjning (39.2) @sv
alternative label: Huoltojoukot, armeija (39.2)
alternative label: Huoltovarmuus, joukkojen huolto (39.2)
alternative label: Inkvartering, armén (39.2) @sv
alternative label: Kuljetusjoukot, armeija (39.2)
alternative label: Maavoimat, huolto (39.2)
alternative label: Majoitus, armeija (39.2)
alternative label: Muonitus, armeija (39.2)
alternative label: Proviantering, armén (39.2) @sv
alternative label: Soldathemsverksamhet (39.2) @sv
alternative label: Sotilaskotitoiminta (39.2)
alternative label: Taloushuolto, armeija (39.2)
alternative label: Transporttrupper, armén (39.2) @sv
alternative label: Underhåll, armén (39.2) @sv
alternative label: Underhållstrupper, armén (39.2) @sv
alternative label: Viihdytystoiminta, armeija (39.2)
broader: MAANPUOLUSTUS
in scheme: YKL - Yleisten kirjastojen luokitusjärjestelmä
notation: 39.2
preferred label: Maintenance @en
preferred label: Underhåll @sv
scope note: Hit allmänna verk om underhåll Underhåll av armén Transport. Proviantering. Inkvartering. Ekonomi Underhållstrupper Soldathem och underhållning @sv
scope note: Tähän huoltoa koskevat yleisteokset Maavoimien huolto Kuljetus. Muonitus. Majoitus. Taloushuolto Huoltojoukot Sotilaskoti- ja viihdytystoiminta

Maavoimat. Maasodankäynti
type: Concept
References: Poliisitoimi. Yleinen turvallisuus
References: Aseistus. Asevarustelu. Asekauppa
References: Huolto
References: Merivoimat. Merisodankäynti
type: YKL-luokka
alternative label: Armén (39.4) @sv
alternative label: Artilleri, armén (39.4) @sv
alternative label: Fallskärmshopp, armén (39.4) @sv
alternative label: Fallskärmstrupper, armén (39.4) @sv
alternative label: Främlingslegionen (39.4) @sv
alternative label: Gerillakrig, krigskonst (39.4) @sv
alternative label: Ilmatorjunta (39.4)
alternative label: Ilmatorjuntatykistö, maavoimat (39.4)
alternative label: Infanteri, armén (39.4) @sv
alternative label: Ingenjörstrupper, armén (39.4) @sv
alternative label: Insinöörijoukot, maavoimat (39.4)
alternative label: Jalkaväki, maavoimat (39.4)
alternative label: Kavalleri, armén (39.4) @sv
alternative label: Kevyet joukot, maavoimat (39.4)
alternative label: Kommando-joukot, maavoimat (39.4)
alternative label: Kommandotrupper, armén (39.4) @sv
alternative label: Kustartilleri, armén (39.4) @sv
alternative label: Laskuvarjohypyt, maavoimat (39.4)
alternative label: Laskuvarjojoukot, maavoimat (39.4)
alternative label: Luftvärn (39.4) @sv
alternative label: Luftvärnsartilleri, armén (39.4) @sv
alternative label: Lätta trupper, armén (39.4) @sv
alternative label: Maasodankäynti (39.4)
alternative label: Maavoimat (39.4)
alternative label: Markkrigföring (39.4) @sv
alternative label: Moottoroidut joukot, maavoimat (39.4)
alternative label: Motoriserade trupper, armén (39.4) @sv
alternative label: Muukalaislegioona (39.4)
alternative label: Pansartrupper, armén (39.4) @sv
alternative label: Pansarvärnsartilleri, armén (39.4) @sv
alternative label: Panssarijoukot, maavoimat (39.4)
alternative label: Panssarintorjuntatykistö, maavoimat (39.4)
alternative label: Partigängartrupper, armén (39.4) @sv
alternative label: Pioneerijoukot, maavoimat (39.4)
alternative label: Pionjärtrupper, armén (39.4) @sv
alternative label: Rannikkotykistö, maavoimat (39.4)
alternative label: Ratsuväki, maavoimat (39.4)
alternative label: Signaltrupper, armén (39.4) @sv
alternative label: Sissijoukot, maavoimat (39.4)
alternative label: Sissisota, sotataito (39.4)
alternative label: Tykistö, maavoimat (39.4)
alternative label: Viestijoukot, maavoimat (39.4)
broader: MAANPUOLUSTUS
in scheme: YKL - Yleisten kirjastojen luokitusjärjestelmä
notation: 39.4
preferred label: Army. Land warfare @en
preferred label: Landstridskrafterna. Landskrigföring @sv
scope note: Krigskonst, strategi och taktik ur landskrigföringens synvinkel Infanteri. Kavalleri. Gerilla-, kommando- och fallskärmstrupper Lätta och motoriserade trupper. Pansartrupper Artilleri. Luftvärnsartilleri, pansarvärnsartilleri och kustartilleri Pionjärtrupper. Ingenjörstrupper. Signaltruppen @sv
scope note: Sotataito, strategia ja taktiikka maasodankäynnin kannalta Jalkaväki. Ratsuväki. Sissi-, kommando- ja laskuvarjojoukot Kevyet ja moottoroidut joukot. Panssarijoukot Tykistö. Ilmatorjunta-, panssarintorjunta- ja rannikkotykistö Pioneerijoukot. Insinöörijoukot. Viestijoukot

Merivoimat. Merisodankäynti
type: Concept
References: Poliisitoimi. Yleinen turvallisuus
References: Maavoimat. Maasodankäynti
References: Laivat
References: Vesiliikenne
type: YKL-luokka
alternative label: Atomubåtar, militära (39.5) @sv
alternative label: Fartyg, krigsfartyg (39.5) @sv
alternative label: Flotta, örlogsflotta (39.5) @sv
alternative label: Hangarfartyg (39.5) @sv
alternative label: Krigsfartyg, marinen (39.5) @sv
alternative label: Krigsflotta, marinen (39.5) @sv
alternative label: Kärnenergidrivna fartyg, krigsfartyg (39.5) @sv
alternative label: Laivasto, sotalaivasto (39.5)
alternative label: Laivat, sotalaivat (39.5)
alternative label: Landstigningstrupper, marinen (39.5) @sv
alternative label: Lentotukialukset (39.5)
alternative label: Maihinnousujoukot, merivoimat (39.5)
alternative label: Marinen (39.5) @sv
alternative label: Marinen, beväpning och underhåll (39.5) @sv
alternative label: Marininfanteri (39.5) @sv
alternative label: Merijalkaväki (39.5)
alternative label: Merisodankäynti (39.5)
alternative label: Merivoimat (39.5)
alternative label: Merivoimat, aseistus ja huolto (39.5)
alternative label: Sjökrigföring (39.5) @sv
alternative label: Sotalaivasto, merivoimat (39.5)
alternative label: Sotalaivat, merivoimat (39.5)
alternative label: Sukellusveneet, merivoimat (39.5)
alternative label: Ubåtar, marinen (39.5) @sv
alternative label: Undervattensfartyg, militära (39.5) @sv
alternative label: Vedenalaiset alukset, sotilaalliset (39.5)
alternative label: Ydinkäyttöiset laivat, sotalaivat (39.5)
alternative label: Ydinsukellusveneet, sotilaalliset (39.5)
broader: MAANPUOLUSTUS
in scheme: YKL - Yleisten kirjastojen luokitusjärjestelmä
notation: 39.5
preferred label: Marinen. Sjökrigföring @sv
preferred label: Navy. Naval warfare @en
scope note: Krigskonst, strategi och taktik ur sjökrigföringens synvinkel Krigsflotta. Krigsfartyg. Ubåtar Marininfanteri. Landstigningstrupper Hit också marinens beväpning och underhåll av marinen Om verket rör fartyg som är ämnade för både militära och civila ändamål, ges företräde åt klass 62.542 @sv
scope note: Sotataito, strategia ja taktiikka meri- ja rannikkosodankäynnin kannalta Sotalaivasto. Sotalaivat. Sukellusveneet Merijalkaväki. Maihinnousujoukot Tähän myös merivoimien aseistus ja huolto Jos teos koskee sekä sotilas- että siviilikäyttöön tarkoitettuja laivoja, annetaan etusija luokalle 62.542

Ilmavoimat. Ilmasodankäynti
type: Concept
References: Aseistus. Asevarustelu. Asekauppa
References: Maavoimat. Maasodankäynti
References: Ilmakulkuneuvot
References: Avaruusalukset. Avaruusteknologia
References: Lentoliikenne
type: YKL-luokka
alternative label: Avaruus, sotilaallinen hyväksikäyttö (39.6)
alternative label: Avaruusalukset, sotilaalliset (39.6)
alternative label: Flygplan, militärflygplan (39.6) @sv
alternative label: Flygvapnet (39.6) @sv
alternative label: Flygvapnet, beväpning och underhåll (39.6) @sv
alternative label: Helikopterit, sotilashelikopterit (39.6)
alternative label: Helikoptrar, militärhelikoptrar (39.6) @sv
alternative label: Ilmailu, ilmavoimat (39.6)
alternative label: Ilmailu, sotilaslentokoneet (39.6)
alternative label: Ilmasodankäynti (39.6)
alternative label: Ilmasota, sotataito (39.6)
alternative label: Ilmavoimat (39.6)
alternative label: Ilmavoimat, aseistus ja huolto (39.6)
alternative label: Kärnvapen, militärt utnyttjande av rymden (39.6) @sv
alternative label: Lennokit, sotilaslennokit (39.6)
alternative label: Lentokoneet, sotilaslentokoneet (39.6)
alternative label: Luftfart, flygvapnet (39.6) @sv
alternative label: Luftfart, militärflygplan (39.6) @sv
alternative label: Luftkrig (39.6) @sv
alternative label: Luftkrig, krigskonst (39.6) @sv
alternative label: Miehittämättömät ilma-alukset, sotilaalliset (39.6)
alternative label: Militära satelliter (39.6) @sv
alternative label: Militärflygplan, flygvapnet (39.6) @sv
alternative label: Missiler, militärt utnyttjande av rymden (39.6) @sv
alternative label: Obemannade luftfarkostar, militära (39.6) @sv
alternative label: Ohjukset, avaruuden sotilaallinen käyttö (39.6)
alternative label: Raketer, militärt utnyttjande av rymden (39.6) @sv
alternative label: Raketit, avaruuden sotilaallinen käyttö (39.6)
alternative label: Rymden, militärt utnyttjande (39.6) @sv
alternative label: Rymdfarkoster, militära (39.6) @sv
alternative label: Satelliitit, sotilaallinen käyttö (39.6)
alternative label: Satelliter, militär användning (39.6) @sv
alternative label: Sotilaslentokoneet, ilmavoimat (39.6)
alternative label: Sotilassatelliitit (39.6)
alternative label: Ydinaseet, avaruuden sotilaallinen käyttö (39.6)
broader: MAANPUOLUSTUS
in scheme: YKL - Yleisten kirjastojen luokitusjärjestelmä
notation: 39.6
preferred label: Air force. Aerial warfare @en
preferred label: Flygvapnet. Luftkrigföring @sv
scope note: Krigskonst, strategi och taktik ur luftkrigföringens synvinkel Hit också militärt utnyttjande av rymden Militärplan. Militärsatelliter Hit också flygvapnets beväpning och underhåll av flygvapnet Om verket rör både militär- och civilplan, ges företräde åt klass 62.55 @sv
scope note: Sotataito, strategia ja taktiikka ilmasodankäynnin kannalta Tähän myös avaruuden sotilaallinen hyväksikäyttö Sotilaslentokoneet. Sotilassatelliitit Tähän myös ilmavoimien aseistus ja huolto Jos teos koskee sekä sotilas- että siviililentokoneita, annetaan etusija luokalle 62.55

Sotilaskoulutus
type: Concept
References: Rauhankysymys. Rauhantutkimus
References: MAANPUOLUSTUS
type: YKL-luokka
alternative label: Aliupseerikoulut (39.7)
alternative label: Aliupseerikoulutus (39.7)
alternative label: Befattningsofficersutbildning (39.7) @sv
alternative label: Försvarshögskolan (39.7) @sv
alternative label: Kadettikoulut (39.7)
alternative label: Kadettskolor (39.7) @sv
alternative label: Kertausharjoitukset, sotilaskoulutus (39.7)
alternative label: Krigshögskolan (39.7) @sv
alternative label: Krigsskolor (39.7) @sv
alternative label: Maanpuolustuskorkeakoulu (39.7)
alternative label: Militär utbildning (39.7) @sv
alternative label: Officersskolor (39.7) @sv
alternative label: Officersutbildning (39.7) @sv
alternative label: Repetitionsövningar, militärutbildning (39.7) @sv
alternative label: Reservinupseerikoulut (39.7)
alternative label: Reservinupseerikoulutus (39.7)
alternative label: Reservofficersskolor (39.7) @sv
alternative label: Reservofficersutbildning (39.7) @sv
alternative label: Sotakorkeakoulu (39.7)
alternative label: Sotakoulut (39.7)
alternative label: Sotilaskoulutus (39.7)
alternative label: Toimiupseerikoulutus (39.7)
alternative label: Underofficersskolning (39.7) @sv
alternative label: Underofficersskolor (39.7) @sv
alternative label: Upseerikoulut (39.7)
alternative label: Upseerikoulutus (39.7)
alternative label: Varusmieskoulutus (39.7)
alternative label: Värnpliktsutbildning (39.7) @sv
broader: MAANPUOLUSTUS
in scheme: YKL - Yleisten kirjastojen luokitusjärjestelmä
notation: 39.7
preferred label: Military training @en
preferred label: Militär utbildning @sv
scope note: Utbildning av värnpliktiga. Repetitionsövningar Reservofficers-, underofficers- och officersskolor Kadettskolor. Försvarshögskolan @sv
scope note: Varusmieskoulutus. Kertausharjoitukset Reservinupseeri-, aliupseeri- ja upseerikoulut ja -koulutus Kadettikoulut. Maanpuolustuskorkeakoulu

MAANTIEDE. MATKAT. KANSATIEDE
type: Concept
type: YKL-luokka
alternative label: Pilgrimsfärder, resehandböcker (4+) @sv
alternative label: Pyhiinvaellukset, matkaoppaat (4+)
alternative label: Samhällsskildring (4+) @sv
alternative label: Yhteiskuntakuvaus (4+)
in scheme: YKL - Yleisten kirjastojen luokitusjärjestelmä
narrower: MAANTIEDE
narrower: EUROOPPA
narrower: SUOMI
narrower: POHJOISMAAT
narrower: KESKI-EUROOPPA
narrower: BRITTEINSAARET
narrower: ETELÄ-EUROOPPA
narrower: ITÄ-EUROOPPA
narrower: MUUT MAANOSAT
narrower: KANSATIEDE. KULTTUURIANTROPOLOGIA
notation: 4
preferred label: GEOGRAFI. RESOR. ETNOLOGI @sv
preferred label: GEOGRAPHY. TRAVEL. ETHNOLOGY @en
top concept of: YKL - Yleisten kirjastojen luokitusjärjestelmä

MAANTIEDE
type: Concept
References: MUUT MAANOSAT
type: YKL-luokka
alternative label: Allmän geografi (40+) @sv
alternative label: Aluemaantiede (40+)
alternative label: Geografi (40+) @sv
alternative label: Geografi, historisk (40+) @sv
alternative label: Geografi, regionalgeografi (40+) @sv
alternative label: Historiallinen maantiede (40+)
alternative label: Historisk geografi (40+) @sv
alternative label: Jordklotet, allmän geografi (40+) @sv
alternative label: Maantiede (40+)
alternative label: Maantiede, aluemaantiede (40+)
alternative label: Maantiede, historiallinen (40+)
alternative label: Maapallo, yleismaantiede (40+)
alternative label: Regionalgeografi (40+) @sv
alternative label: Yleismaantiede (40+)
broader: MAANTIEDE. MATKAT. KANSATIEDE
in scheme: YKL - Yleisten kirjastojen luokitusjärjestelmä
narrower: Maailmankartat ja -kartastot
narrower: Yleinen kulttuurimaantiede
narrower: Matkailu. Turismi
narrower: Matkakuvaukset
notation: 40
preferred label: GEOGRAFI @sv
preferred label: GEOGRAPHY @en
scope note: Hit allmänna verk om geografi Hit också allmänna verk om regionalgeografi och historisk geografi Hit också allmänna verk som innehåller både fysisk geografi och kulturgeografi eller naturgeografi och kulturgeografi Hit och till underklasserna också verk som behandlar både Europa och en eller flera andra världsdelar Om verket innehåller både geografi och historia, ges företräde åt klass 4 Geografi för bestämda världsdelar, länder eller regioner, allmän naturgeografi samt kulturgeografi förs till klasserna 41-48+ @sv
scope note: Tähän maantieteen yleisteokset Tähän myös aluemaantieteen ja historiallisen maantieteen yleisteokset Tähän myös yleisteokset, joissa on sekä fyysistä tai luonnonmaantiedettä että kulttuurimaantiedettä Tähän ja alaluokkiin myös teokset, jotka koskevat sekä Eurooppaa että yhtä tai useampaa muuta maanosaa Jos teoksessa on sekä maantiedettä että historiaa, annetaan etusija luokalle 4 Tietyn maanosan, maan tai alueen yleismaantiede, yleinen luonnonmaantiede sekä kulttuurimaantiede sijoitetaan luokkiin 41-48+

Maailmankartat ja -kartastot
type: Concept
References: URN:NBN:fi:au:ykl:48.02
References: URN:NBN:fi:au:ykl:52.02
References: Geodesia. Maanmittaus. Kartoitus
References: URN:NBN:fi:au:ykl:55.502
References: URN:NBN:fi:au:ykl:69.6302
References: Historialliset maailmankartat ja -kartastot
type: YKL-luokka
alternative label: Atlakset, maailmankartat (40.02)
alternative label: Atlaser, världskartor (40.02) @sv
alternative label: Globkartor (40.02) @sv
alternative label: Jordklotet, världskartor (40.02) @sv
alternative label: Kartastot, maailmankartastot (40.02)
alternative label: Kartat, maailmankartat (40.02)
alternative label: Kartor, världskartor (40.02) @sv
alternative label: Kartverk, världsatlaser (40.02) @sv
alternative label: Maailmankartastot (40.02)
alternative label: Maapallo, maailmankartat (40.02)
alternative label: Pallokartat (40.02)
alternative label: Tiekartat (40.02 ... 48.99+)
alternative label: Topografiset kartat (40.02 ... 48.99+)
alternative label: Topografiska kartor (40.02 ... 48.99+) @sv
alternative label: Vägkartor (40.02 ... 48.99+) @sv
alternative label: Världsatlaser (40.02) @sv
broader: MAANTIEDE
in scheme: YKL - Yleisten kirjastojen luokitusjärjestelmä
notation: 40.02
preferred label: Världskartor och kartverk @sv
preferred label: World maps and atlases @en
scope note: Hit också kartor, som rör Europa och en eller flera andra världsdelar Kartor över ett visst område klassificeras enligt världsdel, land och region Kartor över specialområden klassificeras enligt område @sv
scope note: Tähän myös kartat, jotka koskevat Eurooppaa ja yhtä tai usempaa muuta maanosaa Tiettyä aluetta koskevat kartat luokitetaan maanosittain, maittain ja alueittain Erikoisalojen kartat luokitetaan alan mukaan

Yleinen kulttuurimaantiede
type: Concept
References: Väestötiede. Väestöpolitiikka
References: Kansainvälinen politiikka
References: ALUESUUNNITTELU. ALUEPOLITIIKKA
References: Talouspolitiikka. Taloudelliset rakenteet
References: Kansainvälinen talous. Maailmankauppa
References: MUUT MAANOSAT
type: YKL-luokka
alternative label: Antropogeografi (40.1) @sv
alternative label: Antropogeografia (40.1)
alternative label: Geografi, kulturgeografi (40.1) @sv
alternative label: Ihmismaantiede (40.1)
alternative label: Kulttuurimaantiede (40.1)
alternative label: Kulturgeografi (40.1) @sv
alternative label: Maantiede, kulttuurimaantiede (40.1)
alternative label: Socialgeografi (40.1) @sv
alternative label: Sosiaalimaantiede (40.1)
broader: MAANTIEDE
in scheme: YKL - Yleisten kirjastojen luokitusjärjestelmä
notation: 40.1
preferred label: Allmän kulturgeografi @sv
preferred label: General cultural geography @en
scope note: Hit allmänna verk om kulturgeografi och socialgeografi Hit också verk som behandlar både Europa och en eller flera andra världsdelar Kulturgeografi för enskilda världsdelar, länder, områden eller regioner klassificeras enligt område @sv
scope note: Tähän kulttuuri- ja sosiaalimaantieteen yleisteokset Tähän myös teokset, jotka koskevat sekä Eurooppaa että yhtä tai useampaa muuta maanosaa Tietyn maanosan, maan tai alueen kulttuurimaantiede luokitetaan ko. maanosan, maan tai alueen luokkaan Kulttuurimaantieteen eri alat luokitetaan alan mukaan

Matkailu. Turismi
type: Concept
References: Matkakuvaukset
References: EUROOPPA
References: SUOMI
References: POHJOISMAAT
References: KESKI-EUROOPPA
References: BRITTEINSAARET
References: ETELÄ-EUROOPPA
References: ITÄ-EUROOPPA
References: MUUT MAANOSAT
type: YKL-luokka
alternative label: Andelslägenheter (40.7) @sv
alternative label: Asuntovaunumatkailu (40.7)
alternative label: Camping-matkailu (40.7)
alternative label: Campingtourism (40.7) @sv
alternative label: Campingturism (40.7) @sv
alternative label: Ekstreme-matkailu (40.7)
alternative label: Extrem turism (40.7) @sv
alternative label: Extreme-matkailu (40.7)
alternative label: Extremturism (40.7) @sv
alternative label: Husvagnsturism (40.7) @sv
alternative label: Interrail-matkailu (40.7)
alternative label: Interrailresor (40.7) @sv
alternative label: Landbygdsturism (40.7) @sv
alternative label: Leirintämatkailu (40.7)
alternative label: Lomamatkailu (40.7)
alternative label: Lomaosakkeet (40.7)
alternative label: Luontomatkailu (40.7)
alternative label: Maaseutumatkailu (40.7)
alternative label: Matkailu (40.7)
alternative label: Matkailuelinkeino (40.7)
alternative label: Matkailun edistäminen (40.7)
alternative label: Matkailun organisaatio (40.7)
alternative label: Matkailupalvelut (40.7)
alternative label: Matkailupolitiikka (40.7)
alternative label: Matkaoppaan työ (40.7)
alternative label: Matkatoimistot (40.7)
alternative label: Matkojen järjestäminen (40.7)
alternative label: Minnesmärken, turism (40.7) @sv
alternative label: Muistomerkit, matkailu (40.7)
alternative label: Naturturism (40.7) @sv
alternative label: Nähtävyydet (40.7)
alternative label: Omatoimimatkailu (40.7)
alternative label: Resebyråer (40.7) @sv
alternative label: Reseguidens arbete (40.7) @sv
alternative label: Resor på egen hand (40.7) @sv
alternative label: Resor, arrangerande (40.7) @sv
alternative label: Semesterresor (40.7) @sv
alternative label: Seuramatkailu (40.7)
alternative label: Sevärdheter (40.7) @sv
alternative label: Sightseeing (40.7)
alternative label: Sällskapsresor (40.7) @sv
alternative label: Turism (40.7) @sv
alternative label: Turism, organisation (40.7) @sv
alternative label: Turismi (40.7)
alternative label: Turistfrämjande (40.7) @sv
alternative label: Turistnäring (40.7) @sv
alternative label: Turistpolitik (40.7) @sv
alternative label: Turistservice (40.7) @sv
alternative label: Urbaani löytöretkeily, yl (40.7)
alternative label: Urban exploration, allm. (40.7) @sv
broader: MAANTIEDE
in scheme: YKL - Yleisten kirjastojen luokitusjärjestelmä
narrower: Yleiset matkaoppaat
notation: 40.7
preferred label: Resor. Turism @sv
preferred label: Travel. Tourism @en
scope note: Hit allmänna verk om resor eller turism oavsett världsdel, land eller område Turistpolitik. Turistnäring Organisation av turism. Turistfrämjande Anordnande av resor och service för turister Resebyråer. Sällskapsresor. Guidens arbete Sightseeing. Campingresor. Interrailresor @sv
scope note: Tähän matkailua tai turismia koskevat yleisteokset maanosasta, maasta tai alueesta riippumatta Matkailupolitiikka. Matkailuelinkeino Matkailun organisaatio. Matkailun edistäminen Matkojen ja matkailupalveluiden järjestäminen Matkatoimistot. Seuramatkailu. Matkaoppaan työ Sightseeing. Camping-matkailu. Interrail-matkailu

Yleiset matkaoppaat
type: Concept
References: Museot
References: MUUT MAANOSAT
References: Vesiliikenne
References: Retkeily. Ulkoilu
type: YKL-luokka
alternative label: Asuntovaunumatkailu, matkaoppaat (40.71)
alternative label: Camping-alueluettelot (40.71)
alternative label: Camping-matkailu, matkaoppaat (40.71)
alternative label: Campingplatser, kataloger (40.71) @sv
alternative label: Campingplatskataloger (40.71) @sv
alternative label: Campingtourism, reseguider (40.71) @sv
alternative label: Campingturism, reseguider (40.71) @sv
alternative label: Ekstreme-matkailu, matkaoppaat (40.71)
alternative label: Extrem turism, reseguider (40.71) @sv
alternative label: Extreme-matkailu, matkaoppaat (40.71)
alternative label: Extremturism, reseguider (40.71) @sv
alternative label: Hotelliluettelot (40.71)
alternative label: Hotellkataloger (40.71) @sv
alternative label: Husvagnsturism, reseguider (40.71) @sv
alternative label: Interrail-oppaat (40.71)
alternative label: Interrailhandböcker (40.71) @sv
alternative label: Kansallispuistot, matkaoppaat (40.71)
alternative label: Landbygdsturism, reseguider (40.71) @sv
alternative label: Leirintäalueluettelot (40.71)
alternative label: Leirintämatkailu, matkaoppaat (40.71)
alternative label: Lomakyläluettelot (40.71)
alternative label: Lomamatkailu, matkaoppaat (40.71)
alternative label: Luontomatkailu, matkaoppaat (40.71)
alternative label: Maailmanperintökohteet, matkaoppaat (40.71)
alternative label: Maaseutumatkailu, matkaoppaat (40.71)
alternative label: Matkaoppaat (40.71)
alternative label: Matkaoppaat, yl. (40.71)
alternative label: Matkustajakotiluettelot (40.71)
alternative label: Minnesmärken, reseguider (40.71) @sv
alternative label: Motellförteckningar (40.71) @sv
alternative label: Motelliluettelot (40.71)
alternative label: Muistomerkit, matkaoppaat (40.71)
alternative label: Museiguider, för turister (40.71) @sv
alternative label: Museo-oppaat, matkailijoille tarkoitetut (40.71)
alternative label: Museot, luettelot ja matkaoppaat (40.71)
alternative label: Muséer, förteckningar och reseguider (40.71) @sv
alternative label: Nationalparker, reseguider (40.71) @sv
alternative label: Naturturism, reseguider (40.71) @sv
alternative label: Nähtävyydet, matkaoppaat (40.71)
alternative label: Omatoimimatkailu, matkaoppaat (40.71)
alternative label: Pizzeriat, luettelot ja matkaoppaat (40.71)
alternative label: Pizzerior, förteckningar och reseguider (40.71) @sv
alternative label: Pubar, förteckningar och reseguider (40.71) @sv
alternative label: Pubit, luettelot ja matkaoppaat (40.71)
alternative label: Ravintolat, luettelot ja matkaoppaat (40.71)
alternative label: Resandehem, kataloger (40.71) @sv
alternative label: Resehandböcker (40.71) @sv
alternative label: Resor på egen hand, reseguider (40.71) @sv
alternative label: Restaurang, förteckningar och reseguider (40.71) @sv
alternative label: Retkeilyalueet (40.71)
alternative label: Retkeilymajaluettelot (40.71)
alternative label: Retkeilyreitit (40.71)
alternative label: Semesterbyförteckningar (40.71) @sv
alternative label: Semesterresor, reseguider (40.71) @sv
alternative label: Seuramatkailu, matkaoppaat (40.71)
alternative label: Sevärdheter, reseguider (40.71) @sv
alternative label: Sightseeing, matkaoppaat (40.71)
alternative label: Sightseeing, reseguider (40.71) @sv
alternative label: Strövområden (40.71) @sv
alternative label: Sällskapsresor, reseguider (40.71) @sv
alternative label: Vandrarhemförteckningar (40.71) @sv
alternative label: Vandringsleder (40.71) @sv
alternative label: Världsarvsobjekt, reseguider (40.71) @sv
broader: Matkailu. Turismi
in scheme: YKL - Yleisten kirjastojen luokitusjärjestelmä
notation: 40.71
preferred label: Allmänna reseguider @sv
preferred label: General travel guides @en
scope note: Allmänna reseguider för turister. Reseguider som rör Europa och en eller flera andra värdsdelar. Hit också allmänna kataloger och guider med förteckningar över sevärdheter, restauranger, campingområden, hotell, motell och vandrarhem. Hit också allmänna museiguider för turister. Hit också allmänna interrailhandböcker. Reseguider och förteckningar över sevärdehete, restauranger, campingområden, hotell, motell och vandrarhem samt museiguider som skildrar enskilda världsdelar, länder eller regioner klassificeras enligt världsdelens, landets eller regionens klass. Verk som behandlar specifika ämnesområden sätts i ämnesområdets klass. @sv
scope note: Matkailijalle tarkoitetut yleiset matkaoppaat. Matkaoppaat, jotka koskevat Eurooppaa ja yhtä tai useampaa muuta maanosaa. Tähän myös yleiset nähtävyys-, ravintola-, leirintäalue-, hotelli-, motelli- ja retkeilymajaluettelot ja -oppaat. Tähän myös matkailijoiden yleiset museo-oppaat. Tähän myös yleiset interrail-oppaat. Tiettyä maanosaa, maata tai aluetta koskevat matkaoppaat, nähtävyys-, ravintola-, leirintäalue-, hotelli-, motelli- ja retkeilymajaluettelot sekä museo-oppaat luokitetaan ko. maanosan, maan tai alueen luokkaan. Maasta tai paikkakunnasta riippumatta luonto-oppaat sijoitetaan luokkaan 56.8. Tiettyä aihealuetta käsittelevät teokset menevät aihealueen luokkaan.

Matkakuvaukset
type: Concept
References: Matkailu. Turismi
References: MUUT MAANOSAT
References: Vesiliikenne
References: Soutu. Melonta. Purjehdus
References: MAAILMANHISTORIA. EUROOPAN HISTORIA
References: SUOMEN HISTORIA
References: POHJOISMAIDEN HISTORIA
References: KESKI-EUROOPAN HISTORIA
References: BRITTEINSAARTEN HISTORIA
References: ETELÄ-EUROOPAN HISTORIA
References: ITÄ-EUROOPAN HISTORIA
References: MUIDEN MAANOSIEN HISTORIA
type: YKL-luokka
alternative label: Forskningsresor (40.8) @sv
alternative label: Jordenruntresor (40.8) @sv
alternative label: Maailmanympärimatkat (40.8)
alternative label: Maailmanympäripurjehdukset (40.8)
alternative label: Matkakertomukset (40.8)
alternative label: Matkakuvaukset (40.8)
alternative label: Matkakuvaukset, merimatkat (40.8)
alternative label: Matkakuvaukset, tutkimusmatkat (40.8)
alternative label: Merimatkat (40.8)
alternative label: Merimatkat, tutkimusmatkat (40.8)
alternative label: Reseberättelser (40.8) @sv
alternative label: Reseskildringar (40.8) @sv
alternative label: Reseskildringar, forskningsresor (40.8) @sv
alternative label: Reseskildringar, sjöresor (40.8) @sv
alternative label: Sjöresor (40.8) @sv
alternative label: Sjöresor, forskningsresor (40.8) @sv
alternative label: Tutkimusmatkat (40.8)
alternative label: Världsomseglingar (40.8) @sv
broader: MAANTIEDE
in scheme: YKL - Yleisten kirjastojen luokitusjärjestelmä
notation: 40.8
preferred label: Reseskildringar @sv
preferred label: Travelogues @en
scope note: Hit reseskildringar som rör Europa samt en eller flera andra världsdelar Sjöfärder i allmänhet. Resor jorden runt. Forskningsresor i allmänhet Forskningsresor inom specialområden klassificeras enligt område Om verket skildrar både sjöresor och segling ges företräde åt klass 40.8 Reseskildringar över enskilda världsdelar, länder eller regioner klassificeras enligt världsdel, land eller region @sv
scope note: Tähän matkakuvaukset, jotka koskevat Eurooppaa ja yhtä tai useampaa muuta maanosaa Merimatkat yleensä. Maailmanympärimatkat. Tutkimusmatkat yleensä Erikoisalojen tutkimusmatkat luokitetaan alan mukaan Jos teoksessa on sekä merimatkan kuvausta että purjehdusta, annetaan etusija luokalle 40.8 Tiettyä maanosaa, maata tai aluetta koskevat matkakuvaukset luokitetaan ko. maanosan, maan tai alueen luokkaan

EUROOPPA
type: Concept
References: SUOMI
References: POHJOISMAAT
References: KESKI-EUROOPPA
References: BRITTEINSAARET
References: ETELÄ-EUROOPPA
References: ITÄ-EUROOPPA
type: YKL-luokka
alternative label: Alpländer, allm. (41) @sv
alternative label: Alppimaat, yl. (41)
alternative label: Arot, aluemaantiede (41 ... 48+)
alternative label: Bergstrakter, regionalgeografi (41 ... 48+) @sv
alternative label: Eurooppa, yl. (41)
alternative label: Europa, allm. (41) @sv
alternative label: Floder, regionalgeografi (41 ... 48+) @sv
alternative label: Gejsrar, regionalgeografi (41 ... 48+) @sv
alternative label: Geysirit, aluemaantiede (41 ... 48+)
alternative label: Glaciärer, regionalgeografi (41 ... 48+) @sv
alternative label: Harjut, aluemaantiede (41 ... 48+)
alternative label: Hav, regionalgeografi (41 ... 48+) @sv
alternative label: Heta källor, regionalgeografi (41 ... 48+) @sv
alternative label: Insjöar, regionalgeografi (41 ... 48+) @sv
alternative label: Itämeren alue, yl. (41)
alternative label: Joet, aluemaantiede (41 ... 48+)
alternative label: Järvet, aluemaantiede (41 ... 48+)
alternative label: Jäätiköt, aluemaantiede (41 ... 48+)
alternative label: Kuumat lähteet, aluemaantiede (41 ... 48+)
alternative label: Länsi-Eurooppa, yl. (41)
alternative label: Meret, aluemaantiede (41 ... 48+)
alternative label: Poimuvuoret, aluemaantiede (41 ... 48+)
alternative label: Saaret, aluemaantiede (41 ... 48+)
alternative label: Sisävedet, aluemaantiede (41 ... 48+)
alternative label: Sjöar, regionalgeografi (41 ... 48+) @sv
alternative label: Stäpper, regionalgeografi (41 ... 48+) @sv
alternative label: Taiga, aluemaantiede (41 ... 48+)
alternative label: Taigan, lokalgeografi (41 ... 48+) @sv
alternative label: Tulivuoret, aluemaantiede (41 ... 48+)
alternative label: Tundra-alueet, aluemaantiede (41 ... 48+)
alternative label: Tundraområden, regionalgeografi (41 ... 48+) @sv
alternative label: Vattendrag, regionalgeografi (41 ... 48+) @sv
alternative label: Veckberg, regionalgeografi (41 ... 48+) @sv
alternative label: Vesistöt, aluemaantiede (41 ... 48+)
alternative label: Vulkaner, regionalgeografi (41 ... 48+) @sv
alternative label: Vuoristot, aluemaantiede (41 ... 48+)
alternative label: Västeuropa, allm. (41) @sv
alternative label: Åsar, regionalgeografi (41 ... 48+) @sv
alternative label: Öar, regionalgeografi (41 ... 48+) @sv
alternative label: Östersjöområdet, allm. (41) @sv
broader: MAANTIEDE. MATKAT. KANSATIEDE
in scheme: YKL - Yleisten kirjastojen luokitusjärjestelmä
notation: 41
preferred label: EUROPA @sv
preferred label: EUROPE @en
scope note: Hit allmänna verk om Europa Hit också allmänna verk om Västeuropa Verk som behandlar både Europa och någon annan världsdel förs till klass 40+ Formtillägget 09 används inte i samband med klasserna 41-48.62 @sv
scope note: Tähän Eurooppaa koskevat yleisteokset Tähän myös Länsi-Eurooppaa koskevat yleisteokset Teokset, jotka koskevat sekä Eurooppaa että jotakin muuta maanosaa, sijoitetaan luokkaan 40+ Muotoluokkaa 09 ei käytetä luokkien 41-48.62 yhteydessä

SUOMI
type: Concept
References: POHJOISMAAT
References: Suomen historia, paikallishistoria
type: YKL-luokka
alternative label: Arot, aluemaantiede (41 ... 48+)
alternative label: Bergstrakter, regionalgeografi (41 ... 48+) @sv
alternative label: Etelä-Suomen lääni (42+)
alternative label: Finland (42) @sv
alternative label: Finlandssvenska bosättningsområden (42+) @sv
alternative label: Floder, regionalgeografi (41 ... 48+) @sv
alternative label: Gejsrar, regionalgeografi (41 ... 48+) @sv
alternative label: Geysirit, aluemaantiede (41 ... 48+)
alternative label: Glaciärer, regionalgeografi (41 ... 48+) @sv
alternative label: Harjut, aluemaantiede (41 ... 48+)
alternative label: Hav, regionalgeografi (41 ... 48+) @sv
alternative label: Heta källor, regionalgeografi (41 ... 48+) @sv
alternative label: Insjöar, regionalgeografi (41 ... 48+) @sv
alternative label: Itä-Suomen lääni (42+)
alternative label: Joet, aluemaantiede (41 ... 48+)
alternative label: Järvet, aluemaantiede (41 ... 48+)
alternative label: Jäätiköt, aluemaantiede (41 ... 48+)
alternative label: Kommuner, Finlands geografi (42+) @sv
alternative label: Kunnat, Suomen maantiede (42+)
alternative label: Kuumat lähteet, aluemaantiede (41 ... 48+)
alternative label: Landskap, geografi, Finland (42+) @sv
alternative label: Län, geografi, Finland (42+) @sv
alternative label: Läänit, maantiede, Suomi (42+)
alternative label: Maakunnat, maantiede, Suomi (42+)
alternative label: Meret, aluemaantiede (41 ... 48+)
alternative label: Pitäjät, Suomen maantiede (42+)
alternative label: Poimuvuoret, aluemaantiede (41 ... 48+)
alternative label: Saaret, aluemaantiede (41 ... 48+)
alternative label: Sisävedet, aluemaantiede (41 ... 48+)
alternative label: Sjöar, regionalgeografi (41 ... 48+) @sv
alternative label: Socknar, Finlands geografi (42+) @sv
alternative label: Stäpper, regionalgeografi (41 ... 48+) @sv
alternative label: Suomenruotsalaisten asuma-alueet (42+)
alternative label: Suomi (42)
alternative label: Södra Finlands län (42+) @sv
alternative label: Taiga, aluemaantiede (41 ... 48+)
alternative label: Taigan, lokalgeografi (41 ... 48+) @sv
alternative label: Tulivuoret, aluemaantiede (41 ... 48+)
alternative label: Tundra-alueet, aluemaantiede (41 ... 48+)
alternative label: Tundraområden, regionalgeografi (41 ... 48+) @sv
alternative label: Vattendrag, regionalgeografi (41 ... 48+) @sv
alternative label: Veckberg, regionalgeografi (41 ... 48+) @sv
alternative label: Vesistöt, aluemaantiede (41 ... 48+)
alternative label: Vulkaner, regionalgeografi (41 ... 48+) @sv
alternative label: Vuoristot, aluemaantiede (41 ... 48+)
alternative label: Åsar, regionalgeografi (41 ... 48+) @sv
alternative label: Öar, regionalgeografi (41 ... 48+) @sv
alternative label: Östra Finlands län (42+) @sv
broader: MAANTIEDE. MATKAT. KANSATIEDE
in scheme: YKL - Yleisten kirjastojen luokitusjärjestelmä
narrower: Egentliga Finland
narrower: Ahvenanmaa
narrower: Nyland
narrower: Häme. Pirkanmaa. Keski-Suomi
narrower: Satakunda
narrower: Savo
narrower: Karjala. Kymenlaakso
narrower: Pohjanmaa. Kainuu
narrower: Lappi
notation: 42
preferred label: FINLAND @en
scope note: Hit allmänna verk om Finland samt verk som behandlar Södra, Västra eller Östra Finlands län i allmänhet. Hit också allmänna verk om Finlands geografi. Hit och till underklasserna också reseguider över Finland. Om verket behandlar både geografi och lokalhistoria eller hembygdsforskning, ges företräde åt klass 42+. Verk som rör både Finland och övriga Norden förs till klass 43. Formtillägget 09 används inte i samband med klasserna 41-48.62 @sv
scope note: Tähän Suomea koskevat yleisteokset sekä teokset, jotka koskevat Etelä-, Länsi- tai Itä-Suomen lääniä yleensä. Tähän myös Suomen maantieteen yleisteokset. Tähän ja alaluokkiin myös Suomea koskevat matkaoppaat. Jos teoksessa on sekä maantiedettä että paikallis- historiaa tai kotiseutututkimusta, annetaan etusija luokalle 42+. Teokset, jotka koskevat sekä Suomea että muita Pohjoismaita, sijoitetaan luokkaan 43. Muotoluokkaa 09 ei käytetä luokkien 41-48.62 yhteydessä

Egentliga Finland
type: Concept
type: YKL-luokka
alternative label: Egentliga Finland (42.1) @sv
alternative label: Turku (42.1)
alternative label: Turun ja Porin lääni, Varsinais-Suomi (42.1)
alternative label: Varsinais-Suomi (42.1)
alternative label: Åbo (42.1) @sv
alternative label: Åbo och Björneborgs län, Egentliga Finland (42.1) @sv
broader: SUOMI
in scheme: YKL - Yleisten kirjastojen luokitusjärjestelmä
notation: 42.1
preferred label: Varsinais-Suomi

Ahvenanmaa
type: Concept
type: YKL-luokka
alternative label: Ahvenanmaa (42.2)
alternative label: Åland (42.2) @sv
broader: SUOMI
in scheme: YKL - Yleisten kirjastojen luokitusjärjestelmä
notation: 42.2
preferred label: Aland @en
preferred label: Åland @sv

Nyland
type: Concept
type: YKL-luokka
alternative label: Keski-Uusimaa (42.3+)
alternative label: Mellannyland (42.3+) @sv
alternative label: Nyland (42.3+) @sv
alternative label: Nylands län (42.3+) @sv
alternative label: Uudenmaan lääni (42.3+)
alternative label: Uusimaa (42.3+)
broader: SUOMI
in scheme: YKL - Yleisten kirjastojen luokitusjärjestelmä
narrower: Läntinen Uusimaa
narrower: Pääkaupunkiseutu
narrower: Itä-Uusimaa
notation: 42.3
preferred label: Uusimaa
scope note: Landskapet Nyland från och med år 1997 Verk som behandlar Nyland @sv
scope note: Uudenmaan maakunta vuoteen 1997 Teokset, jotka koskevat Uuttamaata

Läntinen Uusimaa
type: Concept
type: YKL-luokka
alternative label: Läntinen Uusimaa (42.31)
alternative label: Porkala (42.31) @sv
alternative label: Porkkala (42.31)
alternative label: Västra Nyland (42.31) @sv
broader: Nyland
in scheme: YKL - Yleisten kirjastojen luokitusjärjestelmä
notation: 42.31
preferred label: Västra Nyland @sv
preferred label: Western Uusimaa @en
scope note: Landskapet Nyland från och med år 1997 Verk som behandlar Västra Nyland och huvudstadsregionen @sv
scope note: Uudenmaan maakunta vuodesta 1997 Teokset, jotka koskevat läntistä Uuttamaata ja pääkaupunkiseutua

Pääkaupunkiseutu
type: Concept
type: YKL-luokka
alternative label: Esbo (42.33) @sv
alternative label: Espoo (42.33)
alternative label: Grankulla (42.33) @sv
alternative label: Helsingfors (42.33) @sv
alternative label: Helsinki (42.33)
alternative label: Huvudstadsregionen (42.33) @sv
alternative label: Kauniainen (42.33)
alternative label: Pääkaupunkiseutu (42.33)
alternative label: Vanda (42.33) @sv
alternative label: Vantaa (42.33)
broader: Nyland
in scheme: YKL - Yleisten kirjastojen luokitusjärjestelmä
notation: 42.33
preferred label: Helsinki metropolitan area @en
preferred label: Huvudstadsregionen @sv
scope note: Helsingfors. Esbo. Vanda. Grankulla @sv
scope note: Helsinki. Espoo. Vantaa. Kauniainen

Itä-Uusimaa
type: Concept
type: YKL-luokka
alternative label: Itä-Uusimaa (42.34)
alternative label: Östra Nyland (42.34) @sv
broader: Nyland
in scheme: YKL - Yleisten kirjastojen luokitusjärjestelmä
notation: 42.34
preferred label: Eastern Uusimaa @en
preferred label: Östra Nyland @sv

Häme. Pirkanmaa. Keski-Suomi
type: Concept
type: YKL-luokka
alternative label: Häme (42.4+)
alternative label: Hämeen lääni (42.4)
alternative label: Tammerfors (42.4) @sv
alternative label: Tampere (42.4)
alternative label: Tavastehus län (42.4) @sv
alternative label: Tavastland (42.4+) @sv
broader: SUOMI
in scheme: YKL - Yleisten kirjastojen luokitusjärjestelmä
narrower: Centrala Tavastland
narrower: Päijät-Häme
narrower: Birkaland
narrower: Keski-Suomi
notation: 42.4
preferred label: Häme. Pirkanmaa. Central Finland @en
preferred label: Tavastland. Birkaland. Mellersta Finland @sv
scope note: Tähän teokset, jotka koskevat sekä Hämettä että Keski-Suomea
scope note: Verk som behandlar Tavastland och Mellersta Finland @sv

Centrala Tavastland
type: Concept
type: YKL-luokka
alternative label: Centrala Tavastland (42.41) @sv
alternative label: Kanta-Häme (42.41)
broader: Häme. Pirkanmaa. Keski-Suomi
in scheme: YKL - Yleisten kirjastojen luokitusjärjestelmä
notation: 42.41
preferred label: Kanta-Häme

Päijät-Häme
type: Concept
type: YKL-luokka
alternative label: Päijät-Häme (42.42)
alternative label: Östra Tavastland (42.42) @sv
broader: Häme. Pirkanmaa. Keski-Suomi
in scheme: YKL - Yleisten kirjastojen luokitusjärjestelmä
notation: 42.42
preferred label: Östra Tavastland @sv

Birkaland
type: Concept
type: YKL-luokka
alternative label: Birkaland (42.43) @sv
alternative label: Pirkanmaa (42.43)
broader: Häme. Pirkanmaa. Keski-Suomi
in scheme: YKL - Yleisten kirjastojen luokitusjärjestelmä
notation: 42.43
preferred label: Pirkanmaa

Keski-Suomi
type: Concept
type: YKL-luokka
alternative label: Keski-Suomen lääni (42.45)
alternative label: Keski-Suomi (42.45)
alternative label: Mellersta Finland (42.45) @sv
alternative label: Mellersta Finlands län (42.45) @sv
broader: Häme. Pirkanmaa. Keski-Suomi
in scheme: YKL - Yleisten kirjastojen luokitusjärjestelmä
notation: 42.45
preferred label: Central Finland @en
preferred label: Mellersta Finland @sv

Satakunda
type: Concept
type: YKL-luokka
alternative label: Satakunda (42.5) @sv
alternative label: Satakunta (42.5)
alternative label: Turun ja Porin lääni, Satakunta (42.5)
alternative label: Åbo och Björneborgs län, Satakunda (42.5) @sv
broader: SUOMI
in scheme: YKL - Yleisten kirjastojen luokitusjärjestelmä
notation: 42.5
preferred label: Satakunta

Savo
type: Concept
type: YKL-luokka
alternative label: Savo (42.6+)
alternative label: Savolax (42.6+) @sv
broader: SUOMI
in scheme: YKL - Yleisten kirjastojen luokitusjärjestelmä
narrower: Etelä-Savo
narrower: Pohjois-Savo
notation: 42.6
preferred label: Savolax @sv

Etelä-Savo
type: Concept
type: YKL-luokka
alternative label: Etelä-Savo (42.61)
alternative label: Mikkelin lääni (42.61)
alternative label: S:t Michels län (42.61) @sv
alternative label: Södra Savolax (42.61) @sv
broader: Savo
in scheme: YKL - Yleisten kirjastojen luokitusjärjestelmä
notation: 42.61
preferred label: South Savo @en
preferred label: Södra Savolax @sv

Pohjois-Savo
type: Concept
type: YKL-luokka
alternative label: Kuopio län (42.62) @sv
alternative label: Kuopion lääni (42.62)
alternative label: Norra Savolax (42.62) @sv
alternative label: Pohjois-Savo (42.62)
broader: Savo
in scheme: YKL - Yleisten kirjastojen luokitusjärjestelmä
notation: 42.62
preferred label: Norra Savolax @sv
preferred label: North Savo @en

Karjala. Kymenlaakso
type: Concept
References: Venäjä
References: Karjalan Tasavalta
type: YKL-luokka
alternative label: Avträdda områden, Karelen, till år 1944 (42.7) @sv
alternative label: Hogland, till år 1944 (42.7) @sv
alternative label: Karelen, Finland (42.7+) @sv
alternative label: Karelen, det avträdda Karelen till år 1944 (42.7) @sv
alternative label: Karelen, det avträdda Karelen, till år 1944 (42.7) @sv
alternative label: Karelska näset, till år 1944 (42.7) @sv
alternative label: Karjala, Suomi (42.7+)
alternative label: Karjala, luovutettu Karjala vuoteen 1944 (42.7)
alternative label: Karjalan kannas, vuoteen 1944 (42.7)
alternative label: Lavansaari, vuoteen 1944 (42.7)
alternative label: Luovutettu Karjala, vuoteen 1944 (42.7)
alternative label: Luovutetut alueet, Karjala, vuoteen 1944 (42.7)
alternative label: Lövskär, till år 1944 (42.7) @sv
alternative label: Seiskari, vuoteen 1944 (42.7)
alternative label: Seitskär, till år 1944 (42.7) @sv
alternative label: Suursaari, vuoteen 1944 (42.7)
alternative label: Tyterskär, till år 1944 (42.7) @sv
alternative label: Tytärsaari, vuoteen 1944 (42.7)
alternative label: Viborg, till år 1944 (42.7) @sv
alternative label: Viborgs län, till år 1944 (42.7) @sv
alternative label: Viipuri, vuoteen 1944 (42.7)
alternative label: Viipurin lääni, vuoteen 1944 (42.7)
broader: SUOMI
in scheme: YKL - Yleisten kirjastojen luokitusjärjestelmä
narrower: Etelä-Karjala
narrower: Kymenlaakso
narrower: Pohjois-Karjala
notation: 42.7
preferred label: Karelen. Kymmenedalen @sv
preferred label: Karelia. Kymenlaakso @en
scope note: Hit också det avträdda Karelen till år 1944 @sv
scope note: Tähän myös luovutettu Karjalan alue vuoteen 1944

Etelä-Karjala
type: Concept
type: YKL-luokka
alternative label: Etelä-Karjala (42.74)
alternative label: Södra Karelen (42.74) @sv
broader: Karjala. Kymenlaakso
in scheme: YKL - Yleisten kirjastojen luokitusjärjestelmä
notation: 42.74
preferred label: South Karelia @en
preferred label: Södra Karelen @sv

Kymenlaakso
type: Concept
type: YKL-luokka
alternative label: Kymen lääni (42.75)
alternative label: Kymenlaakso (42.75)
alternative label: Kymmene län (42.75) @sv
alternative label: Kymmenedalen (42.75) @sv
broader: Karjala. Kymenlaakso
in scheme: YKL - Yleisten kirjastojen luokitusjärjestelmä
notation: 42.75
preferred label: Kymmenedalen @sv

Pohjois-Karjala
type: Concept
type: YKL-luokka
alternative label: Norra Karelen (42.76) @sv
alternative label: Norra Karelens län (42.76) @sv
alternative label: Pohjois-Karjala (42.76)
alternative label: Pohjois-Karjalan lääni (42.76)
broader: Karjala. Kymenlaakso
in scheme: YKL - Yleisten kirjastojen luokitusjärjestelmä
notation: 42.76
preferred label: Norra Karelen @sv
preferred label: North Karelia @en

Pohjanmaa. Kainuu
type: Concept
type: YKL-luokka
alternative label: Oulun lääni (42.8+)
alternative label: Pohjanmaa (42.8+)
alternative label: Uleåborgs län (42.8+) @sv
alternative label: Vaasan lääni (42.8)
alternative label: Vasa län (42.8) @sv
alternative label: Österbotten (42.8+) @sv
broader: SUOMI
in scheme: YKL - Yleisten kirjastojen luokitusjärjestelmä
narrower: Pohjanmaan maakunta
narrower: Pohjois-Pohjanmaa
narrower: Keski-Pohjanmaa
narrower: Etelä-Pohjanmaa
narrower: Kainuu
notation: 42.8
preferred label: Ostrobothnia. Kainuu @en
preferred label: Österbotten. Kajanaland @sv
scope note: Oulun lääni
scope note: Uleåborgs län @sv

Pohjanmaan maakunta
type: Concept
type: YKL-luokka
broader: Pohjanmaa. Kainuu
in scheme: YKL - Yleisten kirjastojen luokitusjärjestelmä
notation: 42.81
preferred label: Ostrobothnia @en
preferred label: Österbotten @sv

Pohjois-Pohjanmaa
type: Concept
type: YKL-luokka
alternative label: Koillismaa (42.82)
alternative label: Nordöstra Österbotten (42.82) @sv
alternative label: Norra Österbotten (42.82) @sv
alternative label: Pohjois-Pohjanmaa (42.82)
broader: Pohjanmaa. Kainuu
in scheme: YKL - Yleisten kirjastojen luokitusjärjestelmä
notation: 42.82
preferred label: Norra Österbotten @sv
preferred label: North Ostrobothnia @en

Keski-Pohjanmaa
type: Concept
type: YKL-luokka
alternative label: Keski-Pohjanmaa (42.83)
alternative label: Mellersta Österbotten (42.83) @sv
broader: Pohjanmaa. Kainuu
in scheme: YKL - Yleisten kirjastojen luokitusjärjestelmä
notation: 42.83
preferred label: Central Ostrobothnia @en
preferred label: Mellersta Österbotten @sv

Etelä-Pohjanmaa
type: Concept
type: YKL-luokka
alternative label: Etelä-Pohjanmaa (42.84)
alternative label: Sydösterbotten (42.84) @sv
broader: Pohjanmaa. Kainuu
in scheme: YKL - Yleisten kirjastojen luokitusjärjestelmä
notation: 42.84
preferred label: South Ostrobothnia @en
preferred label: Södra Österbotten @sv

Kainuu
type: Concept
type: YKL-luokka
alternative label: Kainuu (42.85)
alternative label: Kajanaland (42.85) @sv
broader: Pohjanmaa. Kainuu
in scheme: YKL - Yleisten kirjastojen luokitusjärjestelmä
notation: 42.85
preferred label: Kajanaland @sv

Lappi
type: Concept
References: Ruotsi
References: Norja
References: Pohjoiskalotti
References: Venäjä
type: YKL-luokka
alternative label: Avträdda områden, Salla och Petsamo, till år 1944 (42.9) @sv
alternative label: Lapin lääni (42.9)
alternative label: Lappi, Suomen (42.9)
alternative label: Lappland, finska (42.9) @sv
alternative label: Lapplands län (42.9) @sv
alternative label: Luovutetut alueet, Salla ja Petsamo, vuoteen 1944 (42.9)
alternative label: Petsamo, till år 1944 (42.9) @sv
alternative label: Petsamo, vuoteen 1944 (42.9)
alternative label: Sallan alue, vuoteen 1944 (42.9)
alternative label: Sallaområdet, till år 1944 (42.9) @sv
broader: SUOMI
in scheme: YKL - Yleisten kirjastojen luokitusjärjestelmä
notation: 42.9
preferred label: Lapland @en
preferred label: Lappland @sv
scope note: Lapin lääni Tähän myös luovutetut Petsamon ja Sallan alueet vuoteen 1944
scope note: Lapplands län Hit också de avträdda Petsamo- och Sallaområdena till år 1944 @sv

POHJOISMAAT
type: Concept
References: SUOMI
type: YKL-luokka
alternative label: Arot, aluemaantiede (41 ... 48+)
alternative label: Bergstrakter, regionalgeografi (41 ... 48+) @sv
alternative label: Fennoskandia, yl. (43)
alternative label: Fennoskandien, allm. (43) @sv
alternative label: Floder, regionalgeografi (41 ... 48+) @sv
alternative label: Gejsrar, regionalgeografi (41 ... 48+) @sv
alternative label: Geysirit, aluemaantiede (41 ... 48+)
alternative label: Glaciärer, regionalgeografi (41 ... 48+) @sv
alternative label: Harjut, aluemaantiede (41 ... 48+)
alternative label: Hav, regionalgeografi (41 ... 48+) @sv
alternative label: Heta källor, regionalgeografi (41 ... 48+) @sv
alternative label: Insjöar, regionalgeografi (41 ... 48+) @sv
alternative label: Joet, aluemaantiede (41 ... 48+)
alternative label: Järvet, aluemaantiede (41 ... 48+)
alternative label: Jäätiköt, aluemaantiede (41 ... 48+)
alternative label: Kuumat lähteet, aluemaantiede (41 ... 48+)
alternative label: Meret, aluemaantiede (41 ... 48+)
alternative label: Norden, allm. (43) @sv
alternative label: Pohjoismaat, yl. (43)
alternative label: Poimuvuoret, aluemaantiede (41 ... 48+)
alternative label: Saaret, aluemaantiede (41 ... 48+)
alternative label: Sisävedet, aluemaantiede (41 ... 48+)
alternative label: Sjöar, regionalgeografi (41 ... 48+) @sv
alternative label: Skandinavia (43+)
alternative label: Skandinavien (43+) @sv
alternative label: Stäpper, regionalgeografi (41 ... 48+) @sv
alternative label: Taiga, aluemaantiede (41 ... 48+)
alternative label: Taigan, lokalgeografi (41 ... 48+) @sv
alternative label: Tulivuoret, aluemaantiede (41 ... 48+)
alternative label: Tundra-alueet, aluemaantiede (41 ... 48+)
alternative label: Tundraområden, regionalgeografi (41 ... 48+) @sv
alternative label: Vattendrag, regionalgeografi (41 ... 48+) @sv
alternative label: Veckberg, regionalgeografi (41 ... 48+) @sv
alternative label: Vesistöt, aluemaantiede (41 ... 48+)
alternative label: Vulkaner, regionalgeografi (41 ... 48+) @sv
alternative label: Vuoristot, aluemaantiede (41 ... 48+)
alternative label: Åsar, regionalgeografi (41 ... 48+) @sv
alternative label: Öar, regionalgeografi (41 ... 48+) @sv
broader: MAANTIEDE. MATKAT. KANSATIEDE
in scheme: YKL - Yleisten kirjastojen luokitusjärjestelmä
narrower: Ruotsi
narrower: Norja
narrower: Tanska
narrower: Islanti
narrower: Pohjoiskalotti
notation: 43
preferred label: NORDEN @sv
preferred label: NORDIC COUNTRIES @en
scope note: Hit allmänna verk om Norden eller Skandinavien Hit också verk som rör flera nordiska länder, även Finland Formtillägget 09 används inte i samband med klasserna 41-48.62 @sv
scope note: Tähän Pohjoismaita tai Skandinaviaa koskevat yleisteokset Tähän myös teokset, jotka koskevat useampia Pohjoismaita, myös Suomea Muotoluokkaa 09 ei käytetä luokkien 41-48.62 yhteydessä

Ruotsi
type: Concept
type: YKL-luokka
alternative label: Lappi, Ruotsin (43.1)
alternative label: Lappland, svenska (43.1) @sv
alternative label: Ruotsi (43.1+)
alternative label: Sverige (43.1+) @sv
broader: POHJOISMAAT
in scheme: YKL - Yleisten kirjastojen luokitusjärjestelmä
narrower: Tukholma
notation: 43.1
preferred label: Sverige @sv
preferred label: Sweden @en

Tukholma
type: Concept
type: YKL-luokka
alternative label: Stockholm (43.11) @sv
alternative label: Tukholma (43.11)
broader: Ruotsi
in scheme: YKL - Yleisten kirjastojen luokitusjärjestelmä
notation: 43.11
preferred label: Stockholm @en

Norja
type: Concept
References: Pohjoiset napamaat. Arktis
type: YKL-luokka
alternative label: Finnmarken (43.2) @sv
alternative label: Lappi, Norjan (43.2)
alternative label: Lappland, norska (43.2) @sv
alternative label: Norge (43.2+) @sv
alternative label: Norja (43.2+)
alternative label: Ruija (43.2)
broader: POHJOISMAAT
in scheme: YKL - Yleisten kirjastojen luokitusjärjestelmä
narrower: Oslo
notation: 43.2
preferred label: Norge @sv
preferred label: Norway @en

Oslo
type: Concept
type: YKL-luokka
alternative label: Oslo (43.21)
broader: Norja
in scheme: YKL - Yleisten kirjastojen luokitusjärjestelmä
notation: 43.21

Tanska
type: Concept
References: Pohjoiset napamaat. Arktis
type: YKL-luokka
alternative label: Danmark (43.3+) @sv
alternative label: Tanska (43.3+)
broader: POHJOISMAAT
in scheme: YKL - Yleisten kirjastojen luokitusjärjestelmä
narrower: Kööpenhamina
narrower: Färsaaret
notation: 43.3
preferred label: Danmark @sv
preferred label: Denmark @en

Kööpenhamina
type: Concept
type: YKL-luokka
alternative label: Köpenhamn (43.31) @sv
alternative label: Kööpenhamina (43.31)
broader: Tanska
in scheme: YKL - Yleisten kirjastojen luokitusjärjestelmä
notation: 43.31
preferred label: Copenhagen @en
preferred label: Köpenhamn @sv

Färsaaret
type: Concept
type: YKL-luokka
alternative label: Färsaaret (43.32)
alternative label: Färöarna (43.32) @sv
broader: Tanska
in scheme: YKL - Yleisten kirjastojen luokitusjärjestelmä
notation: 43.32
preferred label: Faeroe Islands @en
preferred label: Färöarna @sv

Islanti
type: Concept
type: YKL-luokka
alternative label: Island (43.4) @sv
alternative label: Islanti (43.4)
broader: POHJOISMAAT
in scheme: YKL - Yleisten kirjastojen luokitusjärjestelmä
notation: 43.4
preferred label: Iceland @en
preferred label: Island @sv

Pohjoiskalotti
type: Concept
References: Lappi
References: Ruotsi
References: Norja
References: Venäjä
type: YKL-luokka
alternative label: Lappi (43.5)
alternative label: Lappland (43.5) @sv
alternative label: Nordkalotten (43.5) @sv
alternative label: Pohjoiskalotti (43.5)
broader: POHJOISMAAT
in scheme: YKL - Yleisten kirjastojen luokitusjärjestelmä
notation: 43.5
preferred label: Nordkalotten @sv
preferred label: The arctic area of the Nordic countries @en
scope note: Hit allmänna verk om Nordkalotten @sv
scope note: Tähän Pohjoiskalottia koskevat yleisteokset

KESKI-EUROOPPA
type: Concept
References: Ranska
References: Puola
type: YKL-luokka
alternative label: Arot, aluemaantiede (41 ... 48+)
alternative label: Bergstrakter, regionalgeografi (41 ... 48+) @sv
alternative label: Floder, regionalgeografi (41 ... 48+) @sv
alternative label: Gejsrar, regionalgeografi (41 ... 48+) @sv
alternative label: Geysirit, aluemaantiede (41 ... 48+)
alternative label: Glaciärer, regionalgeografi (41 ... 48+) @sv
alternative label: Harjut, aluemaantiede (41 ... 48+)
alternative label: Hav, regionalgeografi (41 ... 48+) @sv
alternative label: Heta källor, regionalgeografi (41 ... 48+) @sv
alternative label: Insjöar, regionalgeografi (41 ... 48+) @sv
alternative label: Joet, aluemaantiede (41 ... 48+)
alternative label: Järvet, aluemaantiede (41 ... 48+)
alternative label: Jäätiköt, aluemaantiede (41 ... 48+)
alternative label: Keski-Eurooppa (44+)
alternative label: Kuumat lähteet, aluemaantiede (41 ... 48+)
alternative label: Mellaneuropa (44+) @sv
alternative label: Meret, aluemaantiede (41 ... 48+)
alternative label: Poimuvuoret, aluemaantiede (41 ... 48+)
alternative label: Saaret, aluemaantiede (41 ... 48+)
alternative label: Sisävedet, aluemaantiede (41 ... 48+)
alternative label: Sjöar, regionalgeografi (41 ... 48+) @sv
alternative label: Stäpper, regionalgeografi (41 ... 48+) @sv
alternative label: Taiga, aluemaantiede (41 ... 48+)
alternative label: Taigan, lokalgeografi (41 ... 48+) @sv
alternative label: Tulivuoret, aluemaantiede (41 ... 48+)
alternative label: Tundra-alueet, aluemaantiede (41 ... 48+)
alternative label: Tundraområden, regionalgeografi (41 ... 48+) @sv
alternative label: Vattendrag, regionalgeografi (41 ... 48+) @sv
alternative label: Veckberg, regionalgeografi (41 ... 48+) @sv
alternative label: Vesistöt, aluemaantiede (41 ... 48+)
alternative label: Vulkaner, regionalgeografi (41 ... 48+) @sv
alternative label: Vuoristot, aluemaantiede (41 ... 48+)
alternative label: Åsar, regionalgeografi (41 ... 48+) @sv
alternative label: Öar, regionalgeografi (41 ... 48+) @sv
broader: MAANTIEDE. MATKAT. KANSATIEDE
in scheme: YKL - Yleisten kirjastojen luokitusjärjestelmä
narrower: Saksa
narrower: Tšekki. Slovakia
narrower: Itävalta
narrower: Unkari
narrower: Sveitsi
narrower: Liechtenstein
narrower: Benelux-maat
notation: 44
preferred label: CENTRAL EUROPE @en
preferred label: MELLANEUROPA @sv
scope note: Hit allmänna verk om Mellaneuropa Formtillägget 09 används inte i samband med klasserna 41-48.62 @sv
scope note: Tähän Keski-Eurooppaa koskevat yleisteokset Muotoluokkaa 09 ei käytetä luokkien 41-48.62 yhteydessä

Saksa
type: Concept
type: YKL-luokka
alternative label: BRD (44.1+)
alternative label: Danzig, till året 1945 (44.1) @sv
alternative label: Danzig, vuoteen 1945 (44.1)
alternative label: Saksa (44.1+)
alternative label: Saksan liittotasavalta (44.1+)
alternative label: Tyska förbundsrepubliken (44.1+) @sv
alternative label: Tyskland (44.1+) @sv
broader: KESKI-EUROOPPA
in scheme: YKL - Yleisten kirjastojen luokitusjärjestelmä
narrower: Berliini
notation: 44.1
preferred label: Germany @en
preferred label: Tyskland @sv

Berliini
type: Concept
type: YKL-luokka
alternative label: Berliini (44.11)
alternative label: Berlin (44.11) @sv
broader: Saksa
in scheme: YKL - Yleisten kirjastojen luokitusjärjestelmä
notation: 44.11
preferred label: Berlin @en

Tšekki. Slovakia
type: Concept
type: YKL-luokka
broader: KESKI-EUROOPPA
in scheme: YKL - Yleisten kirjastojen luokitusjärjestelmä
narrower: Tšekki
narrower: Slovakia
notation: 44.3
preferred label: Czech Republic. Slovakia @en
preferred label: Tjeckien. Slovakien @sv

Tšekki
type: Concept
type: YKL-luokka
alternative label: Tjeckien (44.31) @sv
alternative label: Tšekki (44.31)
broader: Tšekki. Slovakia
in scheme: YKL - Yleisten kirjastojen luokitusjärjestelmä
notation: 44.31
preferred label: Czech Republic @en
preferred label: Tjeckien @sv

Slovakia
type: Concept
type: YKL-luokka
alternative label: Slovakia (44.32)
alternative label: Slovakien (44.32) @sv
broader: Tšekki. Slovakia
in scheme: YKL - Yleisten kirjastojen luokitusjärjestelmä
notation: 44.32
preferred label: Slovakien @sv

Itävalta
type: Concept
type: YKL-luokka
alternative label: Itävalta (44.4)
alternative label: Österrike (44.4) @sv
broader: KESKI-EUROOPPA
in scheme: YKL - Yleisten kirjastojen luokitusjärjestelmä
notation: 44.4
preferred label: Austria @en
preferred label: Österrike @sv

Unkari
type: Concept
type: YKL-luokka
alternative label: Ungern (44.5) @sv
alternative label: Unkari (44.5)
broader: KESKI-EUROOPPA
in scheme: YKL - Yleisten kirjastojen luokitusjärjestelmä
notation: 44.5
preferred label: Hungary @en
preferred label: Ungern @sv

Sveitsi
type: Concept
type: YKL-luokka
alternative label: Schweiz (44.6) @sv
alternative label: Sveitsi (44.6)
broader: KESKI-EUROOPPA
in scheme: YKL - Yleisten kirjastojen luokitusjärjestelmä
notation: 44.6
preferred label: Schweiz @sv
preferred label: Switzerland @en

Liechtenstein
type: Concept
type: YKL-luokka
alternative label: Liechtenstein (44.7)
broader: KESKI-EUROOPPA
in scheme: YKL - Yleisten kirjastojen luokitusjärjestelmä
notation: 44.7

Benelux-maat
type: Concept
type: YKL-luokka
alternative label: Benelux-länder (44.8+) @sv
alternative label: Benelux-maat (44.8+)
broader: KESKI-EUROOPPA
in scheme: YKL - Yleisten kirjastojen luokitusjärjestelmä
narrower: Belgia
narrower: Alankomaat
narrower: Luxemburg
notation: 44.8
preferred label: Benelux countries @en
preferred label: Beneluxländerna @sv

Belgia
type: Concept
type: YKL-luokka
alternative label: Belgia (44.81)
alternative label: Belgien (44.81) @sv
broader: Benelux-maat
in scheme: YKL - Yleisten kirjastojen luokitusjärjestelmä
notation: 44.81
preferred label: Belgien @sv
preferred label: Belgium @en

Alankomaat
type: Concept
type: YKL-luokka
alternative label: Alankomaat (44.82)
alternative label: Holland (44.82) @sv
alternative label: Hollanti (44.82)
alternative label: Nederländerna (44.82) @sv
broader: Benelux-maat
in scheme: YKL - Yleisten kirjastojen luokitusjärjestelmä
notation: 44.82
preferred label: Nederländerna @sv
preferred label: Netherlands @en

Luxemburg
type: Concept
type: YKL-luokka
alternative label: Luxemburg (44.83)
broader: Benelux-maat
in scheme: YKL - Yleisten kirjastojen luokitusjärjestelmä
notation: 44.83
preferred label: Luxembourg @en

BRITTEINSAARET
type: Concept
type: YKL-luokka
alternative label: Arot, aluemaantiede (41 ... 48+)
alternative label: Bergstrakter, regionalgeografi (41 ... 48+) @sv
alternative label: Britteinsaaret (45+)
alternative label: Brittiska öarna (45+) @sv
alternative label: Floder, regionalgeografi (41 ... 48+) @sv
alternative label: Gejsrar, regionalgeografi (41 ... 48+) @sv
alternative label: Geysirit, aluemaantiede (41 ... 48+)
alternative label: Glaciärer, regionalgeografi (41 ... 48+) @sv
alternative label: Harjut, aluemaantiede (41 ... 48+)
alternative label: Hav, regionalgeografi (41 ... 48+) @sv
alternative label: Heta källor, regionalgeografi (41 ... 48+) @sv
alternative label: Insjöar, regionalgeografi (41 ... 48+) @sv
alternative label: Joet, aluemaantiede (41 ... 48+)
alternative label: Järvet, aluemaantiede (41 ... 48+)
alternative label: Jäätiköt, aluemaantiede (41 ... 48+)
alternative label: Kuumat lähteet, aluemaantiede (41 ... 48+)
alternative label: Meret, aluemaantiede (41 ... 48+)
alternative label: Poimuvuoret, aluemaantiede (41 ... 48+)
alternative label: Saaret, aluemaantiede (41 ... 48+)
alternative label: Sisävedet, aluemaantiede (41 ... 48+)
alternative label: Sjöar, regionalgeografi (41 ... 48+) @sv
alternative label: Stäpper, regionalgeografi (41 ... 48+) @sv
alternative label: Taiga, aluemaantiede (41 ... 48+)
alternative label: Taigan, lokalgeografi (41 ... 48+) @sv
alternative label: Tulivuoret, aluemaantiede (41 ... 48+)
alternative label: Tundra-alueet, aluemaantiede (41 ... 48+)
alternative label: Tundraområden, regionalgeografi (41 ... 48+) @sv
alternative label: Vattendrag, regionalgeografi (41 ... 48+) @sv
alternative label: Veckberg, regionalgeografi (41 ... 48+) @sv
alternative label: Vesistöt, aluemaantiede (41 ... 48+)
alternative label: Vulkaner, regionalgeografi (41 ... 48+) @sv
alternative label: Vuoristot, aluemaantiede (41 ... 48+)
alternative label: Åsar, regionalgeografi (41 ... 48+) @sv
alternative label: Öar, regionalgeografi (41 ... 48+) @sv
broader: MAANTIEDE. MATKAT. KANSATIEDE
in scheme: YKL - Yleisten kirjastojen luokitusjärjestelmä
narrower: Iso-Britannia
narrower: Irlanti
notation: 45
preferred label: BRITISH ISLES @en
preferred label: BRITTISKA ÖARNA @sv
scope note: Formtillägget 09 används inte i samband med klasserna 41-48.62 @sv
scope note: Muotoluokkaa 09 ei käyetä luokkien 41-48.62 yhteydessä

Iso-Britannia
type: Concept
References: Pohjois-Irlanti
type: YKL-luokka
alternative label: Brittiläinen kansainyhteisö (45.1)
alternative label: Brittiska samväldet (45.1) @sv
alternative label: England (45.1+) @sv
alternative label: Englanti (45.1+)
alternative label: Förenade konungariket (45.1+) @sv
alternative label: Iso-Britannia (45.1+)
alternative label: Kanaalin saaret (45.1)
alternative label: Kanalöarna (45.1) @sv
alternative label: Storbritannien (45.1+) @sv
alternative label: Yhdistynyt kuningaskunta (45.1+)
broader: BRITTEINSAARET
in scheme: YKL - Yleisten kirjastojen luokitusjärjestelmä
narrower: Lontoo
narrower: Wales
narrower: Skotlanti
notation: 45.1
preferred label: Great Britain @en
preferred label: Storbritannien @sv
scope note: Förenade konungariket. England Hit också allmänna verk om Samväldet Enskilda medlemsländer och Storbritanniens transmarina områden klassificeras enligt område @sv
scope note: Yhdistynyt kuningaskunta. Englanti Tähän myös Kansainyhteisöä koskevat yleisteokset Yksittäiset jäsenmaat ja Ison-Britannian merentakaiset alueet luokitetaan ko. alueen luokkaan

Lontoo
type: Concept
type: YKL-luokka
alternative label: London (45.11) @sv
alternative label: Lontoo (45.11)
broader: Iso-Britannia
in scheme: YKL - Yleisten kirjastojen luokitusjärjestelmä
notation: 45.11
preferred label: London @en

Wales
type: Concept
type: YKL-luokka
alternative label: Wales (45.15)
broader: Iso-Britannia
in scheme: YKL - Yleisten kirjastojen luokitusjärjestelmä
notation: 45.15

Skotlanti
type: Concept
type: YKL-luokka
alternative label: Hebriderna (45.16) @sv
alternative label: Hebridit (45.16)
alternative label: Skotlanti (45.16)
alternative label: Skottland (45.16) @sv
broader: Iso-Britannia
in scheme: YKL - Yleisten kirjastojen luokitusjärjestelmä
notation: 45.16
preferred label: Scotland @en
preferred label: Skottland @sv

Irlanti
type: Concept
type: YKL-luokka
alternative label: Irland (45.7+) @sv
alternative label: Irlanti (45.7+)
broader: BRITTEINSAARET
in scheme: YKL - Yleisten kirjastojen luokitusjärjestelmä
narrower: Irlannin tasavalta
narrower: Pohjois-Irlanti
notation: 45.7
preferred label: Ireland @en
preferred label: Irland @sv

Irlannin tasavalta
type: Concept
type: YKL-luokka
alternative label: Eire (45.71)
alternative label: Irlannin tasavalta (45.71)
alternative label: Irländska republiken (45.71) @sv
broader: Irlanti
in scheme: YKL - Yleisten kirjastojen luokitusjärjestelmä
notation: 45.71
preferred label: Irländska republiken @sv
preferred label: Republic of Ireland @en

Pohjois-Irlanti
type: Concept
type: YKL-luokka
alternative label: Nordirland (45.72) @sv
alternative label: Pohjois-Irlanti (45.72)
alternative label: Ulster (45.72)
broader: Irlanti
in scheme: YKL - Yleisten kirjastojen luokitusjärjestelmä
notation: 45.72
preferred label: Nordirland @sv
preferred label: Northern Ireland @en

ETELÄ-EUROOPPA
type: Concept
type: YKL-luokka
alternative label: Arot, aluemaantiede (41 ... 48+)
alternative label: Bergstrakter, regionalgeografi (41 ... 48+) @sv
alternative label: Etelä-Eurooppa (46+)
alternative label: Floder, regionalgeografi (41 ... 48+) @sv
alternative label: Gejsrar, regionalgeografi (41 ... 48+) @sv
alternative label: Geysirit, aluemaantiede (41 ... 48+)
alternative label: Glaciärer, regionalgeografi (41 ... 48+) @sv
alternative label: Harjut, aluemaantiede (41 ... 48+)
alternative label: Hav, regionalgeografi (41 ... 48+) @sv
alternative label: Heta källor, regionalgeografi (41 ... 48+) @sv
alternative label: Insjöar, regionalgeografi (41 ... 48+) @sv
alternative label: Joet, aluemaantiede (41 ... 48+)
alternative label: Järvet, aluemaantiede (41 ... 48+)
alternative label: Jäätiköt, aluemaantiede (41 ... 48+)
alternative label: Kuumat lähteet, aluemaantiede (41 ... 48+)
alternative label: Meret, aluemaantiede (41 ... 48+)
alternative label: Poimuvuoret, aluemaantiede (41 ... 48+)
alternative label: Saaret, aluemaantiede (41 ... 48+)
alternative label: Sisävedet, aluemaantiede (41 ... 48+)
alternative label: Sjöar, regionalgeografi (41 ... 48+) @sv
alternative label: Stäpper, regionalgeografi (41 ... 48+) @sv
alternative label: Sydeuropa (46+) @sv
alternative label: Taiga, aluemaantiede (41 ... 48+)
alternative label: Taigan, lokalgeografi (41 ... 48+) @sv
alternative label: Tulivuoret, aluemaantiede (41 ... 48+)
alternative label: Tundra-alueet, aluemaantiede (41 ... 48+)
alternative label: Tundraområden, regionalgeografi (41 ... 48+) @sv
alternative label: Vattendrag, regionalgeografi (41 ... 48+) @sv
alternative label: Veckberg, regionalgeografi (41 ... 48+) @sv
alternative label: Vesistöt, aluemaantiede (41 ... 48+)
alternative label: Vulkaner, regionalgeografi (41 ... 48+) @sv
alternative label: Vuoristot, aluemaantiede (41 ... 48+)
alternative label: Åsar, regionalgeografi (41 ... 48+) @sv
alternative label: Öar, regionalgeografi (41 ... 48+) @sv
broader: MAANTIEDE. MATKAT. KANSATIEDE
in scheme: YKL - Yleisten kirjastojen luokitusjärjestelmä
narrower: Ranska
narrower: Italia
narrower: Espanja
narrower: Portugali
narrower: Malta
narrower: Balkanin maat
notation: 46
preferred label: SOUTHERN EUROPE @en
preferred label: SYDEUROPA @sv
scope note: Hit allmänna verk om Sydeuropa Formtillägget 09 används inte i samband med klasserna 41-48.62 @sv
scope note: Tähän Etelä-Eurooppaa koskevat yleisteokset Muotoluokkaa 09 ei käytetä luokkien 41-48.62 yhteydessä

Ranska
type: Concept
type: YKL-luokka
alternative label: Frankrike (46.1+) @sv
alternative label: Franska samväldet (46.1) @sv
alternative label: Korsika (46.1)
alternative label: Ranska (46.1+)
alternative label: Ranskan liittokunta (46.1)
alternative label: Riviera, Ranska (46.1)
alternative label: Rivieran, Frankrike (46.1) @sv
broader: ETELÄ-EUROOPPA
in scheme: YKL - Yleisten kirjastojen luokitusjärjestelmä
narrower: Pariisi
narrower: Monaco
notation: 46.1
preferred label: France @en
preferred label: Frankrike @sv
scope note: Frankrikes transmarina områden klassificeras enligt område @sv
scope note: Ranskan merentakaiset alueet luokitetaan ko. alueen luokkaan

Pariisi
type: Concept
type: YKL-luokka
alternative label: Pariisi (46.11)
alternative label: Paris (46.11) @sv
broader: Ranska
in scheme: YKL - Yleisten kirjastojen luokitusjärjestelmä
notation: 46.11
preferred label: Paris @en

Monaco
type: Concept
type: YKL-luokka
alternative label: Monaco (46.19)
broader: Ranska
in scheme: YKL - Yleisten kirjastojen luokitusjärjestelmä
notation: 46.19

Italia
type: Concept
type: YKL-luokka
alternative label: Italia (46.2+)
alternative label: Italien (46.2+) @sv
alternative label: Riviera, Italia (46.2)
alternative label: Rivieran, Italien (46.2) @sv
alternative label: Sardinia (46.2)
alternative label: Sardinien (46.2) @sv
alternative label: Sicilien (46.2) @sv
alternative label: Sisilia (46.2)
broader: ETELÄ-EUROOPPA
in scheme: YKL - Yleisten kirjastojen luokitusjärjestelmä
narrower: Rooma
narrower: Vatikaanivaltio
narrower: San Marino
notation: 46.2
preferred label: Italien @sv
preferred label: Italy @en

Rooma
type: Concept
type: YKL-luokka
alternative label: Rom (46.21) @sv
alternative label: Rooman kaupunki (46.21)
broader: Italia
in scheme: YKL - Yleisten kirjastojen luokitusjärjestelmä
notation: 46.21
preferred label: Rom @sv
preferred label: Rome @en

Vatikaanivaltio
type: Concept
type: YKL-luokka
alternative label: Vatikaanivaltio (46.22)
alternative label: Vatikanstaten (46.22) @sv
broader: Italia
in scheme: YKL - Yleisten kirjastojen luokitusjärjestelmä
notation: 46.22
preferred label: Vatican City @en
preferred label: Vatikanstaten @sv

San Marino
type: Concept
type: YKL-luokka
alternative label: San Marino (46.23)
broader: Italia
in scheme: YKL - Yleisten kirjastojen luokitusjärjestelmä
notation: 46.23

Espanja
type: Concept
References: Afrikan saaret
type: YKL-luokka
alternative label: Baleaarit (46.3)
alternative label: Balearerna (46.3) @sv
alternative label: Espanja (46.3)
alternative label: Gibraltar (46.3)
alternative label: Ibiza (46.3)
alternative label: Mallorca (46.3)
alternative label: Spanien (46.3) @sv
broader: ETELÄ-EUROOPPA
in scheme: YKL - Yleisten kirjastojen luokitusjärjestelmä
narrower: Andorra
notation: 46.3
preferred label: Spain @en
preferred label: Spanien @sv
scope note: Hit också Gibraltar @sv
scope note: Tähän myös Gibraltar

Andorra
type: Concept
type: YKL-luokka
alternative label: Andorra (46.32)
broader: Espanja
in scheme: YKL - Yleisten kirjastojen luokitusjärjestelmä
notation: 46.32

Portugali
type: Concept
References: Afrikan saaret
type: YKL-luokka
alternative label: Portugal (46.4) @sv
alternative label: Portugali (46.4)
broader: ETELÄ-EUROOPPA
in scheme: YKL - Yleisten kirjastojen luokitusjärjestelmä
notation: 46.4
preferred label: Portugal @en

Malta
type: Concept
type: YKL-luokka
alternative label: Malta (46.5)
broader: ETELÄ-EUROOPPA
in scheme: YKL - Yleisten kirjastojen luokitusjärjestelmä
notation: 46.5

Balkanin maat
type: Concept
type: YKL-luokka
alternative label: Balkanin maat (46.8+)
alternative label: Balkanländerna (46.8+) @sv
broader: ETELÄ-EUROOPPA
in scheme: YKL - Yleisten kirjastojen luokitusjärjestelmä
narrower: Bulgaria
narrower: Romania
narrower: Entisen Jugoslavian alue
narrower: Albania
narrower: Kreikka
notation: 46.8
preferred label: Balkan countries @en
preferred label: Balkanländerna @sv

Bulgaria
type: Concept
type: YKL-luokka
alternative label: Bulgaria (46.81)
alternative label: Bulgarien (46.81) @sv
broader: Balkanin maat
in scheme: YKL - Yleisten kirjastojen luokitusjärjestelmä
notation: 46.81
preferred label: Bulgarien @sv

Romania
type: Concept
type: YKL-luokka
alternative label: Romania (46.82)
alternative label: Rumänien (46.82) @sv
broader: Balkanin maat
in scheme: YKL - Yleisten kirjastojen luokitusjärjestelmä
notation: 46.82
preferred label: Rumänien @sv

Entisen Jugoslavian alue
type: Concept
type: YKL-luokka
alternative label: Hercegovina (46.83) @sv
alternative label: Herzegovina (46.83)
alternative label: Jugoslavian alue (46.83+)
alternative label: Jugoslavien, f.d. (46.83+) @sv
broader: Balkanin maat
in scheme: YKL - Yleisten kirjastojen luokitusjärjestelmä
narrower: Bosnia ja Hertsegovina
narrower: Kosovo
narrower: Kroatia
narrower: Makedonia (Entinen Jugoslavian tasavalta Makedonia)
narrower: Montenegro
narrower: Serbia
narrower: Slovenia
notation: 46.83
preferred label: Före detta Jugoslavien @sv
preferred label: The area of former Yugoslavia @en

Bosnia ja Hertsegovina
type: Concept
type: YKL-luokka
alternative label: Bosnia ja Herzegovina (46.831)
alternative label: Bosnien och Hercegovina (46.831) @sv
broader: Entisen Jugoslavian alue
in scheme: YKL - Yleisten kirjastojen luokitusjärjestelmä
notation: 46.831
preferred label: Bosnia and Herzegovina @en
preferred label: Bosnien och Hercegovina @sv

Kosovo
type: Concept
type: YKL-luokka
alternative label: Kosovo (46.832)
broader: Entisen Jugoslavian alue
in scheme: YKL - Yleisten kirjastojen luokitusjärjestelmä
notation: 46.832

Kroatia
type: Concept
type: YKL-luokka
alternative label: Kroatia (46.833)
alternative label: Kroatien (46.833) @sv
broader: Entisen Jugoslavian alue
in scheme: YKL - Yleisten kirjastojen luokitusjärjestelmä
notation: 46.833
preferred label: Croatia @en
preferred label: Kroatien @sv

Makedonia (Entinen Jugoslavian tasavalta Makedonia)
type: Concept
type: YKL-luokka
alternative label: Makedonia (Entinen Jugoslavian tasavalta Makedonia) (46.834)
alternative label: Makedonien (Den före detta jugoslaviska republiken Makedonien) (46.834) @sv
broader: Entisen Jugoslavian alue
in scheme: YKL - Yleisten kirjastojen luokitusjärjestelmä
notation: 46.834
preferred label: Macedonia (The Former Yugoslav Republic of Macedonia) @en
preferred label: Makedonien (Den före detta jugoslaviska republiken Makedonien) @sv

Montenegro
type: Concept
type: YKL-luokka
alternative label: Montenegro (46.835)
broader: Entisen Jugoslavian alue
in scheme: YKL - Yleisten kirjastojen luokitusjärjestelmä
notation: 46.835

Serbia
type: Concept
type: YKL-luokka
alternative label: Serbia (46.836)
alternative label: Serbien (46.836) @sv
alternative label: Vojvodina (46.836)
broader: Entisen Jugoslavian alue
in scheme: YKL - Yleisten kirjastojen luokitusjärjestelmä
notation: 46.836
preferred label: Serbien @sv
scope note: Hit också Vojvodina @sv
scope note: Tähän myös Vojvodina

Slovenia
type: Concept
type: YKL-luokka
alternative label: Slovenia (46.837)
alternative label: Slovenien (46.837) @sv
broader: Entisen Jugoslavian alue
in scheme: YKL - Yleisten kirjastojen luokitusjärjestelmä
notation: 46.837
preferred label: Slovenien @sv

Albania
type: Concept
type: YKL-luokka
alternative label: Albania (46.84)
alternative label: Albanien (46.84) @sv
broader: Balkanin maat
in scheme: YKL - Yleisten kirjastojen luokitusjärjestelmä
notation: 46.84
preferred label: Albanien @sv

Kreikka
type: Concept
type: YKL-luokka
alternative label: Aigeianmeren saaret (46.85)
alternative label: Ateena (46.85)
alternative label: Aten (46.85) @sv
alternative label: Egeiska öarna (46.85) @sv
alternative label: Grekland (46.85) @sv
alternative label: Kreeta (46.85)
alternative label: Kreikka (46.85)
alternative label: Kreta (46.85) @sv
alternative label: Makedonia, Kreikka (46.85)
alternative label: Makedonien, Grekland (46.85) @sv
alternative label: Peloponnesos (46.85)
alternative label: Rhodos (46.85) @sv
alternative label: Rodos (46.85)
broader: Balkanin maat
in scheme: YKL - Yleisten kirjastojen luokitusjärjestelmä
notation: 46.85
preferred label: Greece @en
preferred label: Grekland @sv

ITÄ-EUROOPPA
type: Concept
References: Armenian, Azerbaidzanin, Georgian, Kazakstanin, Kirgisian, Tadzikistanin, Turkmenistanin ja Uzbekistanin historia
type: YKL-luokka
alternative label: Arot, aluemaantiede (41 ... 48+)
alternative label: Bergstrakter, regionalgeografi (41 ... 48+) @sv
alternative label: Floder, regionalgeografi (41 ... 48+) @sv
alternative label: Gejsrar, regionalgeografi (41 ... 48+) @sv
alternative label: Geysirit, aluemaantiede (41 ... 48+)
alternative label: Glaciärer, regionalgeografi (41 ... 48+) @sv
alternative label: Harjut, aluemaantiede (41 ... 48+)
alternative label: Hav, regionalgeografi (41 ... 48+) @sv
alternative label: Heta källor, regionalgeografi (41 ... 48+) @sv
alternative label: Insjöar, regionalgeografi (41 ... 48+) @sv
alternative label: Itsenäisten valtioiden yhteisö (47+)
alternative label: Itsenäisten valtioiden yhteisö, Euroopan puoleiset maat (47+)
alternative label: Itä-Eurooppa (47+)
alternative label: Joet, aluemaantiede (41 ... 48+)
alternative label: Järvet, aluemaantiede (41 ... 48+)
alternative label: Jäätiköt, aluemaantiede (41 ... 48+)
alternative label: Kuumat lähteet, aluemaantiede (41 ... 48+)
alternative label: Meret, aluemaantiede (41 ... 48+)
alternative label: Oberoende staters samvälde (47+) @sv
alternative label: Oberoende staters samvälde, europeiska länder (47+) @sv
alternative label: Poimuvuoret, aluemaantiede (41 ... 48+)
alternative label: Saaret, aluemaantiede (41 ... 48+)
alternative label: Sisävedet, aluemaantiede (41 ... 48+)
alternative label: Sjöar, regionalgeografi (41 ... 48+) @sv
alternative label: Stäpper, regionalgeografi (41 ... 48+) @sv
alternative label: Taiga, aluemaantiede (41 ... 48+)
alternative label: Taigan, lokalgeografi (41 ... 48+) @sv
alternative label: Tulivuoret, aluemaantiede (41 ... 48+)
alternative label: Tundra-alueet, aluemaantiede (41 ... 48+)
alternative label: Tundraområden, regionalgeografi (41 ... 48+) @sv
alternative label: Vattendrag, regionalgeografi (41 ... 48+) @sv
alternative label: Veckberg, regionalgeografi (41 ... 48+) @sv
alternative label: Vesistöt, aluemaantiede (41 ... 48+)
alternative label: Vulkaner, regionalgeografi (41 ... 48+) @sv
alternative label: Vuoristot, aluemaantiede (41 ... 48+)
alternative label: Åsar, regionalgeografi (41 ... 48+) @sv
alternative label: Öar, regionalgeografi (41 ... 48+) @sv
alternative label: Östeuropa (47+) @sv
broader: MAANTIEDE. MATKAT. KANSATIEDE
in scheme: YKL - Yleisten kirjastojen luokitusjärjestelmä
narrower: Venäjä
narrower: Baltian maat
narrower: Puola
narrower: Ukraina
narrower: Valko-Venäjä
narrower: Moldova
notation: 47
preferred label: EASTERN EUROPE @en
preferred label: ÖSTEUROPA @sv
scope note: Hit allmänna verk om Östeuropa eller OSS Hit och till underklasserna också de europeiska OSS-länderna Formtillägget 09 används inte i samband med klasserna 41-48.62 @sv
scope note: Tähän Itä-Eurooppaa tai IVY:ä koskevat yleisteokset Tähän ja alaluokkiin myös IVY:n Euroopan puoleiset maat Muotoluokkaa 09 ei käytetä luokkien 41-48.62 yhteydessä

Venäjä
type: Concept
References: Karjala. Kymenlaakso
References: Lappi
References: Baltian maat
References: Armenia. Azerbaidzan. Georgia. Kazakstan. Kirgisia. Tadzikistan. Turkmenistan. Uzbekistan
type: YKL-luokka
alternative label: Avträdda områden, Salla och Petsamo, från år 1945 (47.1) @sv
alternative label: Det avträdda Karelen, Karelska näset fr.o.m. år 1945 (47.1) @sv
alternative label: Hogland, från år 1945 (47.1) @sv
alternative label: Ingermanland (47.1) @sv
alternative label: Inkeri (47.1)
alternative label: Karelska näset, från år 1945 (47.1) @sv
alternative label: Karjalan kannas, vuodesta 1945 (47.1)
alternative label: Kolahalvön (47.1) @sv
alternative label: Kuolan niemimaa (47.1)
alternative label: Lavansaari, vuodesta 1945 (47.1)
alternative label: Luovutettu Karjala, Karjalan kannas vuodesta 1945 (47.1)
alternative label: Luovutetut alueet, Salla ja Petsamo, vuodesta 1945 (47.1)
alternative label: Lövskär, från år 1945 (47.1) @sv
alternative label: Murmanskin alue (47.1)
alternative label: Murmanskområdet (47.1) @sv
alternative label: Novaja Zemlja (47.1)
alternative label: Petsamo, från år 1945 (47.1) @sv
alternative label: Petsamo, vuodesta 1945 (47.1)
alternative label: Ryssland (47.1+) @sv
alternative label: Ryssland, europeiska områden (47.1+) @sv
alternative label: Sallan alue, vuodesta 1945 (47.1)
alternative label: Sallaområdet, från år 1945 (47.1) @sv
alternative label: Seiskari, vuodesta 1945 (47.1)
alternative label: Seitskär, från år 1945 (47.1) @sv
alternative label: Suursaari, vuodesta 1945 (47.1)
alternative label: Tyterskär, från år 1945 (47.1) @sv
alternative label: Tytärsaari, vuodesta 1945 (47.1)
alternative label: Venäjä (47.1+)
alternative label: Venäjä, Euroopan puoleiset alueet (47.1+)
alternative label: Viborg, från år 1945 (47.1) @sv
alternative label: Viipuri, vuodesta 1945 (47.1)
broader: ITÄ-EUROOPPA
in scheme: YKL - Yleisten kirjastojen luokitusjärjestelmä
narrower: Moskova
narrower: Pietari
narrower: Karjalan Tasavalta
notation: 47.1
preferred label: Russia @en
preferred label: Ryssland @sv
scope note: Hit allmänna verk om Ryssland Murmanskområdet Hit också de avträdda Petsamo- och Sallaområdena och Karelska näset fr.o.m. år 1945 @sv
scope note: Tähän Venäjää koskevat yleisteokset Murmanskin alue Tähän myös luovutetut Petsamon ja Sallan alueet sekä Karjalan kannas vuodesta 1945

Moskova
type: Concept
type: YKL-luokka
alternative label: Moskova (47.11)
alternative label: Moskva (47.11) @sv
broader: Venäjä
in scheme: YKL - Yleisten kirjastojen luokitusjärjestelmä
notation: 47.11
preferred label: Moscow @en
preferred label: Moskva @sv

Pietari
type: Concept
type: YKL-luokka
alternative label: Pietari (47.12)
alternative label: S:t Petersburg (47.12) @sv
broader: Venäjä
in scheme: YKL - Yleisten kirjastojen luokitusjärjestelmä
notation: 47.12
preferred label: S:t Petersburg @sv
preferred label: St. Petersburg @en

Karjalan Tasavalta
type: Concept
References: Karjala. Kymenlaakso
References: Venäjä
type: YKL-luokka
alternative label: Aunus (47.14)
alternative label: Avträdda områden, Karelen, från år 1945 (47.14) @sv
alternative label: Det avträdda Karelen förutom Karelska näset fr.o.m. år 1945 (47.14) @sv
alternative label: Det avträdda Karelen, Karelska republiken fr.o.m. år 1945 (47.14) @sv
alternative label: Itä-Karjala (47.14)
alternative label: Karelen, Karelska republiken (47.14) @sv
alternative label: Karelen, det avträdda Karelen från år 1945 (47.14) @sv
alternative label: Karelen, det avträdda Karelen, från år 1945 (47.14) @sv
alternative label: Karjala, Karjalan tasavalta (47.14)
alternative label: Karjala, luovutettu Karjala vuodesta 1945 (47.14)
alternative label: Luovutettu Karjala, Karjalan tasavalta vuodesta 1945 (47.14)
alternative label: Luovutettu Karjala, pois lukien Karjalan kannas vuodesta 1945 (47.14)
alternative label: Luovutettu Karjala, vuodesta 1945 (47.14)
alternative label: Luovutetut alueet, Karjala, vuodesta 1945 (47.14)
alternative label: Olonets (47.14) @sv
alternative label: Östkarelen (47.14) @sv
broader: Venäjä
in scheme: YKL - Yleisten kirjastojen luokitusjärjestelmä
notation: 47.14
preferred label: Karelian Republic @en
preferred label: Karelska republiken @sv
scope note: Hit även det avträdda Karelen fr.o.m. år 1945, förutom Karelska näset. Karelska näset sätts i klass 47.1. Det avträdda Petsamo och Salla sätts i klass 47.1 @sv
scope note: Tähän myös luovutettu Karjalan alue vuodesta 1945 lukuun ottamatta Karjalan kannasta. Karjalan kannas luokitetaan luokkaan 47.1. Luovutetut Petsamon ja Sallan alueet luokitetaan luokkaan 47.1.

Baltian maat
type: Concept
type: YKL-luokka
alternative label: Baltian maat (47.2+)
alternative label: Baltikum (47.2+) @sv
broader: ITÄ-EUROOPPA
in scheme: YKL - Yleisten kirjastojen luokitusjärjestelmä
narrower: Viro
narrower: Latvia
narrower: Liettua
notation: 47.2
preferred label: Baltic countries @en
preferred label: Baltikum @sv

Viro
type: Concept
type: YKL-luokka
alternative label: Eesti (47.21)
alternative label: Estland (47.21) @sv
alternative label: Viro (47.21)
broader: Baltian maat
in scheme: YKL - Yleisten kirjastojen luokitusjärjestelmä
notation: 47.21
preferred label: Estland @sv
preferred label: Estonia @en

Latvia
type: Concept
type: YKL-luokka
alternative label: Latvia (47.22)
alternative label: Lettland (47.22) @sv
broader: Baltian maat
in scheme: YKL - Yleisten kirjastojen luokitusjärjestelmä
notation: 47.22
preferred label: Lettland @sv

Liettua
type: Concept
type: YKL-luokka
alternative label: Liettua (47.23)
alternative label: Litauen (47.23) @sv
broader: Baltian maat
in scheme: YKL - Yleisten kirjastojen luokitusjärjestelmä
notation: 47.23
preferred label: Litauen @sv
preferred label: Lithuania @en

Puola
type: Concept
type: YKL-luokka
alternative label: Gdansk, från året 1945 (47.3) @sv
alternative label: Gdansk, vuodesta 1945 (47.3)
alternative label: Itä-Preussi (47.3)
alternative label: Itä-Preussi, maantiede, matkat (47.3)
alternative label: Ostpreussen (47.3) @sv
alternative label: Ostpreussen, geografi, resor (47.3) @sv
alternative label: Polen (47.3) @sv
alternative label: Puola (47.3)
broader: ITÄ-EUROOPPA
in scheme: YKL - Yleisten kirjastojen luokitusjärjestelmä
notation: 47.3
preferred label: Poland @en
preferred label: Polen @sv

Ukraina
type: Concept
type: YKL-luokka
alternative label: Ukraina (47.4)
broader: ITÄ-EUROOPPA
in scheme: YKL - Yleisten kirjastojen luokitusjärjestelmä
notation: 47.4
preferred label: Ukraine @en

Valko-Venäjä
type: Concept
type: YKL-luokka
alternative label: Valko-Venäjä (47.5)
alternative label: Vitryssland (47.5) @sv
broader: ITÄ-EUROOPPA
in scheme: YKL - Yleisten kirjastojen luokitusjärjestelmä
notation: 47.5
preferred label: Belarus @en
preferred label: Vitryssland @sv

Moldova
type: Concept
type: YKL-luokka
alternative label: Moldavia (47.6)
alternative label: Moldavien (47.6) @sv
alternative label: Moldova (47.6)
broader: ITÄ-EUROOPPA
in scheme: YKL - Yleisten kirjastojen luokitusjärjestelmä
notation: 47.6

MUUT MAANOSAT
type: Concept
References: MAANTIEDE
References: Yleinen kulttuurimaantiede
References: Yleiset matkaoppaat
References: Matkakuvaukset
References: EUROOPPA
References: SUOMI
References: POHJOISMAAT
References: KESKI-EUROOPPA
References: BRITTEINSAARET
References: ETELÄ-EUROOPPA
References: ITÄ-EUROOPPA
References: MAAILMANHISTORIA. EUROOPAN HISTORIA
References: SUOMEN HISTORIA
References: POHJOISMAIDEN HISTORIA
References: KESKI-EUROOPAN HISTORIA
References: BRITTEINSAARTEN HISTORIA
References: ETELÄ-EUROOPAN HISTORIA
References: ITÄ-EUROOPAN HISTORIA
References: MUIDEN MAANOSIEN HISTORIA
type: YKL-luokka
alternative label: Aavikot, aluemaantiede (48+)
alternative label: Arabimaat (48+)
alternative label: Arabländerna (48+) @sv
alternative label: Arot, aluemaantiede (41 ... 48+)
alternative label: Bergstrakter, regionalgeografi (41 ... 48+) @sv
alternative label: Floder, regionalgeografi (41 ... 48+) @sv
alternative label: Gejsrar, regionalgeografi (41 ... 48+) @sv
alternative label: Geysirit, aluemaantiede (41 ... 48+)
alternative label: Glaciärer, regionalgeografi (41 ... 48+) @sv
alternative label: Harjut, aluemaantiede (41 ... 48+)
alternative label: Hav, regionalgeografi (41 ... 48+) @sv
alternative label: Heta källor, regionalgeografi (41 ... 48+) @sv
alternative label: Insjöar, regionalgeografi (41 ... 48+) @sv
alternative label: Joet, aluemaantiede (41 ... 48+)
alternative label: Järvet, aluemaantiede (41 ... 48+)
alternative label: Jäätiköt, aluemaantiede (41 ... 48+)
alternative label: Kuumat lähteet, aluemaantiede (41 ... 48+)
alternative label: Meret, aluemaantiede (41 ... 48+)
alternative label: Poimuvuoret, aluemaantiede (41 ... 48+)
alternative label: Regnskogar, regionalgeografi (48+) @sv
alternative label: Saaret, aluemaantiede (41 ... 48+)
alternative label: Sademetsät, aluemaantiede (48+)
alternative label: Savanner, regionalgeografi (48+) @sv
alternative label: Savannit, aluemaantiede (48+)
alternative label: Sisävedet, aluemaantiede (41 ... 48+)
alternative label: Sjöar, regionalgeografi (41 ... 48+) @sv
alternative label: Stäpper, regionalgeografi (41 ... 48+) @sv
alternative label: Taiga, aluemaantiede (41 ... 48+)
alternative label: Taigan, lokalgeografi (41 ... 48+) @sv
alternative label: Tulivuoret, aluemaantiede (41 ... 48+)
alternative label: Tundra-alueet, aluemaantiede (41 ... 48+)
alternative label: Tundraområden, regionalgeografi (41 ... 48+) @sv
alternative label: Vattendrag, regionalgeografi (41 ... 48+) @sv
alternative label: Veckberg, regionalgeografi (41 ... 48+) @sv
alternative label: Vesistöt, aluemaantiede (41 ... 48+)
alternative label: Vulkaner, regionalgeografi (41 ... 48+) @sv
alternative label: Vuoristot, aluemaantiede (41 ... 48+)
alternative label: Åsar, regionalgeografi (41 ... 48+) @sv
alternative label: Öar, regionalgeografi (41 ... 48+) @sv
alternative label: Öknar, regionalgeografi (48+) @sv
broader: MAANTIEDE. MATKAT. KANSATIEDE
in scheme: YKL - Yleisten kirjastojen luokitusjärjestelmä
narrower: Aasia
narrower: Afrikka
narrower: Amerikka
narrower: Australia ja Oseania
narrower: Napamaat
notation: 48
preferred label: OTHER CONTINENTS @en
preferred label: ÖVRIGA VÄRLDSDELAR @sv
scope note: Hit geografiska och kulturgeografiska verk, samt reseguider och reseskildringar, som rör två eller flera världsdelar, dock inte Europa Formtillägget 09 används inte i samband med klasserna 41-48.62 @sv
scope note: Tähän kahta tai useampaa maanosaa, ei kuitenkaan Eurooppaa, koskevat maantieteelliset ja kulttuurimaantieteelliset teokset, matkaoppaat ja matkakuvaukset Muotoluokkaa 09 ei käytetä luokkien 41-48.62 yhteydessä

Aasia
type: Concept
type: YKL-luokka
alternative label: Aasia (48.1+)
alternative label: Asien (48.1+) @sv
alternative label: Itämaat (48.1+)
alternative label: Orienten (48.1+) @sv
alternative label: Orientti (48.1+)
alternative label: Österlandet (48.1+) @sv
broader: MUUT MAANOSAT
in scheme: YKL - Yleisten kirjastojen luokitusjärjestelmä
narrower: Etu-Aasia
narrower: Etelä-Aasia
narrower: Kaakkois-Aasia
narrower: Armenia. Azerbaidzan. Georgia. Kazakstan. Kirgisia. Tadzikistan. Turkmenistan. Uzbekistan
narrower: Keski- ja Itä-Aasia
notation: 48.1
preferred label: Asia @en
preferred label: Asien @sv

Etu-Aasia
type: Concept
type: YKL-luokka
alternative label: Afganistan (48.11)
alternative label: Afghanistan (48.11) @sv
alternative label: Arabia (48.11)
alternative label: Arabiemiirikunnat (48.11)
alternative label: Arabien (48.11) @sv
alternative label: Bahrain (48.11)
alternative label: Etu-Aasia (48.11+)
alternative label: Främre Asien (48.11+) @sv
alternative label: Förenade Arabemiraten (48.11) @sv
alternative label: Irak (48.11)
alternative label: Iran (48.11)
alternative label: Jemen (48.11)
alternative label: Jordania (48.11)
alternative label: Jordanien (48.11) @sv
alternative label: Kaksoisvirranmaa (48.11)
alternative label: Kurdistan (48.11)
alternative label: Kuwait (48.11)
alternative label: Libanon (48.11)
alternative label: Lähi-itä (48.11+)
alternative label: Mellanöstern (48.11+) @sv
alternative label: Mesopotamia (48.11)
alternative label: Mesopotamien (48.11) @sv
alternative label: Mindre Asien (48.11+) @sv
alternative label: Oman (48.11)
alternative label: Persia (48.11)
alternative label: Persien (48.11) @sv
alternative label: Qatar (48.11)
alternative label: Saudi-Arabia (48.11)
alternative label: Saudi-Arabien (48.11) @sv
alternative label: Syrien (48.11) @sv
alternative label: Syyria (48.11)
alternative label: Tvåflodslandet (48.11) @sv
alternative label: Vähä-Aasia (48.11+)
broader: Aasia
in scheme: YKL - Yleisten kirjastojen luokitusjärjestelmä
narrower: Turkki
narrower: Kypros
narrower: Israel. Palestiina
notation: 48.11
preferred label: Främre Asien @sv
preferred label: South-West Asia @en
scope note: Afganistan. Arabiemiirikunnat. Bahrain. Irak. Iran. Jemen. Jordania. Kuwait. Libanon. Oman. Qatar. Saudi-Arabia. Syyria
scope note: Afghanistan. Förenade Arabemiraten. Bahrain. Irak. Iran. Jordanien. Kuwait. Libanon. Oman. Qatar. Saudiarabien. Syrien. Yemen @sv

Turkki
type: Concept
type: YKL-luokka
alternative label: Turkiet (48.111) @sv
alternative label: Turkki (48.111)
broader: Etu-Aasia
in scheme: YKL - Yleisten kirjastojen luokitusjärjestelmä
notation: 48.111
preferred label: Turkey @en
preferred label: Turkiet @sv

Kypros
type: Concept
type: YKL-luokka
alternative label: Cypern (48.112) @sv
alternative label: Kypros (48.112)
broader: Etu-Aasia
in scheme: YKL - Yleisten kirjastojen luokitusjärjestelmä
notation: 48.112
preferred label: Cypern @sv
preferred label: Cyprus @en

Israel. Palestiina
type: Concept
type: YKL-luokka
alternative label: Israel (48.114)
alternative label: Kibbutsit (48.114)
alternative label: Kibbutzer (48.114) @sv
alternative label: Palestiina (48.114)
alternative label: Palestina (48.114) @sv
broader: Etu-Aasia
in scheme: YKL - Yleisten kirjastojen luokitusjärjestelmä
notation: 48.114
preferred label: Israel. Palestina @sv
preferred label: Israel. Palestine @en

Etelä-Aasia
type: Concept
type: YKL-luokka
alternative label: Bangladesh (48.13)
alternative label: Bhutan (48.13)
alternative label: Ceylon (48.13)
alternative label: Etelä-Aasia (48.13+)
alternative label: Etu-Intia (48.13+)
alternative label: Främre Indien (48.13+) @sv
alternative label: Maldiverna (48.13) @sv
alternative label: Malediivit (48.13)
alternative label: Nepal (48.13)
alternative label: Pakistan (48.13)
alternative label: Sri Lanka (48.13)
alternative label: Sydasien (48.13+) @sv
broader: Aasia
in scheme: YKL - Yleisten kirjastojen luokitusjärjestelmä
narrower: Intia
notation: 48.13
preferred label: South Asia @en
preferred label: Sydasien @sv
scope note: Bangladesh. Bhutan. Maldiverna. Nepal. Pakistan. Sri Lanka @sv
scope note: Bangladesh. Bhutan. Malediivit. Nepal. Pakistan. Sri Lanka

Intia
type: Concept
type: YKL-luokka
alternative label: Andamaanit (48.132)
alternative label: Andamanerna (48.132) @sv
alternative label: Indien (48.132) @sv
alternative label: Intia (48.132)
alternative label: Lackadiverna (48.132) @sv
alternative label: Lakkadiivit (48.132)
alternative label: Nikobaarit (48.132)
alternative label: Nikobarerna (48.132) @sv
broader: Etelä-Aasia
in scheme: YKL - Yleisten kirjastojen luokitusjärjestelmä
notation: 48.132
preferred label: India @en
preferred label: Indien @sv

Kaakkois-Aasia
type: Concept
type: YKL-luokka
alternative label: Bali (48.14)
alternative label: Borneo (48.14)
alternative label: Bortre Indien (48.14) @sv
alternative label: Brunei (48.14)
alternative label: Celebes (48.14)
alternative label: Filippiinit (48.14)
alternative label: Filippinerna (48.14) @sv
alternative label: Indokiina (48.14)
alternative label: Indokina (48.14) @sv
alternative label: Indonesia (48.14)
alternative label: Indonesien (48.14) @sv
alternative label: Itä-Intia (48.14)
alternative label: Itä-Timor (48.14)
alternative label: Jaava (48.14)
alternative label: Java, geografi (48.14) @sv
alternative label: Kaakkois-Aasia (48.14)
alternative label: Kambodja (48.14) @sv
alternative label: Kambodza (48.14)
alternative label: Laos (48.14)
alternative label: Malackahalvön (48.14) @sv
alternative label: Malaijien saaristo (48.14)
alternative label: Malajiska övärlden (48.14) @sv
alternative label: Malakan niemimaa (48.14)
alternative label: Malaysia (48.14) @sv
alternative label: Malesia (48.14)
alternative label: Moluckerna (48.14) @sv
alternative label: Molukit (48.14)
alternative label: Myanmar (48.14)
alternative label: Ostindien (48.14) @sv
alternative label: Singapore (48.14)
alternative label: Sumatra (48.14)
alternative label: Sydostasien (48.14) @sv
alternative label: Taka-Intia (48.14)
alternative label: Thailand (48.14) @sv
alternative label: Thaimaa (48.14)
alternative label: Timor (48.14)
alternative label: Vietnam (48.14)
alternative label: Östra Timor (48.14) @sv
broader: Aasia
in scheme: YKL - Yleisten kirjastojen luokitusjärjestelmä
notation: 48.14
preferred label: South-East Asia @en
preferred label: Sydostasien @sv
scope note: Brunei. Filippiinit. Indonesia. Kambodza. Laos. Malesia. Myanmar. Singapore. Thaimaa. Vietnam
scope note: Brunei. Filippinerna. Indonesien. Kambodja. Laos. Malaysia. Myanmar. Singapore. Thailand. Vietnam @sv

Armenia. Azerbaidzan. Georgia. Kazakstan. Kirgisia. Tadzikistan. Turkmenistan. Uzbekistan
type: Concept
References: Venäjä
type: YKL-luokka
alternative label: Armenia (48.17)
alternative label: Armenien (48.17) @sv
alternative label: Azerbaidzan (48.17)
alternative label: Azerbajdzjan (48.17) @sv
alternative label: Centralasien, OSS-länderna (48.17) @sv
alternative label: Georgia (48.17)
alternative label: Georgien (48.17) @sv
alternative label: Grusien (48.17) @sv
alternative label: Gruusia (48.17)
alternative label: Itsenäisten valtioiden yhteisö, Aasian puoleiset alueet (48.17)
alternative label: Jakutia (48.17)
alternative label: Jakutien (48.17) @sv
alternative label: Kamtjatka (48.17) @sv
alternative label: Kamtsatka (48.17)
alternative label: Kaukasia (48.17)
alternative label: Kaukasien (48.17) @sv
alternative label: Kazakstan (48.17)
alternative label: Keski-Aasia, IVY-maat (48.17)
alternative label: Kirgisia (48.17)
alternative label: Kirgisien (48.17) @sv
alternative label: Kuriilit, Venäjä (48.17)
alternative label: Kurilerna, Ryssland (48.17) @sv
alternative label: Oberoende staters samvälde, asiatiska områden (48.17) @sv
alternative label: Ryssland, asiatiska områden (48.17) @sv
alternative label: Sachalin (48.17) @sv
alternative label: Sahalin (48.17)
alternative label: Sibirien (48.17) @sv
alternative label: Siperia (48.17)
alternative label: Tadzikistan (48.17)
alternative label: Tadzjikistan (48.17) @sv
alternative label: Tjetjenien (48.17) @sv
alternative label: Tsetsenia (48.17)
alternative label: Turkestan (48.17)
alternative label: Turkmenistan (48.17)
alternative label: Uzbekistan (48.17)
alternative label: Venäjä, Aasian puoleiset alueet (48.17)
broader: Aasia
in scheme: YKL - Yleisten kirjastojen luokitusjärjestelmä
notation: 48.17
preferred label: Armenia. Azerbaijan. Georgia. Kazakhstan. Kyrgyztan. Tajikistan. Uzbekistan @en
preferred label: Armenien. Azerbajdzjan. Georgien. Kazakstan. Kirgizistan. Tadjikistan. Turkmenistan. Uzbekistan @sv
scope note: Hit även Sibirien och övriga asiatiska delar av Ryssland @sv
scope note: Tähän myös Siperia ja muut Venäjän Aasian puoleiset alueet

Keski- ja Itä-Aasia
type: Concept
References: Etelä-Aasia
References: Armenia. Azerbaidzan. Georgia. Kazakstan. Kirgisia. Tadzikistan. Turkmenistan. Uzbekistan
type: YKL-luokka
alternative label: Centralasien (48.18) @sv
alternative label: Etelä-Korea (48.18)
alternative label: Fjärran Östern (48.18+) @sv
alternative label: Folkrepubliken Korea (48.18) @sv
alternative label: Himalaja (48.18)
alternative label: Himalaya (48.18) @sv
alternative label: Itä-Aasia (48.18+)
alternative label: Kaukoitä (48.18+)
alternative label: Keski-Aasia (48.18)
alternative label: Korea (48.18)
alternative label: Korean kansantasavalta (48.18)
alternative label: Korean tasavalta (48.18)
alternative label: Mongolia (48.18)
alternative label: Mongoliet (48.18) @sv
alternative label: Nordkorea (48.18) @sv
alternative label: Ostasien (48.18+) @sv
alternative label: Pohjois-Korea (48.18)
alternative label: Republiken Korea (48.18) @sv
alternative label: Sydkorea (48.18) @sv
broader: Aasia
in scheme: YKL - Yleisten kirjastojen luokitusjärjestelmä
narrower: Kiina
narrower: Japani
notation: 48.18
preferred label: Central and East Asia @en
preferred label: Central- och Ostasien @sv
scope note: Hit allmänna verk om Central- och Ostasien Korea. Repuliken Korea. Folkrepubliken Korea. Mongoliet @sv
scope note: Tähän Keski- ja Itä-Aasiaa koskevat yleisteokset Korea. Korean tasavalta. Korean kansantasavalta. Mongolia

Kiina
type: Concept
type: YKL-luokka
alternative label: Hongkong (48.183)
alternative label: Kiina (48.183)
alternative label: Kina (48.183) @sv
alternative label: Macao (48.183)
alternative label: Manchuriet (48.183) @sv
alternative label: Mantsuria (48.183)
alternative label: Taiwan (48.183)
alternative label: Tibet (48.183) @sv
alternative label: Tiibet (48.183)
broader: Keski- ja Itä-Aasia
in scheme: YKL - Yleisten kirjastojen luokitusjärjestelmä
notation: 48.183
preferred label: China @en
preferred label: Kina @sv
scope note: Hit också Hongkong, Macao, Taiwan och Tibet @sv
scope note: Tähän myös Hongkong, Macao, Taiwan ja Tiibet

Japani
type: Concept
type: YKL-luokka
alternative label: Japan (48.184) @sv
alternative label: Japani (48.184)
alternative label: Kuriilit, Japani (48.184)
alternative label: Kurilerna, Japan (48.184) @sv
broader: Keski- ja Itä-Aasia
in scheme: YKL - Yleisten kirjastojen luokitusjärjestelmä
notation: 48.184
preferred label: Japan @en

Afrikka
type: Concept
type: YKL-luokka
alternative label: Afrika (48.2+) @sv
alternative label: Afrikka (48.2+)
broader: MUUT MAANOSAT
in scheme: YKL - Yleisten kirjastojen luokitusjärjestelmä
narrower: Pohjois-Afrikka
narrower: Länsi-Afrikka
narrower: Keski-Afrikka
narrower: Itä-Afrikka
narrower: Etelä-Afrikka
narrower: Afrikan saaret
notation: 48.2
preferred label: Africa @en
preferred label: Afrika @sv

Pohjois-Afrikka
type: Concept
type: YKL-luokka
alternative label: Algeria (48.21)
alternative label: Algeriet (48.21) @sv
alternative label: Atlasländerna (48.21) @sv
alternative label: Atlasmaat (48.21)
alternative label: Egypten (48.21) @sv
alternative label: Egypti (48.21)
alternative label: Etelä-Sudan (48.21)
alternative label: Libya (48.21)
alternative label: Libyen (48.21) @sv
alternative label: Marocko (48.21) @sv
alternative label: Marokko (48.21)
alternative label: Nordafrika (48.21) @sv
alternative label: Pohjois-Afrikka (48.21)
alternative label: Sahara (48.21)
alternative label: Sudan (48.21)
alternative label: Sydsudan (48.21) @sv
alternative label: Tunisia (48.21)
alternative label: Tunisien (48.21) @sv
broader: Afrikka
in scheme: YKL - Yleisten kirjastojen luokitusjärjestelmä
notation: 48.21
preferred label: Nordafrika @sv
preferred label: North Africa @en
scope note: Algeria. Egypti. Etelä-Sudan. Libya. Marokko. Sudan. Tunisia Tähän myös Saharan aluetta koskevat yleisteokset
scope note: Algeriet. Egypten. Libyen. Marocko. Sudan. Sydsudan. Tunisien Hit också allmänna verk om Saharaområdet @sv

Länsi-Afrikka
type: Concept
type: YKL-luokka
alternative label: Benin (48.25)
alternative label: Burkina Faso (48.25)
alternative label: Dahomey (48.25)
alternative label: Elfenbenskusten (48.25) @sv
alternative label: Gambia (48.25)
alternative label: Ghana (48.25)
alternative label: Guinea (48.25)
alternative label: Guinea-Bissau (48.25)
alternative label: Liberia (48.25)
alternative label: Länsi-Afrikka (48.25)
alternative label: Mali (48.25)
alternative label: Mauretanien (48.25) @sv
alternative label: Mauritania (48.25)
alternative label: Niger (48.25)
alternative label: Nigeria (48.25)
alternative label: Norsunluurannikko (48.25)
alternative label: Sahel (48.25)
alternative label: Senegal (48.25)
alternative label: Sierra Leone (48.25)
alternative label: Togo (48.25)
alternative label: Västafrika (48.25) @sv
broader: Afrikka
in scheme: YKL - Yleisten kirjastojen luokitusjärjestelmä
notation: 48.25
preferred label: Västafrika @sv
preferred label: West Africa @en
scope note: Benin. Burkina Faso. Elfenbenskusten. Gambia. Ghana Guinea. Guinea-Bissau. Liberia. Mali. Mauretanien. Niger. Nigeria. Senegal. Sierra Leone. Togo @sv
scope note: Benin. Burkina Faso. Gambia. Ghana. Guinea. Guinea-Bissau. Liberia. Mali. Mauritania. Niger. Nigeria. Norsunluurannikko. Senegal. Sierra Leone. Togo

Keski-Afrikka
type: Concept
type: YKL-luokka
alternative label: Angola (48.26)
alternative label: Brazzaville, Kongo (48.26)
alternative label: Centralafrika (48.26) @sv
alternative label: Ekvatorialguinea (48.26) @sv
alternative label: Gabon (48.26)
alternative label: Kamerun (48.26)
alternative label: Keski-Afrikka (48.26)
alternative label: Kinshasa, Kongo (48.26)
alternative label: Kongo (48.26)
alternative label: Kongo-Brazzaville (48.26)
alternative label: Kongo-Kinshasa (48.26)
alternative label: Päiväntasaajan Guinea (48.26)
alternative label: Tchad (48.26) @sv
alternative label: Tsad (48.26)
alternative label: Zaire (48.26)
broader: Afrikka
in scheme: YKL - Yleisten kirjastojen luokitusjärjestelmä
notation: 48.26
preferred label: Central Africa @en
preferred label: Centralafrika @sv
scope note: Angola. Centralafrikanska republiken. Gabon. Kamerun. Kongo-Brazzaville. Kongo-Kinshasa. Ekvatorialguinea. Tchad @sv
scope note: Angola. Gabon. Kamerun. Keski-Afrikan tasavalta. Kongo-Brazzaville. Kongo-Kinshasa. Päiväntasaajan Guinea. Tsad

Itä-Afrikka
type: Concept
type: YKL-luokka
alternative label: Abessinia (48.27)
alternative label: Abessinien (48.27) @sv
alternative label: Burundi (48.27)
alternative label: Djibouti (48.27)
alternative label: Eritrea (48.27)
alternative label: Etiopia (48.27)
alternative label: Etiopien (48.27) @sv
alternative label: Itä-Afrikka (48.27)
alternative label: Kenia (48.27)
alternative label: Kenya (48.27) @sv
alternative label: Ruanda (48.27)
alternative label: Somalia (48.27)
alternative label: Tansania (48.27)
alternative label: Tanzania (48.27) @sv
alternative label: Uganda (48.27)
alternative label: Östafrika (48.27) @sv
broader: Afrikka
in scheme: YKL - Yleisten kirjastojen luokitusjärjestelmä
notation: 48.27
preferred label: East Africa @en
preferred label: Östafrika @sv
scope note: Burundi. Djibouti. Eritrea. Etiopia. Kenia. Ruanda. Somalia. Tansania. Uganda
scope note: Burundi. Djibouti. Eritrea. Etiopien. Kenya. Tanzania. Uganda @sv

Etelä-Afrikka
type: Concept
type: YKL-luokka
alternative label: Amboland (48.28) @sv
alternative label: Ambomaa (48.28)
alternative label: Bechuanaland (48.28) @sv
alternative label: Betsuanamaa (48.28)
alternative label: Botswana (48.28)
alternative label: Etelä-Afrikka (48.28)
alternative label: Lesotho (48.28)
alternative label: Malawi (48.28)
alternative label: Mosambik (48.28)
alternative label: Moçambique (48.28) @sv
alternative label: Namibia (48.28)
alternative label: Rhodesia (48.28)
alternative label: Sambia (48.28)
alternative label: Swaziland (48.28) @sv
alternative label: Swazimaa (48.28)
alternative label: Sydafrika (48.28) @sv
alternative label: Zambia (48.28) @sv
alternative label: Zimbabwe (48.28)
broader: Afrikka
in scheme: YKL - Yleisten kirjastojen luokitusjärjestelmä
notation: 48.28
preferred label: South Africa @en
preferred label: Sydafrika @sv
scope note: Botswana. Etelä-Afrikan tasavalta. Lesotho. Malawi. Mosambik. Namibia. Sambia. Swazimaa. Zimbabwe
scope note: Botswana. Lesotho. Malawi. Moçambique. Namibia. Swaziland. Sydafrikanska republiken. Zambia. Zimbabwe @sv

Afrikan saaret
type: Concept
type: YKL-luokka
alternative label: Afrikan saaret (48.29)
alternative label: Afrikas öar (48.29) @sv
alternative label: Aldabrasaaret (48.29)
alternative label: Aldabraöarna (48.29) @sv
alternative label: Amiranterna (48.29) @sv
alternative label: Amirantit (48.29)
alternative label: Ascension (48.29)
alternative label: Azorerna (48.29) @sv
alternative label: Azorit (48.29)
alternative label: Kanarian saaret (48.29)
alternative label: Kanarieöarna (48.29) @sv
alternative label: Kap Verde (48.29)
alternative label: Komorerna (48.29) @sv
alternative label: Komorit (48.29)
alternative label: Madagaskar (48.29)
alternative label: Madeira (48.29)
alternative label: Mauritius (48.29)
alternative label: Mayotte (48.29)
alternative label: Principe (48.29)
alternative label: Réunion (48.29)
alternative label: Saint Helena (48.29)
alternative label: Sao Tomé ja Principe (48.29)
alternative label: Sao Tomé och Principe (48.29) @sv
alternative label: Seychellerna (48.29) @sv
alternative label: Seychellit (48.29)
alternative label: Tristan da Cunha (48.29)
broader: Afrikka
in scheme: YKL - Yleisten kirjastojen luokitusjärjestelmä
notation: 48.29
preferred label: African islands @en
preferred label: Öar kring Afrika @sv
scope note: Aldabrasaaret. Amirantit. Ascension. Azorit. Kanarian saaret. Kap Verde. Komorit. Madagaskar. Madeira. Mauritius. Réunion. Saint Helena. Sao Tomé ja Principe. Seychellit. Tristan da Cunha
scope note: Aldabraöarna. Amiranteöarna. Ascension. Azorerna. Comorerna. Kanarieöarna. Kap Verde. Madagaskar. Madeira. Mauritius. Réunion. S:t Helena. São Tomé och Principe. Seychellerna. Tristan da Cunha @sv

Amerikka
type: Concept
type: YKL-luokka
alternative label: Amerika (48.3+) @sv
alternative label: Amerikka (48.3+)
broader: MUUT MAANOSAT
in scheme: YKL - Yleisten kirjastojen luokitusjärjestelmä
narrower: Pohjois-Amerikka
narrower: Väli-Amerikka
narrower: Etelä-Amerikka
notation: 48.3
preferred label: America @en
preferred label: Amerika @sv

Pohjois-Amerikka
type: Concept
type: YKL-luokka
alternative label: Kalliovuoret (48.31+)
alternative label: Klippiga bergen (48.31+) @sv
alternative label: Nordamerika (48.31+) @sv
alternative label: Pohjois-Amerikka (48.31+)
alternative label: Preeriat, aluemaantiede (48.31+)
alternative label: Prärier, regional geografi (48.31+) @sv
broader: Amerikka
in scheme: YKL - Yleisten kirjastojen luokitusjärjestelmä
narrower: Yhdysvallat
narrower: Kanada
narrower: Meksiko
notation: 48.31
preferred label: Nordamerika @sv
preferred label: North America @en

Yhdysvallat
type: Concept
References: Karibianmeren alue
References: Havaiji
type: YKL-luokka
alternative label: Alaska (48.312)
alternative label: Aleuterna (48.312) @sv
alternative label: Aleutit (48.312)
alternative label: Förenta staterna (48.312+) @sv
alternative label: Georgia, Förenta Staterna (48.312) @sv
alternative label: Georgia, USA (48.312)
alternative label: USA (48.312+)
alternative label: Yhdysvallat (48.312+)
broader: Pohjois-Amerikka
in scheme: YKL - Yleisten kirjastojen luokitusjärjestelmä
narrower: New York
notation: 48.312
preferred label: Förenta Staterna @sv
preferred label: The United States of America @en
scope note: Hit också Alaska Förenta Staternas transmarina områden klassificeras enligt område @sv
scope note: Tähän myös Alaska Yhdysvaltain merentakaiset alueet luokitetaan ko. alueen luokkaan

New York
type: Concept
type: YKL-luokka
alternative label: New York (48.3121)
broader: Yhdysvallat
in scheme: YKL - Yleisten kirjastojen luokitusjärjestelmä
notation: 48.3121

Kanada
type: Concept
type: YKL-luokka
alternative label: Kanada (48.313)
alternative label: Labrador (48.313)
alternative label: Newfoundland (48.313)
alternative label: Quebec (48.313)
broader: Pohjois-Amerikka
in scheme: YKL - Yleisten kirjastojen luokitusjärjestelmä
notation: 48.313
preferred label: Canada @en

Meksiko
type: Concept
type: YKL-luokka
alternative label: Meksiko (48.314)
alternative label: Mexico (48.314) @sv
broader: Pohjois-Amerikka
in scheme: YKL - Yleisten kirjastojen luokitusjärjestelmä
notation: 48.314
preferred label: Mexico @en

Väli-Amerikka
type: Concept
type: YKL-luokka
alternative label: Mellanamerika (48.35+) @sv
alternative label: Väli-Amerikka (48.35+)
broader: Amerikka
in scheme: YKL - Yleisten kirjastojen luokitusjärjestelmä
narrower: Keski-Amerikka
narrower: Karibianmeren alue
notation: 48.35
preferred label: Mellanamerika @sv
preferred label: Middle America @en

Keski-Amerikka
type: Concept
type: YKL-luokka
alternative label: Belize (48.355)
alternative label: Centralamerika (48.355) @sv
alternative label: Costa Rica (48.355)
alternative label: El Salvador (48.355)
alternative label: Guatemala (48.355)
alternative label: Honduras (48.355)
alternative label: Keski-Amerikka (48.355)
alternative label: Nicaragua (48.355)
alternative label: Panama (48.355)
broader: Väli-Amerikka
in scheme: YKL - Yleisten kirjastojen luokitusjärjestelmä
notation: 48.355
preferred label: Central America @en
preferred label: Centralamerika @sv
scope note: Belize. Costa Rica. El Salvador. Guatemala. Honduras. Nicaragua. Panama

Karibianmeren alue
type: Concept
type: YKL-luokka
alternative label: Alankomaiden Antillit (48.356)
alternative label: Anguilla (48.356)
alternative label: Antigua ja Barbuda (48.356)
alternative label: Antigua och Barbuda (48.356) @sv
alternative label: Antillerna (48.356) @sv
alternative label: Antillit (48.356)
alternative label: Aruba (48.356)
alternative label: Bahamasaaret (48.356)
alternative label: Bahamaöarna (48.356) @sv
alternative label: Barbados (48.356)
alternative label: Barbuda (48.356)
alternative label: Bermudasaaret (48.356)
alternative label: Bermudaöarna (48.356) @sv
alternative label: Caicos (48.356)
alternative label: Caymansaaret (48.356)
alternative label: Caymanöarna (48.356) @sv
alternative label: Dominica (48.356)
alternative label: Dominikaaninen tasavalta (48.356)
alternative label: Dominikanska republiken (48.356) @sv
alternative label: Grenada (48.356)
alternative label: Grenadiinit (48.356)
alternative label: Grenadinerna (48.356) @sv
alternative label: Guadeloupe (48.356)
alternative label: Haiti (48.356)
alternative label: Isot Antillit (48.356)
alternative label: Jamaica (48.356) @sv
alternative label: Jamaika (48.356)
alternative label: Jungfruöarna (48.356) @sv
alternative label: Karibianmeren alue (48.356)
alternative label: Karibiska öarna (48.356) @sv
alternative label: Kuba (48.356) @sv
alternative label: Kuuba (48.356)
alternative label: Länsi-Intian saaristo (48.356)
alternative label: Martinique (48.356)
alternative label: Montserrat (48.356)
alternative label: Nederländska Antillerna (48.356) @sv
alternative label: Neitsytsaaret (48.356)
alternative label: Nevis (48.356)
alternative label: Pienet Antillit (48.356)
alternative label: Puerto Rico (48.356)
alternative label: Saint Kitts-Nevis (48.356)
alternative label: Saint Lucia (48.356)
alternative label: Saint Vincent ja Grenadiinit (48.356)
alternative label: Saint Vincent och Grenadinerna (48.356) @sv
alternative label: Små Antillerna (48.356) @sv
alternative label: Stora Antillerna (48.356) @sv
alternative label: Tobago (48.356)
alternative label: Trinidad ja Tobago (48.356)
alternative label: Trinidad och Tobago (48.356) @sv
alternative label: Turks ja Caicos (48.356)
alternative label: Turks och Caicos (48.356) @sv
alternative label: Västindiska öarna (48.356) @sv
broader: Väli-Amerikka
in scheme: YKL - Yleisten kirjastojen luokitusjärjestelmä
notation: 48.356
preferred label: Karibien @sv
preferred label: The Caribbean @en
scope note: Isot-Antillit. Pienet-Antillit Alankomaiden Antillit. Anguilla. Antigua. Bahama. Barbados. Bermuda. Dominica. Dominikaaninen tasavalta. Grenada. Guadeloupe. Haiti. Jamaika. Kuuba. Martinique. Neitsytsaaret. Puerto Rico. Saint Kitts-Nevis. Saint Lucia. Saint Vincent. Trinidad ja Tobago
scope note: Stora Antillerna. Små Antillerna Anguilla. Antigua. Barbados. Bermudaöarna. Kuba. Dominica. Dominikanska republiken. Grenada. Guadeloupe. Haiti. Jamaica. Jungfruöarna. Martinique. Nederländska Antillerna. Puerto Rico. Saint Christopher och Nevis. Saint Lucia. Saint Vincent och Grenadinerna. Trinidad och Tobago @sv

Etelä-Amerikka
type: Concept
type: YKL-luokka
alternative label: Anderna (48.38+) @sv
alternative label: Andit (48.38+)
alternative label: Bolivia (48.38)
alternative label: Ecuador (48.38)
alternative label: Etelä-Amerikka (48.38+)
alternative label: Guyana (48.38)
alternative label: Latinalainen Amerikka (48.38)
alternative label: Latinamerika (48.38) @sv
alternative label: Paraguay (48.38)
alternative label: Surinam (48.38)
alternative label: Sydamerika (48.38+) @sv
alternative label: Uruguay (48.38)
broader: Amerikka
in scheme: YKL - Yleisten kirjastojen luokitusjärjestelmä
narrower: Venezuela
narrower: Kolumbia
narrower: Peru
narrower: Chile
narrower: Argentiina
narrower: Brasilia
notation: 48.38
preferred label: South America @en
preferred label: Sydamerika @sv
scope note: Bolivia. Ecuador. Guayana. Paraguay. Surinam. Uruguay Tähän myös latinalaista Amerikkaa koskevat yleisteokset
scope note: Bolivia. Ecuador. Guyana. Paraguay. Surinam. Uruguay Hit också allmänna verk om Latinamerika @sv

Venezuela
type: Concept
type: YKL-luokka
alternative label: Venezuela (48.381)
broader: Etelä-Amerikka
in scheme: YKL - Yleisten kirjastojen luokitusjärjestelmä
notation: 48.381

Kolumbia
type: Concept
type: YKL-luokka
alternative label: Colombia (48.382) @sv
alternative label: Kolumbia (48.382)
broader: Etelä-Amerikka
in scheme: YKL - Yleisten kirjastojen luokitusjärjestelmä
notation: 48.382
preferred label: Colombia @sv
preferred label: Columbia @en

Peru
type: Concept
type: YKL-luokka
alternative label: Peru (48.383)
broader: Etelä-Amerikka
in scheme: YKL - Yleisten kirjastojen luokitusjärjestelmä
notation: 48.383

Chile
type: Concept
type: YKL-luokka
alternative label: Chile (48.385)
broader: Etelä-Amerikka
in scheme: YKL - Yleisten kirjastojen luokitusjärjestelmä
notation: 48.385

Argentiina
type: Concept
type: YKL-luokka
alternative label: Argentiina (48.386)
alternative label: Argentina (48.386) @sv
alternative label: Eldslandet (48.386) @sv
alternative label: Falklandin saaret (48.386)
alternative label: Falklandsöarna (48.386) @sv
alternative label: Tulimaa (48.386)
broader: Etelä-Amerikka
in scheme: YKL - Yleisten kirjastojen luokitusjärjestelmä
notation: 48.386
preferred label: Argentina @en
scope note: Hit också Falklandsöarna @sv
scope note: Tähän myös Falklandin saaret

Brasilia
type: Concept
type: YKL-luokka
alternative label: Amazonas (48.388)
alternative label: Brasilia (48.388)
alternative label: Brasilien (48.388) @sv
broader: Etelä-Amerikka
in scheme: YKL - Yleisten kirjastojen luokitusjärjestelmä
notation: 48.388
preferred label: Brasilien @sv
preferred label: Brazil @en

Australia ja Oseania
type: Concept
type: YKL-luokka
alternative label: Australia ja Oseania (48.5+)
alternative label: Australien och Oceanien (48.5+) @sv
alternative label: Oceanien (48.5+) @sv
alternative label: Oseania (48.5+)
broader: MUUT MAANOSAT
in scheme: YKL - Yleisten kirjastojen luokitusjärjestelmä
narrower: Australia
narrower: Uusi-Seelanti
narrower: Uusi-Guinea
narrower: Tyynenmeren saaret
notation: 48.5
preferred label: Australia and Oceania @en
preferred label: Australien och Oceanien @sv

Australia
type: Concept
type: YKL-luokka
alternative label: Australia (48.51)
alternative label: Australien (48.51) @sv
alternative label: Tasmania (48.51)
alternative label: Tasmanien (48.51) @sv
broader: Australia ja Oseania
in scheme: YKL - Yleisten kirjastojen luokitusjärjestelmä
notation: 48.51
preferred label: Australien @sv

Uusi-Seelanti
type: Concept
type: YKL-luokka
alternative label: Nya Zeeland (48.54) @sv
alternative label: Uusi-Seelanti (48.54)
broader: Australia ja Oseania
in scheme: YKL - Yleisten kirjastojen luokitusjärjestelmä
notation: 48.54
preferred label: New Zealand @en
preferred label: Nya Zeeland @sv

Uusi-Guinea
type: Concept
type: YKL-luokka
alternative label: Nya Guinea (48.56) @sv
alternative label: Papua Nya Guinea (48.56) @sv
alternative label: Papua-Uusi-Guinea (48.56)
alternative label: Uusi-Guinea (48.56)
broader: Australia ja Oseania
in scheme: YKL - Yleisten kirjastojen luokitusjärjestelmä
notation: 48.56
preferred label: New Guinea @en
preferred label: Nya Guinea @sv

Tyynenmeren saaret
type: Concept
References: Uusi-Seelanti
References: Uusi-Guinea
type: YKL-luokka
alternative label: Bismarckin saaret (48.57)
alternative label: Bismarcköarna (48.57) @sv
alternative label: Cookinsaaret (48.57)
alternative label: Cooköarna (48.57) @sv
alternative label: Ellisin saaret (48.57)
alternative label: Ellisöarna (48.57) @sv
alternative label: Etelämeren saaret (48.57+)
alternative label: Fidzisaaret (48.57)
alternative label: Fijiöarna (48.57) @sv
alternative label: Galapagossaaret (48.57)
alternative label: Galapagosöarna (48.57) @sv
alternative label: Gilbertinsaaret (48.57)
alternative label: Gilbertsöarna (48.57) @sv
alternative label: Guam (48.57)
alternative label: Joulusaari (48.57)
alternative label: Julön (48.57) @sv
alternative label: Karoliinit, Tyynen meren saaret (48.57)
alternative label: Karolinerna, öar i Stilla Havet (48.57) @sv
alternative label: Kiribati (48.57)
alternative label: Kokosöarna (48.57) @sv
alternative label: Kookossaaret (48.57)
alternative label: Länsi-Samoa (48.57)
alternative label: Mariaanit (48.57)
alternative label: Marianerna (48.57) @sv
alternative label: Marquesassaaret (48.57)
alternative label: Marquesasöarna (48.57) @sv
alternative label: Marshallinsaaret (48.57)
alternative label: Marshallöarna (48.57) @sv
alternative label: Melanesia (48.57)
alternative label: Melanesien (48.57) @sv
alternative label: Mikronesia (48.57)
alternative label: Mikronesien (48.57) @sv
alternative label: Nauru (48.57) @sv
alternative label: Naurun tasavalta (48.57)
alternative label: Niue (48.57)
alternative label: Norfolkin saari (48.57)
alternative label: Norfolkön (48.57) @sv
alternative label: Nya Hebriderna (48.57) @sv
alternative label: Nya Kaledonien (48.57) @sv
alternative label: Palau (48.57)
alternative label: Pitcairnin saaret (48.57)
alternative label: Pitcairnöarna (48.57) @sv
alternative label: Polynesia (48.57)
alternative label: Polynesien (48.57) @sv
alternative label: Pääsiäissaari (48.57)
alternative label: Påskön (48.57) @sv
alternative label: Salomonsaaret (48.57)
alternative label: Salomonöarna (48.57) @sv
alternative label: Samoa (48.57)
alternative label: Seurasaaret (48.57)
alternative label: Stillahavsöar (48.57+) @sv
alternative label: Sällskapsöarna (48.57) @sv
alternative label: Söderhavsöar (48.57+) @sv
alternative label: Tahiti (48.57)
alternative label: Tokelau (48.57)
alternative label: Tonga (48.57)
alternative label: Tuvalu (48.57)
alternative label: Tyynenmeren saaret (48.57+)
alternative label: Uudet-Hebridit (48.57)
alternative label: Uusi-Kaledonia (48.57)
alternative label: Vanuatu (48.57)
alternative label: Västra Samoa (48.57) @sv
broader: Australia ja Oseania
in scheme: YKL - Yleisten kirjastojen luokitusjärjestelmä
narrower: Havaiji
notation: 48.57
preferred label: Pacific islands @en
preferred label: Öarna i Stilla Havet @sv
scope note: Melanesia. Mikronesia. Polynesia Bismarckinsaaret. Cookinsaaret. Fidzisaaret. Galapagossaaret. Gilbertinsaaret. Joulusaari. Karoliinit. Mariaanit. Marquesassaaret. Marshallinsaaret Nauru. Pitcairn. Pääsiäissaari. Salomonsaaret. Samoa. Seurasaaret. Tahiti. Tonga. Tuvalu. Uudet-Hebridit. Uusi-Kaledonia. Vanuatu
scope note: Melanesien. Mikronesien. Polynesien Bismarcköarna. Karolinerna. Cooköarna. Fiji. Galapagosöarna. Gilbertsöarna. Julön. Marianerna. Marquesasöarna. Marshallöarna. Nauru. Nya Hebriderna. Nya Kaledonien. Pitcairn. Påskön. Salomonöarna. Samoa. Sällskapsöarna. Tahiti. Tonga. Tuvalu. Vanuatu @sv

Havaiji
type: Concept
type: YKL-luokka
alternative label: Havaiji (48.575)
alternative label: Hawaii (48.575) @sv
broader: Tyynenmeren saaret
in scheme: YKL - Yleisten kirjastojen luokitusjärjestelmä
notation: 48.575
preferred label: Hawaii @en

Napamaat
type: Concept
type: YKL-luokka
alternative label: Napa-alueet (48.6+)
alternative label: Napamaat (48.6+)
alternative label: Polarländerna (48.6+) @sv
alternative label: Polarområden (48.6+) @sv
broader: MUUT MAANOSAT
in scheme: YKL - Yleisten kirjastojen luokitusjärjestelmä
narrower: Pohjoiset napamaat. Arktis
narrower: Eteläiset napamaat. Antarktis
notation: 48.6
preferred label: Polar regions @en
preferred label: Polarländerna @sv

Pohjoiset napamaat. Arktis
type: Concept
References: Lappi
References: Pohjoiskalotti
References: Armenia. Azerbaidzan. Georgia. Kazakstan. Kirgisia. Tadzikistan. Turkmenistan. Uzbekistan
References: Yhdysvallat
References: Kanada
type: YKL-luokka
alternative label: Arktinen alue (48.61)
alternative label: Arktis (48.61)
alternative label: Arktiskt område (48.61) @sv
alternative label: Björnön (48.61) @sv
alternative label: Frans Joosefin maa (48.61)
alternative label: Frans Josefs land (48.61) @sv
alternative label: Grönland (48.61) @sv
alternative label: Grönlanti (48.61)
alternative label: Huippuvuoret (48.61)
alternative label: Jan Mayen (48.61)
alternative label: Karhusaari (48.61)
alternative label: Koillisväylä, maantiede, matkat (48.61)
alternative label: Napamaat, pohjoiset (48.61)
alternative label: Nordliga polarländerna (48.61) @sv
alternative label: Nordostpassagen, geografi, resor (48.61) @sv
alternative label: Nordpolen (48.61) @sv
alternative label: Pohjoiset napamaat (48.61)
alternative label: Pohjoisnapa (48.61)
alternative label: Polarländerna, nordliga (48.61) @sv
alternative label: Spetsbergen (48.61) @sv
broader: Napamaat
in scheme: YKL - Yleisten kirjastojen luokitusjärjestelmä
notation: 48.61
preferred label: Nordliga Polarländerna. Arktis @sv
preferred label: Northern polar regions. The Arctic @en
scope note: Franz Josefs land. Grönland. Jan Mayen. Svalbard Hit också allmänna verk om de nordliga polarområdena @sv
scope note: Grönlanti. Huippuvuoret. Jan Mayen. Frans Joosefin maa Tähän myös pohjoisia napa-alueita koskevat yleisteokset

Eteläiset napamaat. Antarktis
type: Concept
type: YKL-luokka
alternative label: Antarktinen alue (48.62)
alternative label: Antarktis (48.62)
alternative label: Antarktiska kontinenten (48.62) @sv
alternative label: Antarktiskt område (48.62) @sv
alternative label: Eteläiset napamaat (48.62)
alternative label: Etelämanner (48.62)
alternative label: Etelänapa (48.62)
alternative label: Napamaat, eteläiset (48.62)
alternative label: Polarländerna, sydliga (48.62) @sv
alternative label: Sydliga polarländerna (48.62) @sv
alternative label: Sydpolen (48.62) @sv
broader: Napamaat
in scheme: YKL - Yleisten kirjastojen luokitusjärjestelmä
notation: 48.62
preferred label: Southern polar regions. The Antarctic @en
preferred label: Sydliga polarländerna. Antarktis @sv
scope note: Etelämanner

KANSATIEDE. KULTTUURIANTROPOLOGIA
type: Concept
References: YLEINEN USKONTOTIEDE
References: MUUT USKONNOT JA MYTOLOGIAT
References: Biologinen antropologia
References: Hoitomenetelmät
References: Kansantaide. Alkuperäiskansojen taide
References: Kansantanssit. Kansantanhut
References: Musiikin tutkimus
References: Etnomusiikki. Kansanmusiikki
References: KANSANRUNOUS
References: Kansanrunouden historia ja tutkimus
References: Suomen, suomalais-ugrilaisten ja uralilaisten kielten kirjallisuuden historia ja tutkimus
References: Suomenruotsalaisen kirjallisuuden historia ja tutkimus
References: Yleinen kulttuurihistoria
References: Yleinen arkeologia
References: Suomen historia, paikallishistoria
alternative label: Adventti, kansatiede (49+)
alternative label: Alkuperäiskansat, antropologia (49+)
alternative label: Alkuperäiskansat, kansatiede (49+)
alternative label: Ammatit, kansatiede (49+)
alternative label: Antropologia (49+)
alternative label: Antropologia, kulttuuriantropologia (49+)
alternative label: Antropologia, sosiaaliantropologia (49+)
alternative label: Astiat, kansatiede (49+)
alternative label: Asuinrakennukset, kansatiede (49+)
alternative label: Elinkeinot, kansatiede (49+)
alternative label: Esineellinen kulttuuri, kansatiede (49+)
alternative label: Etnografia, kansatiede (49+)
alternative label: Etnologia (49+)
alternative label: Etnososiologia (49+)
alternative label: Folkloristiikka, yl.(49+)
alternative label: Hautaustavat, kansatiede (49+)
alternative label: Henkinen kulttuuri, kansatiede (49+)
alternative label: Huonekalut, kansatiede (49+)
alternative label: Häämenot, kansatiede (49+)
alternative label: Ihminen, antropologia (49+)
alternative label: Ihminen, kulttuuriantropologia (49+)
alternative label: Ihminen, sosiaaliantropologia (49+)
alternative label: Ihmisyhteisöt, alkuperä ja kehitys (49+)
alternative label: Joulu, kansatiede (49+)
alternative label: Joulukoristeet, kansatiede (49+)
alternative label: Juhannus, kansatiede (49+)
alternative label: Juhlaperinne, kansatiede (49+)
alternative label: Juomaperinne, kansatiede (49+)
alternative label: Juutalaiset, kansatiede (49+)
alternative label: Kalastus, kansatiede (49+)
alternative label: Kalastusvälineet, kansatiede (49+)
alternative label: Kansallispuvut, kansatiede (49+)
alternative label: Kansanelämä, kansatiede (49+)
alternative label: Kansanomainen kulttuuri, kansatiede (49+)
alternative label: Kansanparannustaito, kansatiede (49+)
alternative label: Kansanperinne, kansatiede (49+)
alternative label: Kansanpuvut, kansatiede (49+)
alternative label: Kansantavat, kansatiede (49+)
alternative label: Kansanuskomukset, kansatiede (49+)
alternative label: Kansatiede (49+)
alternative label: Karstaus, kansatiede (49+)
alternative label: Kaskenviljely, kansatiede (49+)
alternative label: Kaupunkikulttuuri, kansanperinne (49+)
alternative label: Kehrääminen, kansatiede (49+)
alternative label: Koristeet, kansatiede (49+)
alternative label: Korut, kansatiede (49+)
alternative label: Kulkuneuvot, kansatiede (49+)
alternative label: Kulttuuriantropologia (49+)
alternative label: Kulttuurikehitys, kansatiede (49+)
alternative label: Kulttuurikehitys, kulttuuriantropologia (49+)
alternative label: Kulttuuriperintö, kansatiede ja kulttuuriantropologia (49+)
alternative label: Kulttuurit, alkuperä ja kehitys (49+)
alternative label: Käsityöammatit, kansatiede (49+)
alternative label: Laskiainen, kansatiede (49+)
alternative label: Leikit, kansatiede (49+)
alternative label: Liikennevälineet, kansatiede (49+)
broader: MAANTIEDE. MATKAT. KANSATIEDE
in scheme: YKL - Yleisten kirjastojen luokitusjärjestelmä
narrower: Euroopan kansojen kansatiede
narrower: Suomen ja suomalais-ugrilaisten kansojen kansatiede
narrower: Muiden kansojen kansatiede
notation: 49
scope note: Hit och till underklasserna etnologi och etnografi samt kultur- och socialantropologi. Hit och till underklasserna också föremålskultur, näringar, folkliv, folklore och folkseder samt mänskliga gemenskapers och kulturens ursprung och utveckling ur etnologisk och antropologisk synvinkel. Kulturarv från etnologins och kulturantropologins synvinkel. Hit och till underklasserna också allmänna verk om antropologi som innehåller både kultur-eller socialantropologi och biologisk eller fysisk antropologi. Om verket innehåller både etnologi och folkkonst eller ursprungsfolkens konst ges företräde åt klass 49+. Om verket innehåller både etnologi och historia ges företräde åt klass 9 @sv
scope note: Tähän ja alaluokkiin etnologia ja etnografia sekä kulttuuri- ja sosiaaliantropologia. Tähän ja alaluokkiin myös esineellinen kulttuuri, elinkeinot, kansanelämä, kansanperinne ja kansantavat sekä ihmisyhteisöjen ja kulttuurien alkuperä ja kehitys kansatieteen ja kulttuuriantropologian kannalta. Kulttuuriperintö kansatieteen ja antropologian kannalta. Tähän ja alaluokkiin myös antropologian yleisteokset, joissa on sekä kulttuuri- tai sosiaaliantropologiaa että biologista tai fyysistä antropologiaa. Jos teoksessa on sekä kansatiedettä että kansan- tai alkuperäiskansojen taidetta, annetaan etusija luokalle 49+. Jos teoksessa on sekä kansatiedettä että historiaa, annetaan etusija luokalle 9

Euroopan kansojen kansatiede
type: Concept
References: Suomen ja suomalais-ugrilaisten kansojen kansatiede
References: Muiden kansojen kansatiede
type: YKL-luokka
alternative label: Baltiska folk, etnologi (49.1) @sv
alternative label: Balttilaiset kansat, kansatiede (49.1)
alternative label: Basker, etnologi (49.1) @sv
alternative label: Baskit, kansatiede (49.1)
alternative label: Etnologi, europeiska folk (49.1) @sv
alternative label: Euroopan kansat, kansatiede (49.1)
alternative label: Europas folk, etnologi (49.1) @sv
alternative label: Germaaniset kansat, Euroopan kansatiede (49.1)
alternative label: Germanska folk, europeisk etnologi (49.1) @sv
alternative label: Kansatiede, Euroopan kansat (49.1)
alternative label: Kelter, etnologi (49.1) @sv
alternative label: Keltit, kansatiede (49.1)
alternative label: Nordiska folk, europeisk etnologi (49.1) @sv
alternative label: Pohjoismaiset kansat, Euroopan kansatiede (49.1)
alternative label: Romaaniset kansat, Euroopan kansatiede (49.1)
alternative label: Romanska folk, europeisk etnologi (49.1) @sv
alternative label: Slaavilaiset kansat, Euroopan kansatiede (49.1)
alternative label: Slaviska folk, europeisk etnologi (49.1) @sv
alternative label: Viikingit, kansatiede (49.1)
alternative label: Vikingar, etnologi (49.1) @sv
broader: KANSATIEDE. KULTTUURIANTROPOLOGIA
in scheme: YKL - Yleisten kirjastojen luokitusjärjestelmä
notation: 49.1
preferred label: De europeiska folkens etnologi @sv
preferred label: European ethnology @en
scope note: Hit allmänna etnologiska verk om Europas folk Hit också etnologiska verk om europeiska folk utom finnar, finlandssvenskar och finsk-ugriska folk Hit t.ex. de germanska, nordiska, slaviska, romanska och keltiska folkens etnologi @sv
scope note: Tähän Euroopan kansojen kansatieteen yleisteokset Tähän myös teokset, jotka koskevat muiden Euroopan kansojen kuin Suomen tai suomalais-ugrilaisten kansojen kansatiedettä Tähän esim. Euroopan germaanisten, pohjoismaisten, slaavilaisten, romaanisten ja kelttiläisten kansojen kansatiede

Suomen ja suomalais-ugrilaisten kansojen kansatiede
type: Concept
References: Euroopan kansojen kansatiede
References: Yleinen taidehistoria, Suomi
References: Kansantanssit. Kansantanhut
References: Musiikin tutkimus
References: Etnomusiikki. Kansanmusiikki, Suomi
References: KANSANRUNOUS
References: Suomen, suomalais-ugrilaisten ja uralilaisten kielten kirjallisuuden historia ja tutkimus
References: Suomenruotsalaisen kirjallisuuden historia ja tutkimus
References: SUOMEN HISTORIA
References: Suomen historia, paikallishistoria
type: YKL-luokka
alternative label: Ahvenanmaa, kansatiede (49.2+)
alternative label: Allmogekultur, finsk-ugrisk etnologi (49.2+) @sv
alternative label: Antropologi, finsk-ugriska folk (49.2+) @sv
alternative label: Antropologia, suom.-ugr. kansat (49.2+)
alternative label: Astiat, suom.-ugr. kansatiede (49.2)
alternative label: Bjarmer, etnologi (49.2+) @sv
alternative label: Bjarmit, kansatiede (49.2+)
alternative label: Esineellinen kulttuuri, suom.-ugr. kansatiede (49.2+)
alternative label: Etnografi, finsk-ugrisk etnologi (49.2+) @sv
alternative label: Etnografia, suom.-ugr. kansatiede (49.2+)
alternative label: Etnologi, finsk-ugrisk etnologi (49.2+) @sv
alternative label: Etnologi, finsk-ugriska folk (49.2+) @sv
alternative label: Etnologia, suom.-ugr. kansatiede (49.2+)
alternative label: Etnosociologi, finsk-ugrisk etnologi (49.2+) @sv
alternative label: Etnososiologia, suom.-ugr. kansatiede (49.2+)
alternative label: Finlandssvensk etnologi (49.2+) @sv
alternative label: Finsk etnologi (49.2+) @sv
alternative label: Finsk-ugrisk etnologi (49.2+) @sv
alternative label: Folklig kultur, finsk-ugrisk etnologi (49.2+) @sv
alternative label: Folkliv, finsk-ugrisk etnologi (49.2+) @sv
alternative label: Färdmedel, finsk-ugrisk etnologi (49.2) @sv
alternative label: Huonekalut, suom.-ugr. kansatiede (49.2)
alternative label: Judar, Finlands etnologi (49.2+) @sv
alternative label: Juutalaiset, Suomen kansatiede (49.2+)
alternative label: Kansanelämä, suom.-ugr. kansatiede (49.2+)
alternative label: Kansanomainen kulttuuri, suom.-ugr. kansatiede (49.2+)
alternative label: Kansatiede, suom.-ugr. kansat (49.2+)
alternative label: Kirkkoveneet, suom.-ugr. kansatiede (49.2)
alternative label: Kolttalappalaiset, kansatiede (49.2+)
alternative label: Kulkuneuvot, suom.-ugr. kansatiede (49.2)
alternative label: Kulttuuriantropologia, suom.-ugr. kansatiede (49.2+)
alternative label: Kulttuurikehitys, suom.-ugr. kansatiede (49.2+)
alternative label: Kulturantropologi, finsk-ugrisk etnologi (49.2+) @sv
alternative label: Kulturutveckling, finsk-ugrisk etnologi (49.2+) @sv
alternative label: Kveenit, kansatiede (49.2+)
alternative label: Kväner, etnologi (49.2+) @sv
alternative label: Kyrkbåtar, finsk-ugrisk etnologi (49.2) @sv
alternative label: Kärl, finsk-ugrisk etnologi (49.2) @sv
alternative label: Lappalaiset, kansatiede (49.2+)
alternative label: Liikennevälineet, suom.-ugr. kansatiede (49.2)
alternative label: Materiell kultur, finsk-ugrisk etnologi (49.2+) @sv
alternative label: Möbler, finsk-ugrisk etnologi (49.2) @sv
alternative label: Permalaiset, kansatiede (49.2+)
alternative label: Romanit, Suomen kansatiede (49.2+)
alternative label: Romer, finsk etnologi (49.2+) @sv
alternative label: Romer, finsk-ugrisk etnologi (49.2+) @sv
alternative label: Saamelaiset, kansatiede (49.2+)
alternative label: Samer, etnologi (49.2+) @sv
alternative label: Skidor, finsk-ugrisk etnologi (49.2) @sv
alternative label: Skoltsamer, etnologi (49.2+) @sv
alternative label: Sukset, suom.-ugr. kansatiede (49.2)
alternative label: Suomalais-ugrilainen kansatiede (49.2+)
alternative label: Suomen kansatiede (49.2+)
alternative label: Suomenruotsalaisten kansatiede (49.2+)
alternative label: Talonpoikaiskulttuuri, suom.-ugr. kansatiede (49.2+)
alternative label: Trafikmedel, finsk-ugrisk etnologi (49.2) @sv
alternative label: Åland, etnologi (49.2+) @sv
broader: KANSATIEDE. KULTTUURIANTROPOLOGIA
in scheme: YKL - Yleisten kirjastojen luokitusjärjestelmä
narrower: Suomen ja suomalais-ugrilaisten kansojen kansatiede, Rakennukset
narrower: Suomen ja suomalais-ugrilaisten kansojen kansatiede, Tekstiilit, kansanpuvut, korut
narrower: Suomen ja suomalais-ugrilaisten kansojen kansatiede, Elinkeinot. Työ. Työkalut
narrower: Suomen ja suomalais-ugrilaisten kansojen kansatiede, Kansantavat
notation: 49.2
preferred label: Finländsk och finsk-ugrisk etnologi @sv
preferred label: Finnish and Finno-Ugric ethnology @en
scope note: Hit Finlands och de finsk-ugriska folkens föremålskultur och folkliv ur etnologisk synpunkt Hit t.ex. möbler, kärl och fortskaffningsmedel ur den finländska och den finsk-ugriska etnologins synvinkel Hit och till underklasserna också finlandssvenskarnas etnologi Hit och till underklasserna också samernas etnologi Hit och till underklasserna också Finlands zigenares, judars och övriga folkgruppers etnologi Om verket innehåller både etnologi och folkkonst ges företräde åt klass 49+ Om verket innehåller både etnologi och historia ges företräde åt klass 92 @sv
scope note: Tähän Suomen ja suomalais-ugrilaisten kansojen esineellinen kulttuuri ja kansanelämä kansatieteen kannalta Tähän esim. huonekalut, astiat ja kulkuneuvot Suomen ja suomalais-ugrilaisen kansatieteen kannalta Tähän ja alaluokkiin myös suomenruotsalaisten kansatiede Tähän ja alaluokkiin myös saamelaisten kansatiede Tähän ja alaluokkiin myös Suomen mustalaisten ja juutalaisten sekä Suomen muiden väestöryhmien kansatiede Jos teoksessa on sekä kansatiedettä että kansantaidetta, annetaan etusija luokalle 49+ Jos teoksessa on sekä kansatiedettä että historiaa, annetaan etusija luokalle 92+

Suomen ja suomalais-ugrilaisten kansojen kansatiede, Rakennukset
type: Concept
References: RAKENNUSTEKNIIKKA
References: Rakennukset. Rakennustyypit
References: Arkkitehtuurin historia, Suomi
type: YKL-luokka
alternative label: Asuinrakennukset, suom.-ugr. kansatiede (49.22)
alternative label: Bastur, finsk-ugrisk etnologi (49.22) @sv
alternative label: Bostadsbyggnader, finsk-ugrisk etnologi (49.22) @sv
alternative label: Byggda rum, finsk-ugrisk etnologi (49.22) @sv
alternative label: Byggnader, finsk-ugrisk etnologi (49.22) @sv
alternative label: Ekonomibyggnader, finsk-ugrisk etnologi (49.22) @sv
alternative label: Lantbruksbyggnader, finsk-ugrisk etnologi (49.22) @sv
alternative label: Maatalousrakennukset, suom.-ugr. kansatiede (49.22)
alternative label: Rakennetut tilat, suom.-ugr. kansatiede (49.22)
alternative label: Rakennukset, suom.-ugr. kansatiede (49.22)
alternative label: Saunat, suom.-ugr. kansatiede (49.22)
alternative label: Talousrakennukset, suom.-ugr. kansatiede (49.22)
alternative label: Tuulimyllyt, suom.-ugr. kansatiede (49.22)
alternative label: Väderkvarnar, finsk-ugrisk etnologi (49.22) @sv
broader: Suomen ja suomalais-ugrilaisten kansojen kansatiede
in scheme: YKL - Yleisten kirjastojen luokitusjärjestelmä
notation: 49.22
preferred label: Finländsk och finsk-ugrisk etnologi, Byggnader @sv
preferred label: Finnish and Finno-Ugric ethnology, Buildings @en
scope note: Byggnader såsom bostäder, bastur och lantbruksbyggnader ur den finländska och den finsk-ugriska etnologins synvinkel Om verket innehåller både etnologi och byggnadsinstruktioner ges företräde åt klass 66 @sv
scope note: Rakennukset ja rakennetut tilat, kuten asuinrakennukset, saunat ja maatalousrakennukset, Suomen ja suomalais-ugrilaisten kansojen kansatieteen kannalta Jos teoksessa on sekä kansatiedettä että rakennusohjeita, annetaan etusija luokalle 66+

Suomen ja suomalais-ugrilaisten kansojen kansatiede, Tekstiilit, kansanpuvut, korut
type: Concept
References: Tekstiili- ja vaatetusteollisuus
References: Tekstiilityö
References: Tekstiilitaide
References: Taidetaonta. Korutaide
References: Muoti ja muodin historia
type: YKL-luokka
alternative label: Folkdräkter, finsk-ugrisk, etnologi (49.24) @sv
alternative label: Kansallispuvut, suom.-ugr. kansatiede (49.24)
alternative label: Kansanpuvut, suom.-ugr. kansatiede (49.24)
alternative label: Kläder, finsk-ugrisk etnologi (49.24) @sv
alternative label: Klädsel, finsk-ugrisk etnologi (49.24) @sv
alternative label: Koristeet, suom.-ugr. kansatiede (49.24)
alternative label: Korut, suom.-ugr. kansatiede (49.24)
alternative label: Nationaldräkter, finsk-ugrisk etnologi (49.24) @sv
alternative label: Prydnader, finsk-ugrisk etnologi (49.24) @sv
alternative label: Pukeutuminen, suom.-ugr. kansatiede (49.24)
alternative label: Smycken, finsk-ugrisk etnologi (49.24) @sv
alternative label: Tekstiilit, suom.-ugr. kansatiede (49.24)
alternative label: Textilier, finsk-ugrisk etnologi (49.24) @sv
alternative label: Vaatteet, suom.-ugr. kansatiede (49.24)
broader: Suomen ja suomalais-ugrilaisten kansojen kansatiede
in scheme: YKL - Yleisten kirjastojen luokitusjärjestelmä
notation: 49.24
preferred label: Finländsk och finsk-ugrisk etnologi, Textilier, folkdräkte, smycken @sv
preferred label: Finnish and Finno-Ugric ethnology, Textiles, folk costumes, trinkets @en
scope note: Hit också klädsel och den utstyrsel som hör till folkdräkterna ur den finländska och den finsk-ugriska etnologins synvinkel Om verket innehåller både etnologi och arbetsbeskrivningar av textilhandarbete, ges företräde åt klass 65.4+ @sv
scope note: Tähän myös pukeutuminen ja kansanpukuihin kuuluvat koristeet Suomen ja suomalais-ugrilaisen kansatieteen kannalta Jos teoksessa on sekä kansatiedettä että tekstiili- käsityöohjeita, annetaan etusija luokalle 65.4+

Suomen ja suomalais-ugrilaisten kansojen kansatiede, Elinkeinot. Työ. Työkalut
type: Concept
References: Työ. Työelämä
References: SOVELLETUT TIETEET
References: TIETOTEKNIIKKA. TIETOLIIKENNE. VIESTINTÄTEKNIIKKA. TEKOÄLY
References: METALLITEOLLISUUS. KONETEKNIIKKA. LIIKENNEVÄLINEET SÄHKÖTEKNIIKKA
References: KAIVANNAISTEOLLISUUS. KEMIANTEOLLISUUS
References: PUUNJALOSTUSTEOLLISUUS. TEKSTIILITEOLLISUUS NAHKATEOLLISUUS. HIENOMEKAANINEN TEOLLISUUS
References: KÄSITYÖ. KOTITEOLLISUUS
References: MAA- JA METSÄTALOUS. ELINTARVIKETEOLLISUUS. BIOTEKNIIKKA
References: URN:NBN:fi:au:ykl:67.09
References: Maanviljely. Puutarhanhoito. Hyötykasvit
References: Kotieläintalous. Kotieläinten hoito
References: Metsätalous
References: Metsästys. Kalastus
type: YKL-luokka
alternative label: Ammatit, suom.-ugr. kansatiede (49.25)
alternative label: Arbete, finsk-ugrisk etnologi (49.25) @sv
alternative label: Elinkeinot, suom.-ugr. kansatiede (49.25)
alternative label: Fiske, finsk-ugrisk etnologi (49.25) @sv
alternative label: Fiskeredskap, finsk-ugrisk etnologi (49.25) @sv
alternative label: Garvarens arbete, finsk-ugrisk etnologi (49.25) @sv
alternative label: Hantverksyrken, finsk-ugrisk etnologi (49.25) @sv
alternative label: Industriella yrken, finsk-ugrisk etnologi (49.25) @sv
alternative label: Jakt, finsk-ugrisk etnologi (49.25) @sv
alternative label: Jaktredskap, finsk-ugrisk etnologi (49.25) @sv
alternative label: Jordbruk, finsk-ugrisk etnologi (49.25) @sv
alternative label: Kalastus, suom.-ugr. kansatiede (49.25)
alternative label: Kalastusvälineet, suom.-ugr. kansatiede (49.25)
alternative label: Kardning, finsk-ugrisk etnologi (49.25) @sv
alternative label: Karstaus, suom.-ugr. kansatiede (49.25)
alternative label: Kaskenviljely, suom.-ugr. kansatiede (49.25)
alternative label: Kehrääminen, suom.-ugr. kansatiede (49.25)
alternative label: Käsityöammatit, suom.-ugr. kansatiede (49.25)
alternative label: Körsnärens arbete, finsk-ugrisk etnologi (49.25) @sv
alternative label: Lantbruk, finsk-ugrisk etnologi (49.25) @sv
alternative label: Lantbruksredskap, finsk-ugrisk etnologi (49.25) @sv
alternative label: Maanviljely, suom.-ugr. kansatiede (49.25)
alternative label: Maatalous, suom.-ugr. kansatiede (49.25)
alternative label: Maataloustyövälineet, suom.-ugr. kansatiede (49.25)
alternative label: Metsästys, suom.-ugr. kansatiede (49.25)
alternative label: Metsästysvälineet, suom.-ugr. kansatiede (49.25)
alternative label: Metsätyöt, suom.-ugr. kansatiede (49.25)
alternative label: Nahkurin työ, suom.-ugr. kansatiede (49.25)
alternative label: Näringar, finsk-ugrisk etnologi (49.25) @sv
alternative label: Ompelijan työ, suom.-ugr. kansatiede (49.25)
alternative label: Räätälin työ, suom.-ugr. kansatiede (49.25)
alternative label: Sadelmakarens arbete, finsk-ugrisk etnologi (49.25) @sv
alternative label: Satulasepän työ, suom.-ugr. kansatiede (49.25)
alternative label: Sepän työ, suom.-ugr. kansatiede (49.25)
alternative label: Skogsarbeten, finsk-ugrisk etnologi (49.25) @sv
alternative label: Skomakarens arbete, finsk-ugrisk etnologi (49.25) @sv
alternative label: Skräddarens arbete, finsk-ugrisk etnologi (49.25) @sv
alternative label: Smedens arbete, finsk-ugrisk etnologi (49.25) @sv
alternative label: Spinning, finsk-ugrisk etnologi (49.25) @sv
alternative label: Suutarin työ, suom.-ugr. kansatiede (49.25)
alternative label: Svedjebruk, finsk-ugrisk etnologi (49.25) @sv
alternative label: Sömmerskans arbete, finsk-ugrisk etnologi (49.25) @sv
alternative label: Teollisuusammatit, suom.-ugr. kansatiede (49.25)
alternative label: Tervanpoltto, suom.-ugr. kansatiede (49.25)
alternative label: Tjärbränning, finsk-ugrisk etnologi (49.25) @sv
alternative label: Turkkurin työ, suom.-ugr. kansatiede (49.25)
alternative label: Työ, suom.-ugr. kansatiede (49.25)
alternative label: Työkalut, suom.-ugr. kansatiede (49.25)
alternative label: Vaatturin työ, suom.-ugr. kansatiede (49.25)
alternative label: Verktyg, finsk-ugrisk etnologi (49.25) @sv
alternative label: Yrken, finsk-ugrisk etnografi (49.25) @sv
broader: Suomen ja suomalais-ugrilaisten kansojen kansatiede
in scheme: YKL - Yleisten kirjastojen luokitusjärjestelmä
notation: 49.25
preferred label: Finländsk och finsk-ugrisk etnologi, Näringar, arbete, redskap @sv
preferred label: Finnish and Finno-Ugric ethnology, Means of livelihood, work, tools @en
scope note: Elinkeinot ja ammatit sekä työ ja työkalut Suomen ja suomalais-ugrilaisen kansatieteen kannalta Tähän esim. maa- ja metsätalousammatit, teollisuus- ja käsityöammatit sekä metsästys ja kalastus Suomen ja suomalais-ugrilaisen kansatieteen kannalta Jos teoksessa on sekä kansatiedettä että käsityöohjeita, annetaan etusija luokalle 65+
scope note: Näringar och yrken samt arbete och redskap ur den finländska och den finsk-ugriska etnologins synvinkel Hit t.ex. lant- och skogsbruksyrken, industri- och hantverkaryrken samt jakt och fiske ur den finländska och den finsk-ugriska etnologins synvinkel Om verket innehåller både etnologi och handarbetsbeskrivningar ges företräde åt klass 65+ @sv

Suomen ja suomalais-ugrilaisten kansojen kansatiede, Kansantavat
type: Concept
References: Suomalais-ugrilaisten kansojen muinaisuskonnot ja mytologiat
References: Käytös- ja tapatieto
References: Hoitomenetelmät
References: Leikkikalut
References: Leikit
References: KANSANRUNOUS
References: Suomen, suomalais-ugrilaisten ja uralilaisten kielten kirjallisuuden historia ja tutkimus
References: Suomenruotsalaisen kirjallisuuden historia ja tutkimus
References: SUOMEN HISTORIA
type: YKL-luokka
alternative label: Bastubadande, finsk-ugrisk etnologi (49.26+) @sv
alternative label: Folklig läkekonst, finsk-ugrisk etnologi (49.26) @sv
alternative label: Folkliga trosföreställningar, finsk-ugrisk etnologi (49.26+) @sv
alternative label: Folklore, finsk-ugrisk etnologi (49.26+) @sv
alternative label: Folkseder, finsk-ugrisk etnologi (49.26+) @sv
alternative label: Föreställningar, finsk-ugrisk etnologi (49.26+) @sv
alternative label: Kansanparannustaito, suom.-ugr. Kansatiede (49.26)
alternative label: Kansanperinne, suom.-ugr. kansatiede (49.26+)
alternative label: Kansantavat, suom.-ugr. kansatiede (49.26+)
alternative label: Kansanuskomukset, suom.-ugr. kansatiede (49.26+)
alternative label: Leikit, suom.-ugr. kansatiede (49.26+)
alternative label: Lekar, finsk-ugrisk etnologi (49.26+) @sv
alternative label: Perinteet, suom.-ugr. kansatiede (49.26+)
alternative label: Saunominen, suom.-ugr. kansatiede (49.26+)
alternative label: Seder och bruk, finsk-ugrisk etnologi (49.26+) @sv
alternative label: Seder, finsk-ugrisk etnologi (49.26+) @sv
alternative label: Tapakulttuuri suom.-ugr. kansatiede (49.26+)
alternative label: Tavat, suom.-ugr. kansatiede (49.26+)
alternative label: Traditioner, finsk-ugrisk etnologi (49.26+) @sv
alternative label: Uskomukset, suom.-ugr. kansatiede (49.26+)
broader: Suomen ja suomalais-ugrilaisten kansojen kansatiede
in scheme: YKL - Yleisten kirjastojen luokitusjärjestelmä
narrower: Suomen ja suomalais-ugrilaisten kansojen kansatiede, Juhlaperinne, ruoka- ja juomaperinne
notation: 49.26
preferred label: Finländsk och finsk-ugrisk etnologi, Folkseder @sv
preferred label: Finnish and Finno-Ugric ethnology, Folk customs @en
scope note: Folkseder, lekar, traditioner och föreställningar ur den finländska och den finsk-ugriska etnologins synvinkel Hit även folkliga botemedel ur den finländska och finsk-ugriska etnologins synvinkel Om verket innehåller både etnologi och beskrivningar av hur man bygger leksaker eller lekinstruktioner, ges företräde åt klasserna 65.8 och 79.84+ @sv
scope note: Kansantavat, leikit, perinteet ja uskomukset Suomen ja suomalais-ugrilaisen kansatieteen kannalta Tähän myös kansanomaiset parannuskeinot Suomen ja suom.-urg. kansatieteen kannalta Jos teoksessa on sekä kansatiedettä että leikkikalujen rakennusohjeita tai leikkiohjeita, annetaan etusija luokille 65.8 ja 79.84+

Suomen ja suomalais-ugrilaisten kansojen kansatiede, Juhlaperinne, ruoka- ja juomaperinne
type: Concept
References: Sakraaliteologia
References: Juhlien järjestäminen
References: KÄSITYÖ. KOTITEOLLISUUS
References: Ruokalajit ja ruokakulttuuri, Suomi
type: YKL-luokka
alternative label: Advent, finsk-ugrisk etnologi (49.262) @sv
alternative label: Adventti, suom.-ugr. kansatiede (49.262)
alternative label: Begravningsskick, finsk-ugrisk etnologi (49.262) @sv
alternative label: Bröllopsceremonier, finsk-ugrisk etnologi (49.262) @sv
alternative label: Dryckestradition, finsk-ugrisk etnologi (49.262) @sv
alternative label: Fastslag, finsk-ugrisk etnologi (49.262) @sv
alternative label: Festtradition, finsk-ugrisk etnologi (49.262) @sv
alternative label: Födelsedagsfester, finsk-ugrisk etnologi (49.262) @sv
alternative label: Första maj, finsk-ugrisk etnologi (49.262) @sv
alternative label: Hautaustavat, suom.-ugr. kansatiede (49.262)
alternative label: Häämenot, suom.-ugr. kansatiede (49.262)
alternative label: Joulu, suom.-ugr. kansatiede (49.262)
alternative label: Juhannus, suom.-ugr. kansatiede (49.262)
alternative label: Juhlaperinne, suom.-ugr. kansatiede (49.262)
alternative label: Jul, finsk-ugrisk etnologi (49.262) @sv
alternative label: Juomaperinne, suom.-ugr. kansatiede (49.262)
alternative label: Laskiainen, suom.-ugr. kansatiede (49.262)
alternative label: Mattradition, finsk-ugrisk etnologi (49.262) @sv
alternative label: Midsommar, finsk-ugrisk etnologi (49.262) @sv
alternative label: Mors dag, finsk-ugrisk etnologi (49.262) @sv
alternative label: Namnsdagsfester, finsk-ugrisk etnologi (49.262) @sv
alternative label: Nimipäiväjuhlat, suom.-ugr. kansatiede (49.262)
alternative label: Nyår, finsk-ugrisk etnologi (49.262) @sv
alternative label: Perinneruoat, suom.-ugr. kansatiede (49.262)
alternative label: Pääsiäinen, suom.-ugr. kansatiede (49.262)
alternative label: Påsk, finsk-ugrisk etnologi (49.262) @sv
alternative label: Ruokaperinne, suom.-ugr. kansatiede (49.262)
alternative label: Syntymäpäiväjuhlat, suom.-ugr. kansatiede (49.262)
alternative label: Traditionsrätter, finsk-ugrisk etnologi (49.262) @sv
alternative label: Uusi vuosi, suom.-ugr. kansatiede (49.262)
alternative label: Vappu, suom.-ugr. kansatiede (49.262)
alternative label: Äitienpäivä, suom.-ugr. kansatiede (49.262)
broader: Suomen ja suomalais-ugrilaisten kansojen kansatiede, Kansantavat
in scheme: YKL - Yleisten kirjastojen luokitusjärjestelmä
notation: 49.262
preferred label: Finländsk och finsk-ugrisk etnologi, Festtraditioner, mat- och dryckestraditioner @sv
preferred label: Finnish and Finno-Ugric ethnology, Festivals, food and drink @en
scope note: Fest-, mat- och dryckestraditioner ur den finländska och den finskugriska etnologins synvinkel Jul, nyår, fastlagen, påsk, I maj, mors dag, midsommar, namnsdagar och födelsedagar, bröllop och begravningar ur den finländska och den finsk-ugriska etnologins synvinkel Om verket innehåller både etnologi och handarbetsinstruktioner eller recept, ges företräde åt klasserna 65+ och 68.252 @sv
scope note: Juhla-, ruoka- ja juomaperinne Suomen ja suomalais-ugrilaisen kansatieteen kannalta Joulu, uusi vuosi, laskiainen, pääsiäinen, vappu, äitienpäivä, juhannus, nimi- ja syntymäpäiväjuhlat, häät ja hautajaiset Suomen ja suomalais-ugrilaisen kansatieteen kannalta Jos teoksessa on sekä kansatiedettä että käsityö- tai ruokaohjeita, annetaan etusija luokille 65+ ja 68.252

Muiden kansojen kansatiede
type: Concept
References: MUUT MAANOSAT
References: MUIDEN MAANOSIEN HISTORIA
type: YKL-luokka
broader: KANSATIEDE. KULTTUURIANTROPOLOGIA
in scheme: YKL - Yleisten kirjastojen luokitusjärjestelmä
narrower: Aasian kansojen kansatiede
narrower: Afrikan kansojen kansatiede
narrower: Amerikan kansojen kansatiede
narrower: Australian, Oseanian ja napamaiden kansojen kansatiede
notation: 49.5
preferred label: Non-European ethnology @en
preferred label: Övriga folk @sv
scope note: Hit och till underklasserna etnografiska verk om både ursprungsfolk och befolkning av europeiskt ursprung i övriga världsdelar samt om judarna och zigenarna @sv
scope note: Tähän ja alaluokkiin sekä muiden maanosien alkuperäiskansojen että esim. eurooppalaisperäisen väestönosan, juutalaisten ja mustalaisten kansatiede

Aasian kansojen kansatiede
type: Concept
References: Aasia
References: Suomen ja suomalais-ugrilaisten kansojen kansatiede
References: Aasian historia
type: YKL-luokka
alternative label: Aasian kansat, kansatiede (49.51)
alternative label: Asiens folk, etnologi (49.51) @sv
alternative label: Etnologi, Asiens folk (49.51) @sv
alternative label: Kansatiede, Aasian kansat (49.51)
alternative label: Kurder, etnologi (49.51) @sv
alternative label: Kurdit, kansatiede (49.51)
broader: Muiden kansojen kansatiede
in scheme: YKL - Yleisten kirjastojen luokitusjärjestelmä
notation: 49.51
preferred label: Asian ethnology @en
preferred label: Asiatiska folk @sv

Afrikan kansojen kansatiede
type: Concept
References: Afrikka
References: Afrikan historia
type: YKL-luokka
alternative label: Afrikan kansat, kansatiede (49.52)
alternative label: Afrikas folk, etnologi (49.52) @sv
alternative label: Beduiinit, kansatiede (49.52)
alternative label: Beduiner, etnologi (49.52) @sv
alternative label: Berber, etnologi (49.52) @sv
alternative label: Berberit, kansatiede (49.52)
alternative label: Etnologi, Afrikas folk (49.52) @sv
alternative label: Kansatiede, Afrikan kansat (49.52)
broader: Muiden kansojen kansatiede
in scheme: YKL - Yleisten kirjastojen luokitusjärjestelmä
notation: 49.52
preferred label: African ethnology @en
preferred label: Afrikanska folk @sv

Amerikan kansojen kansatiede
type: Concept
References: Amerikka
References: Amerikan historia
type: YKL-luokka
alternative label: Amerikan kansat, kansatiede (49.53)
alternative label: Amerikas folk, etnologi (49.53) @sv
alternative label: Asteekit, kansatiede (49.53)
alternative label: Azteker, etnologi (49.53) @sv
alternative label: Etnologi, Amerikas folk (49.53) @sv
alternative label: Inkafolket, etnologi (49.53) @sv
alternative label: Inkat, kansatiede (49.53)
alternative label: Kansatiede, Amerikan kansat (49.53)
alternative label: Mayafolket, etnologi (49.53) @sv
alternative label: Mayat, kansatiede (49.53)
broader: Muiden kansojen kansatiede
in scheme: YKL - Yleisten kirjastojen luokitusjärjestelmä
notation: 49.53
preferred label: American ethnology @en
preferred label: Amerikanska folk @sv

Australian, Oseanian ja napamaiden kansojen kansatiede
type: Concept
References: Australia ja Oseania
References: Napamaat
References: Australian ja Oseanian historia
References: Napamaiden historia
type: YKL-luokka
alternative label: Aboriginaalit, Australian kansatiede (49.55)
alternative label: Aboriginer, Australiens etnologi (49.55) @sv
alternative label: Australia, aboriginaalit, kansatiede (49.55)
alternative label: Australia, kansatiede (49.55)
alternative label: Australian kansat, kansatiede (49.55)
alternative label: Australien, aboriginer, etnologi (49.55) @sv
alternative label: Australien, etnologi (49.55) @sv
alternative label: Australiens folk, etnologi (49.55) @sv
alternative label: Etnologi, Australien, Oceanien och Polarländerna (49.55) @sv
alternative label: Iglor, etnologi (49.55) @sv
alternative label: Iglut, kansatiede (49.55)
alternative label: Inuiter, etnologi (49.55) @sv
alternative label: Inuitit, kansatiede (49.55)
alternative label: Kansatiede, Australia, Oseania ja Napamaat (49.55)
alternative label: Oceanien, etnologi (49.55) @sv
alternative label: Oseania, kansatiede (49.55)
broader: Muiden kansojen kansatiede
in scheme: YKL - Yleisten kirjastojen luokitusjärjestelmä
notation: 49.55
preferred label: Australian and Oceanian ethnology. Ethnology of the polar regions @en
preferred label: Australiska och oceaniska folk och polarfolk @sv
scope note: Hit också de australiska aboriginernas och inuiternas etnografi @sv
scope note: Tähän myös Australian aborigiinien sekä inuitien kansatiede

LUONNONTIETEET. MATEMATIIKKA. LÄÄKETIEDE
type: Concept
type: YKL-luokka
in scheme: YKL - Yleisten kirjastojen luokitusjärjestelmä
narrower: LUONNONTIETEET
narrower: MATEMATIIKKA
narrower: TÄHTITIEDE. GEODESIA
narrower: FYSIIKKA
narrower: KEMIA
narrower: FYYSINEN MAANTIEDE. GEOLOGIA
narrower: BIOLOGIA
narrower: KASVITIEDE. SIENITIEDE
narrower: ELÄINTIEDE
narrower: LÄÄKETIEDE. TERVEYDENHOITO
notation: 5
preferred label: NATURAL SCIENCES. MATHEMATICS. MEDICINE @en
preferred label: NATURVETENSKAPER. MATEMATIK. MEDICIN @sv
top concept of: YKL - Yleisten kirjastojen luokitusjärjestelmä

LUONNONTIETEET
type: Concept
References: URN:NBN:fi:au:ykl:16.09
References: Tiedeoppi. Tieteenfilosofia
References: BIOLOGIA
References: Luonto-oppaat
type: YKL-luokka
alternative label: Ljudlandskap, allm. (50) @sv
alternative label: Ljudmiljö, allm. (50) @sv
alternative label: Luonnonfilosofia, luonnontieteet (50+)
alternative label: Luonnonoppi, yl. (50)
alternative label: Luonnontieteet (50 ... 58+)
alternative label: Luonnontieteet, yl. (50)
alternative label: Luonnontutkimus (50 ... 58+)
alternative label: Luonnontutkimus, yl. (50)
alternative label: Luonnonäänet, yl. (50)
alternative label: Luontoasemat (50+)
alternative label: Luontokeskukset (50+)
alternative label: Luontoäänet, yl. (50)
alternative label: Läten, naturljud, allm. (50) @sv
alternative label: Naturfilosofi, naturvetenskaper (50+) @sv
alternative label: Naturforskning (50 ... 58+) @sv
alternative label: Naturforskning (50) @sv
alternative label: Naturljud, allm. (50) @sv
alternative label: Naturlära, allm. (50) @sv
alternative label: Naturstationer (50+) @sv
alternative label: Naturum (50+) @sv
alternative label: Naturvetenskaper (50 ... 58+) @sv
alternative label: Naturvetenskaper, allm. (50) @sv
alternative label: Äänet, luonnonäänet, yl. (50)
alternative label: Äänimaisema, yl. (50)
alternative label: Ääniympäristö, yl. (50)
broader: LUONNONTIETEET. MATEMATIIKKA. LÄÄKETIEDE
in scheme: YKL - Yleisten kirjastojen luokitusjärjestelmä
narrower: Ympäristönsuojelu. Luonnonsuojelu
notation: 50
preferred label: NATURAL SCIENCES @en
preferred label: NATURVETENSKAPER @sv
scope note: Hit allmänna naturvetenskapliga verk samt verk som behandlar flera olika naturvetenskapliga områden eller naturen och naturforskning i allmänhet. Om verkets tyngdpunkt ligger på ett enskilt område inom naturvetenskapen, ges företräde åt ifrågavarande områdes klass. Naturvetenskapernas filosofi, teori och forskningsmetoder i allmänhet 50.01. Naturvetenskapernas historia i allmänhet 50.09 @sv
scope note: Tähän luonnontieteiden yleisteokset sekä teokset, jotka koskevat useita eri luonnontieteen aloja tai luontoa ja luonnon tutkimusta yleensä. Jos teos painottuu johonkin tiettyyn luonnontieteen alaan, annetaan etusija ko. alan luokalle. Luonnontieteiden filosofia, teoria ja tutkimusmenetelmät, yleensä 50.01. Luonnontieteiden historia yleensä 50.09

Ympäristönsuojelu. Luonnonsuojelu
type: Concept
References: Talousoikeus
References: ALUESUUNNITTELU. ALUEPOLITIIKKA
References: Yhdyskuntasuunnittelu. Kaupunkisuunnittelu. Ympäristönsuunnittelu
References: Pääoma. Luonnonvarat
References: Ekologia. Eliömaantiede
References: Kasviekologia. Kasvimaantiede
References: Eläinten elintavat
References: Sosiaalilääketiede. Ympäristölääketiede
References: Energia
References: Kunnallistekninen ympäristönhuolto
References: Metsätalous
alternative label: Arot, suojelu (50.1+)
alternative label: Avohakkuu, metsien suojelu (50.1+)
alternative label: Biodiversiteetti, luonnonsuojelu (50.1+)
alternative label: Biosfääri, ympäristönsuojelu (50.1+)
alternative label: Biosidit, ympäristönsuojelu (50.1+)
alternative label: Ekofilosofia (50.1+)
alternative label: Ekologia, ihminen (50.1+)
alternative label: Ekologia, ympäristönsuojelu (50.1+)
alternative label: Ekosysteemit, ympäristönsuojelu (50.1+)
alternative label: Elinympäristöt, ympäristönsuojelu (50.1+)
alternative label: Ennallistaminen, luonnonsuojelu (50.1+)
alternative label: Erämaat, suojelu (50.1+)
alternative label: Hakkuut, metsien suojelu (50.1+)
alternative label: Happamoituminen, ympäristönsuojelu (50.1+)
alternative label: Happosateet (50.1+)
alternative label: Hyönteismyrkyt, ympäristönsuojelu (50.1+)
alternative label: Ihminen, ekologia (50.1+)
alternative label: Jakamistalous, ympäristönsuojelu (50.1)
alternative label: Jätteet, ympäristönsuojelu (50.1+)
alternative label: Kasvinsuojeluaineet, ympäristönsuojelu (50.1+)
alternative label: Katastrofit, ympäristökatastrofit (50.1+)
alternative label: Kestävyystiede (50.1)
alternative label: Kestävä kehitys (50.1+)
alternative label: Kiertotalous, ympäristönsuojelu (50.1)
alternative label: Koralliriutat, suojelu (50.1+)
alternative label: Kosteikot, suojelu (50.1+)
alternative label: Kulttuurinen merentutkimus, ympäristösosiologia (50.1)
alternative label: Luonnon monimuotoisuus, luonnonsuojelu (50.1+)
alternative label: Luonnon saastuminen (50.1+)
alternative label: Luonnon tasapaino, ympäristönsuojelu (50.1+)
alternative label: Luonnonmaisema, suojelu (50.1+)
alternative label: Luonnonsuojelu (50.1+)
alternative label: Luonnonvarat, ympäristönsuojelu (50.1+)
alternative label: Luontokeskukset, luonnonsuojelu (50.1+)
alternative label: Luontosuhde (50.1)
alternative label: Luontosuhde, kaupunkiympäristö (50.1)
alternative label: Maaekosysteemit, suojelu (50.1+)
alternative label: Maailmanloppu, ympäristötuhot (50.1+)
alternative label: Maisemansuojelu (50.1)
alternative label: Maisemansuojelu, luonnonmaisema (50.1+)
alternative label: Metsien suojelu, luonnonsuojelu (50.1+)
alternative label: Metsiensuojelu, luonnonsuojelu (50.1+)
alternative label: Metsäkuolemat (50.1+)
alternative label: Metsänsuojelu, luonnonsuojelu (50.1+)
alternative label: Metsät, suojelu (50.1+)
alternative label: Napa-alueet, suojelu (50.1+)
alternative label: Ojitus, luonnonsuojelu (50.1+)
alternative label: Onnettomuudet, ympäristöonnettomuudet (50.1+)
alternative label: PCB-muovit, ympäristönsuojelu (50.1+)
alternative label: Preeriat, suojelu (50.1+)
alternative label: Päästöt (50.1)
alternative label: Rantojensuojelu (50.1)
alternative label: Raskasmetallit, ympäristöongelmat (50.1+)
alternative label: Ravintoketjut, ympäristömyrkyt (50.1+)
alternative label: Saasteet, ympäristönsuojelu (50.1+)
alternative label: Saastuminen (50.1+)
alternative label: Sademetsät, suojelu (50.1+)
alternative label: Savannit, suojelu (50.1+)
broader: LUONNONTIETEET
in scheme: YKL - Yleisten kirjastojen luokitusjärjestelmä
narrower: Uhanalaiset lajit. Luonnonsuojelualueet
narrower: Ilmansuojelu
narrower: Vesiensuojelu
narrower: Maaperänsuojelu
narrower: Eläinsuojelu
notation: 50.1
scope note: Hit allmänna verk om miljövård, naturvård och hållbar utveckling. Miljövetenskaper, miljöfrågor och miljöpolitik ur miljövårdens synvinkel . Miljöfostran. Miljöupplysning. Undersökning, uppföljning, övervakning och reglering av miljöns tillstånd. Administration av miljö- och naturvård. Miljöekonomi ur miljösynpunkt. Balansen i naturen, ekosystemen, levnadsmiljöer och naturresurser ur miljö- och naturvårdens synvinkel. Människans ekologi. Miljöskador. Miljökatastrofer. Miljögifter. Föroreningar. Nedsmutsning. De sura regnens inverkan på naturen. Vård av skogar, kärr och våtmarker. Skogsdöd. Vård av naturlandskapet. Allmänna verk om landskapsskydd. Hit också allmänna verk om miljövårdsteknik. Miljövårdsteknik som hänför sig till enskilda områden klassificeras enligt område. Miljöfilosofi och ekofilosofi i allmänhet 50.101. Greenpeace och World Wildlife Fund i allmänhet 50.106 @sv
scope note: Tähän ympäristönsuojelun, luonnonsuojelun ja kestävän kehityksen yleisteokset. Ympäristötieteet, ympäristökysymykset ja ympäristöpolitiikka ympäristönsuojelun kannalta. Ympäristökasvatus. Ympäristövalistus. Ympäristön tilan tutkimus, seuranta, valvonta ja säätely. Ympäristön- ja luonnonsuojelun hallinto. Ympäristötalous ympäristön kannalta . Luonnon tasapaino, ekosysteemit, elinympäristöt ja luonnonvarat luonnon- ja ympäristönsuojelun kannalta . Ihmisen ekologia. Ympäristövauriot. Ympäristökatastrofit . Ympäristömyrkyt. Saasteet. Saastuminen . Happosateiden vaikutukset luontoon. Metsien, soiden ja kosteikkojen suojelu. Metsäkuolemat. Luonnonmaiseman suojelu. Maisemansuojelun yleisteokset. Tähän myös ympäristönsuojelutekniikan yleisteokset. Tiettyyn alaan liittyvä ympäristönsuojelutekniikka luokitetaan alan mukaan. Ympäristöfilosofia ja ekofilosofia yleensä 50.101. Greenpeace ja World Wildlife Fund yleensä 50.106

Uhanalaiset lajit. Luonnonsuojelualueet
type: Concept
References: Talousoikeus
References: Maa- ja metsätalouslainsäädäntö
References: Eläinsuojelu
References: KASVITIEDE. SIENITIEDE
References: ELÄINTIEDE
References: Metsästys. Kalastus
type: YKL-luokka
alternative label: Djur, fredning och skydd (50.11) @sv
alternative label: Djur, skydd av djurarter (50.11) @sv
alternative label: Djurarter, fredning och skydd (50.11) @sv
alternative label: Djurhandel, utrotningshotade arter (50.11) @sv
alternative label: Djurskyddsområden (50.11) @sv
alternative label: Eläimet, eläinlajien suojelu (50.11)
alternative label: Eläimet, rauhoitus ja suojelu (50.11)
alternative label: Eläimistön suojelu, eläinlajien suojelu (50.11)
alternative label: Eläinkauppa, uhanalaiset lajit (50.11)
alternative label: Eläinlajit, rauhoitus ja suojelu (50.11)
alternative label: Eläinsuojelualueet (50.11)
alternative label: Faunavård, skydd av djurarter (50.11) @sv
alternative label: Floravård (50.11) @sv
alternative label: Fredning, miljövård (50.11) @sv
alternative label: Fågelfauna, skydd (50.11) @sv
alternative label: Fågelskydd (50.11) @sv
alternative label: Fåglar, skydd (50.11) @sv
alternative label: Havsdjur, skydd (50.11) @sv
alternative label: Hylkeet, luonnonsuojelu (50.11)
alternative label: Kansallispuistot (50.11)
alternative label: Kasvilajit, rauhoitus ja suojelu (50.11)
alternative label: Kasviston suojelu (50.11)
alternative label: Kasvistonsuojelualueet (50.11)
alternative label: Kasvit, rauhoitus ja suojelu (50.11)
alternative label: Linnusto, suojelu (50.11)
alternative label: Linnut, suojelu (50.11)
alternative label: Lintujen suojelu (50.11)
alternative label: Luonnonpuistot (50.11)
alternative label: Luonnonsuojelualueet (50.11)
alternative label: Merieläimet, suojelu (50.11)
alternative label: Nationalparker (50.11) @sv
alternative label: Naturparker (50.11) @sv
alternative label: Naturskyddsområden (50.11) @sv
alternative label: Petoeläimet, suojelu (50.11)
alternative label: Puulajit, rauhoitus ja suojelu (50.11)
alternative label: Puut, rauhoitus ja suojelu (50.11)
alternative label: Rauhoitus, luonnonsuojelu (50.11)
alternative label: Rovdjur, skydd (50.11) @sv
alternative label: Skyddsområden, naturskydd (50.11) @sv
alternative label: Sukupuuttoon kuoleminen, luonnonsuojelu (50.11)
alternative label: Suojelualueet, luonnonsuojelu (50.11)
alternative label: Sälar, naturskydd (50.11) @sv
alternative label: Träd, fredning och skydd (50.11) @sv
alternative label: Trädarter, fredning och skydd (50.11) @sv
alternative label: Uhanalaiset eläimet, suojelu (50.11)
alternative label: Uhanalaiset kasvit, suojelu (50.11)
alternative label: Utrotningshot, naturskydd (50.11) @sv
alternative label: Utrotningshotade djur, skydd (50.11) @sv
alternative label: Utrotningshotade växter, skydd (50.11) @sv
alternative label: Valaat, luonnonsuojelu (50.11)
alternative label: Valar, naturskydd (50.11) @sv
alternative label: Vattendjur, skydd (50.11) @sv
alternative label: Vesieläimet, suojelu (50.11)
alternative label: Vilda djur, skydd (50.11) @sv
alternative label: Villieläimet, suojelu (50.11)
alternative label: Växtarter, fredning och skydd (50.11) @sv
alternative label: Växter, fredning och skydd (50.11) @sv
alternative label: Växtlighetsskyddsområden (50.11) @sv
broader: Ympäristönsuojelu. Luonnonsuojelu
in scheme: YKL - Yleisten kirjastojen luokitusjärjestelmä
notation: 50.11
preferred label: Endangered species. Natural reserves @en
preferred label: Utrotningshotade arter. Naturskyddsområden @sv
scope note: Eläin- ja kasvilajien suojelu. Eläin- ja kasvilajien rauhoitus Uhanalaiset lajit ja sukupuuttoon kuoleminen luonnonsuojelun kannalta Tähän eri maiden luonnonsuojelualueet, kansallispuistot ja luonnonpuistot
scope note: Skydd av djur- och växtarter. Fredning av djur- och växtarter Utrotningshotade arter och utrotning ur naturvårdens synvinkel Hit olika länders naturskyddsområden, nationalparker och naturparker @sv

Ilmansuojelu
type: Concept
References: Meteorologia. Klimatologia
References: BIOLOGIA
References: Sosiaalilääketiede. Ympäristölääketiede
type: YKL-luokka
alternative label: Atmosfären, luftvård (50.12) @sv
alternative label: Atmosfääri, ilmansuojelu (50.12)
alternative label: Fossiiliset polttoaineet, ilman saastuminen (50.12)
alternative label: Fossila bränslen, luftförorening (50.12) @sv
alternative label: Ilmakehä, ilmansuojelu (50.12)
alternative label: Ilman saastuminen (50.12)
alternative label: Ilmanlaatu, ympäristönsuojelu (50.12)
alternative label: Ilmansaasteet (50.12)
alternative label: Ilmansuojelu, luonnonsuojelu (50.12)
alternative label: Ilmansuojelutekniikka (50.12)
alternative label: Ilmastonmuutokset, kasvihuoneilmiö (50.12)
alternative label: Ilmastonsuojelu (50.12)
alternative label: Ilmastopolitiikka (50.12)
alternative label: Ilmastot, kasvihuoneilmiö (50.12)
alternative label: Kasvihuoneilmiö (50.12)
alternative label: Klimat, växthuseffekt (50.12) @sv
alternative label: Klimatförändringar, växthuseffekt (50.12) @sv
alternative label: Klimatpolitik (50.12) @sv
alternative label: Klimatskydd (50.12) @sv
alternative label: Luftförorening (50.12) @sv
alternative label: Luftföroreningar (50.12) @sv
alternative label: Luftkvalitet, miljövård (50.12) @sv
alternative label: Luftvård, naturvård (50.12) @sv
alternative label: Luftvårdsteknik (50.12) @sv
alternative label: Nanohiukkaset, ilmansaasteet (50.12)
alternative label: Nanopartiklar, luftföroreningar (50.12) @sv
alternative label: Otsonikato (50.12)
alternative label: Ozonminskning (50.12) @sv
alternative label: Pienhiukkaset, ilmansaasteet (50.12)
alternative label: Småpartiklar, luftföroreningar (50.12) @sv
alternative label: Växthuseffekt (50.12) @sv
broader: Ympäristönsuojelu. Luonnonsuojelu
in scheme: YKL - Yleisten kirjastojen luokitusjärjestelmä
notation: 50.12
preferred label: Air protection @en
preferred label: Luftvård @sv
scope note: Ilmakehän suojelu. Ilman saastuminen. Ilman laatu. Ilmansaasteet Ilmastopolitiikka Kasvihuoneilmiö. Otsonikato Tähän myös ilmansuojelutekniikan yleisteokset Tiettyyn teollisuudenalaan liittyvä ilmansuojelu tekniikka sijoitetaan ko. teollisuudenalan luokkaan
scope note: Vård av atmosfären. Nedsmutsning av luften. Luftens kvalitet. Luftföroreningar Klimatpolitik Växthuseffekten. Förtunnat ozonskikt Hit också allmänna verk om luftvårdsteknik Luftvårdsteknik som hänför sig till en enskild industrigren förs till industrigrenens klass @sv

Vesiensuojelu
type: Concept
References: Hydrologia
References: Ekologia. Eliömaantiede
References: LVI-työt. Sähkötyöt
References: Vesi- ja jätevesihuolto
alternative label: Avloppsvatten, nedsmutsning (50.13) @sv
alternative label: Blåalger, vattenförorening (50.13) @sv
alternative label: Bäckar, skydd (50.13) @sv
alternative label: Fiskdöd, vattenförorening (50.13) @sv
alternative label: Floder, vattenskydd (50.13) @sv
alternative label: Forsar, skydd (50.13) @sv
alternative label: Försurning, vattendrag (50.13) @sv
alternative label: Grundvatten, skydd (50.13) @sv
alternative label: Happamoituminen, vesistöt (50.13)
alternative label: Happikato, vesien saastuminen (50.13)
alternative label: Hav, skydd (50.13) @sv
alternative label: Havsskydd (50.13) @sv
alternative label: Hydrologisk forskning, vattenvård (50.13) @sv
alternative label: Hydrosfären, vattenskydd (50.13) @sv
alternative label: Hydrosfären, vattenvård (50.13) @sv
alternative label: Hydrosfääri, vesiensuojelu (50.13)
alternative label: Insjöar, skydd (50.13) @sv
alternative label: Itämeri, suojelu (50.13)
alternative label: Joet, vesiensuojelu (50.13)
alternative label: Järvet, vesiensuojelu (50.13)
alternative label: Jätevedet, saastuminen (50.13)
alternative label: Kalakuolemat, vesien saastuminen (50.13)
alternative label: Kosket, suojelu (50.13)
alternative label: Meret, suojelu (50.13)
alternative label: Meriensuojelu (50.13)
alternative label: Mertensuojelu (50.13)
alternative label: Oceaner, skydd (50.13) @sv
alternative label: Oljeskador, vattenförorening (50.13) @sv
alternative label: Pintavedet, suojelu (50.13)
alternative label: Pohjavesi, suojelu (50.13)
alternative label: Purot, suojelu (50.13)
alternative label: Sinilevät, vesien saastuminen (50.13)
alternative label: Sisävedet, suojelu (50.13)
alternative label: Sjöar, vattenskydd (50.13) @sv
alternative label: Skydd av hav (50.13) @sv
alternative label: Strömmande vatten, skydd (50.13) @sv
alternative label: Syrebrist, vattenförorening (50.13) @sv
alternative label: Valtameret, suojelu (50.13)
alternative label: Vatten, eutrofiering (50.13) @sv
alternative label: Vatten, försurning (50.13) @sv
alternative label: Vatten, nedsmutsning (50.13) @sv
alternative label: Vatten, reglering, vattenvård (50.13) @sv
alternative label: Vatten, vattenvård (50.13) @sv
alternative label: Vattenbyggnad, vattenvård (50.13) @sv
alternative label: Vattendrag, förbättring (50.13) @sv
alternative label: Vattendrag, reglering, vattenvård (50.13) @sv
alternative label: Vattendrag, skydd (50.13) @sv
alternative label: Vattenekosystem, skydd (50.13) @sv
alternative label: Vattenforskning, vattenvård (50.13) @sv
alternative label: Vattenkvalitet, vattenvård (50.13) @sv
alternative label: Veden laatu, vesiensuojelu (50.13)
alternative label: Vedet, happamoituminen (50.13)
alternative label: Vedet, rehevöityminen (50.13)
alternative label: Vedet, saastuminen (50.13)
alternative label: Vedet, säännöstely, vesiensuojelu (50.13)
alternative label: Vedet, vesiensuojelu (50.13)
alternative label: Vesi, vesiensuojelu (50.13)
alternative label: Vesiekosysteemit, suojelu (50.13)
alternative label: Vesiensuojelu (50.13)
alternative label: Vesientutkimus, vesiensuojelu (50.13)
alternative label: Vesikehä, vesiensuojelu (50.13)
alternative label: Vesirakennus, vesiensuojelu (50.13)
alternative label: Vesirakentaminen, vesiensuojelu (50.13)
alternative label: Vesistöt, kunnostus (50.13)
alternative label: Vesistöt, suojelu (50.13)
alternative label: Vesistöt, säännöstely, vesiensuojelu (50.13)
alternative label: Vesistötutkimus, vesiensuojelu (50.13)
alternative label: Vesivarat, vesiensuojelu (50.13)
alternative label: Virtaavat vedet, suojelu (50.13)
alternative label: Öljyvahingot, vesien saastuminen (50.13)
broader: Ympäristönsuojelu. Luonnonsuojelu
in scheme: YKL - Yleisten kirjastojen luokitusjärjestelmä
notation: 50.13
scope note: Sisävesien, merien ja pohjaveden suojelu Vesien saastuminen, rehevöityminen ja happamoituminen Vesien saastumisen vaikutukset eläimiin ja kasveihin Happikato. Kalakuolemat. Öljyvahingot Vesien säännöstely vesiensuojelun kannalta Koskiensuojelu. Vesistöjen kunnostus
scope note: Skydd av sjöar, hav och grundvatten Vattenföroreningar, eutrofiering och försurning av vattnen Vattenföroreningarnas inverkan på djur och växter Syrebrist. Fiskdöd. Oljeskador Vattenreglering ur vattenskyddets synvinkel Skydd av forsar. Sanering av vatten och vattendrag @sv

Maaperänsuojelu
type: Concept
References: Vesiensuojelu
References: Geologia. Geomorfologia
References: Ekologia. Eliömaantiede
type: YKL-luokka
alternative label: Aavikoituminen (50.14)
alternative label: Eloperäiset maalajit, maaperänsuojelu (50.14)
alternative label: Elottomat maalajit, maaperänsuojelu (50.14)
alternative label: Eroosio, maaperänsuojelu (50.14)
alternative label: Erosion, skydd av jordmånen (50.14) @sv
alternative label: Försurning, jordmånen (50.14) @sv
alternative label: Geologiset kerrostumat, suojelu (50.14)
alternative label: Geologiset muodostumat, suojelu (50.14)
alternative label: Geologiska avlagringar, skydd (50.14) @sv
alternative label: Geologiska formationer, skydd (50.14) @sv
alternative label: Grustag, skydd av jordmånen (50.14) @sv
alternative label: Happamoituminen, maaperä (50.14)
alternative label: Harjut, suojelu (50.14)
alternative label: Hiekkakuopat, maaperänsuojelu (50.14)
alternative label: Jordarter, skydd av jordmånen (50.14) @sv
alternative label: Jordmån, försurning (50.14) @sv
alternative label: Jordmån, utarmning (50.14) @sv
alternative label: Jordmånsekologi, skydd av jordmånen (50.14) @sv
alternative label: Maalajit, maaperänsuojelu (50.14)
alternative label: Maankäyttö, maaperänsuojelu (50.14)
alternative label: Maaperä, happamoituminen (50.14)
alternative label: Maaperä, köyhtyminen (50.14)
alternative label: Maaperäekologia, maaperänsuojelu (50.14)
alternative label: Maaperänsuojelu (50.14)
alternative label: Markanvändning, skydd av jordmånen (50.14) @sv
alternative label: Oorganiska jordarter, skydd av jordmånen (50.14) @sv
alternative label: Organogena jordarter, skydd av jordmånen (50.14) @sv
alternative label: Sandtag, skydd av jordmånen (50.14) @sv
alternative label: Skydd av jordmånen (50.14) @sv
alternative label: Sorakuopat, maaperänsuojelu (50.14)
alternative label: Åsar, skydd (50.14) @sv
alternative label: Ökenspridning (50.14) @sv
broader: Ympäristönsuojelu. Luonnonsuojelu
in scheme: YKL - Yleisten kirjastojen luokitusjärjestelmä
notation: 50.14
preferred label: Markvård @sv
preferred label: Soil protection @en
scope note: Maankuoren aineksen suojelu Elottomien ja eloperäisten maalajien suojelu Geologisten muodostumien ja kerrostumien suojelu Harjujen suojelu Maankäytön aiheuttama eroosio ja maaperän köyhtyminen Aavikoituminen. Maaperän happamoituminen
scope note: Skydd av jordskorpans material Skydd av organiska och oorganiska jordarter Skydd av geologiska formationer och avlagringar Skydd av åsar Erosion och utarmning av marken till följd av markanvändning Ökenspridning. Försurning av marken @sv

Eläinsuojelu
type: Concept
References: Talousoikeus
References: Uhanalaiset lajit. Luonnonsuojelualueet
References: ELÄINTIEDE
References: URN:NBN:fi:au:ykl:59.101
References: Kotieläintalous. Kotieläinten hoito
References: Eläinlääketiede
type: YKL-luokka
alternative label: Djur, skydd av djurindivider (50.19) @sv
alternative label: Djurens rättigheter (50.19) @sv
alternative label: Djurförsök, djurskydd (50.19) @sv
alternative label: Djurindivider, skydd (50.19) @sv
alternative label: Djurplågeri (50.19) @sv
alternative label: Djurskydd, skydd av djurindivider (50.19) @sv
alternative label: Djurskyddsövervakning (50.19) @sv
alternative label: Eläimet, eläinyksilöiden suojelu (50.19)
alternative label: Eläimistön suojelu, eläinyksilöiden suojelu (50.19)
alternative label: Eläinkokeet, eläinsuojelu (50.19)
alternative label: Eläinrääkkäys (50.19)
alternative label: Eläinsuojelu, eläinyksilöiden suojelu (50.19)
alternative label: Eläinsuojeluvalvonta (50.19)
alternative label: Eläinten oikeudet (50.19)
alternative label: Eläinyksilöt, suojelu (50.19)
alternative label: Faunavård, skydd av djurindivider (50.19) @sv
alternative label: Försöksdjur, skydd (50.19) @sv
alternative label: Husdjur, djurskydd (50.19) @sv
alternative label: Kasvissyönti, eläinsuojelu (50.19)
alternative label: Koe-eläimet, suojelu (50.19)
alternative label: Kotieläimet, eläinsuojelu (50.19)
alternative label: Lemmikkieläimet, eläinsuojelu (50.19)
alternative label: Pälsdjur, djurskydd (50.19) @sv
alternative label: Sällskapsdjur, djurskydd (50.19) @sv
alternative label: Turkiseläimet, eläinsuojelu (50.19)
alternative label: Veganism, djurskydd (50.19) @sv
alternative label: Veganismi, eläinsuojelu (50.19)
alternative label: Vegetarianism, djurskydd (50.19) @sv
alternative label: Vegetarism, djurskydd (50.19) @sv
alternative label: Vegetarismi, eläinsuojelu (50.19)
broader: Ympäristönsuojelu. Luonnonsuojelu
in scheme: YKL - Yleisten kirjastojen luokitusjärjestelmä
notation: 50.19
preferred label: Animal protection @en
preferred label: Djurskydd @sv
scope note: Behandling och skydd av djur Djurskyddsövervakning Skydd av försöksdjur och husdjur Djurens rättigheter @sv
scope note: Eläinyksilöiden kohtelu ja suojelu Eläinsuojeluvalvonta Koe-eläinten ja kotieläinten suojelu Eläinten oikeudet

MATEMATIIKKA
type: Concept
References: LOGIIKKA
References: TILASTOTIEDE
References: Vakuutustoimi
References: Liiketaloudellinen laskentatoimi
type: YKL-luokka
alternative label: Joukko-oppi (51)
alternative label: Luonnontieteet (50 ... 58+)
alternative label: Luonnontutkimus (50 ... 58+)
alternative label: Matematiikka (51+)
alternative label: Matematiikka, perusteet (51)
alternative label: Matematik (51+) @sv
alternative label: Matematik, grunder (51) @sv
alternative label: Mängdlära (51) @sv
alternative label: Naturforskning (50 ... 58+) @sv
alternative label: Naturvetenskaper (50 ... 58+) @sv
broader: LUONNONTIETEET. MATEMATIIKKA. LÄÄKETIEDE
in scheme: YKL - Yleisten kirjastojen luokitusjärjestelmä
narrower: Lukuteoria. Aritmetiikka. Algebra
narrower: Geometria
narrower: Analyysi
narrower: Todennäköisyyslaskenta
narrower: Erityiset laskentamenetelmät
narrower: Matematiikka harrasteena ja ajanvietteenä
notation: 51
preferred label: MATEMATIK @sv
preferred label: MATHEMATICS @en
scope note: Hit allmänna verk om matematik. Matematikens grunder. Mängdlära. Allmänna matematiska tabeller och formelsamlingar 51.08. Matematikläroböcker som riktar sig till olika yrkesgrupper hit. Formtillägget 01 används inte i samband med klasserna 51-51.8 @sv
scope note: Tähän matematiikan yleisteokset. Matematiikan perusteet. Joukko-oppi. Yleiset matematiikan taulukot ja kaavakokoelmat 51.08. Eri ammattialojen matematiikan oppikirjat tähän. Muotoluokkaa 01 ei käytetä luokkien 51-51.8 yhteydessä

Lukuteoria. Aritmetiikka. Algebra
type: Concept
type: YKL-luokka
alternative label: Algebra (51.1)
alternative label: Alkuluvut (51.1)
alternative label: Aritmetiikka (51.1)
alternative label: Aritmetik (51.1) @sv
alternative label: Boolen algebra (51.1)
alternative label: Booles algebra (51.1) @sv
alternative label: Bråktal (51.1) @sv
alternative label: Determinantteori (51.1) @sv
alternative label: Determinanttiteoria (51.1)
alternative label: Differensalgebra (51.1) @sv
alternative label: Differenssialgebra (51.1)
alternative label: Differentiaalialgebra (51.1)
alternative label: Differentialalgebra (51.1) @sv
alternative label: Ekvationslära (51.1) @sv
alternative label: Fermat'n probleema (51.1)
alternative label: Fermats problem (51.1) @sv
alternative label: Gitter, algebra (51.1) @sv
alternative label: Gruppteori, algebra (51.1) @sv
alternative label: Hilat, algebra (51.1)
alternative label: Homologinen algebra (51.1)
alternative label: Homologisk algebra (51.1) @sv
alternative label: Imaginära tal (51.1) @sv
alternative label: Imaginääriluvut (51.1)
alternative label: Kategoriat, algebra (51.1)
alternative label: Kategorier, algebra (51.1) @sv
alternative label: Kedjebråk (51.1) @sv
alternative label: Ketjumurtoluvut (51.1)
alternative label: Laskento (51.1)
alternative label: Lineaarialgebra (51.1)
alternative label: Linearalgebra (51.1) @sv
alternative label: Lukuteoria (51.1)
alternative label: Luvut (51.1)
alternative label: Matriisilaskenta (51.1)
alternative label: Matrisräkning (51.1) @sv
alternative label: Moduler, algebra (51.1) @sv
alternative label: Modulit, algebra (51.1)
alternative label: Multilineaarialgebra (51.1)
alternative label: Multilinearalgebra (51.1) @sv
alternative label: Murtoluvut (51.1)
alternative label: Numerot, matematiikka (51.1)
alternative label: Primtal (51.1) @sv
alternative label: Ryhmäteoria, algebra (51.1)
alternative label: Räkning, matematik (51.1) @sv
alternative label: Siffror, matematik (51.1) @sv
alternative label: Tal, matematik (51.1) @sv
alternative label: Talteori, matematik (51.1) @sv
alternative label: Tensorilaskenta (51.1)
alternative label: Tensorkalkyl (51.1) @sv
alternative label: Transfiniittiset luvut (51.1)
alternative label: Transfinita tal (51.1) @sv
alternative label: Vektorilaskenta (51.1)
alternative label: Vektorkalkyl (51.1) @sv
alternative label: Yhtälöoppi (51.1)
broader: MATEMATIIKKA
in scheme: YKL - Yleisten kirjastojen luokitusjärjestelmä
notation: 51.1
preferred label: Talteori. Aritmetik. Algebra @sv
preferred label: Theory of numbers. Arithmetic. Algebra @en
scope note: Numerojärjestelmät. Luvut. Alkuluvut. Algebralliset lukukunnat Lukuteoreettiset funktiot ja probleemat Aritmetiikka. Laskento Yleinen algebra. Teoreettinen algebra. Boolen algebra. Differentiaali- ja differenssialgebra. Lineaari- ja multilineaarialgebra Matriisilaskenta. Vektorilaskenta Determinanttiteoria. Homologinen algebra Muotoluokkaa 01 ei käytetä luokkien 51-51.8 yhteydessä
scope note: Siffersystem. Tal. Primtal. Algebraiska grupper, kroppar och ringar Talteoretiska funktioner och problem Aritmetik. Räkning Allmän algebra. Teoretisk algebra. Boolesk algebra. Differential- och differensalgebra. Lineär- och multilineär algebra Matriser. Vektorer Determinantteori. Homologisk algebra Formtillägget 01 används inte i samband med klasserna 51-51.8 @sv

Geometria
type: Concept
References: Tekninen piirustus
References: ARKKITEHTUURI
References: Piirustuksen tekniikka
type: YKL-luokka
alternative label: Affiinit geometriat (51.2)
alternative label: Affina geometrier (51.2) @sv
alternative label: Algebraisk topologi (51.2) @sv
alternative label: Algebrallinen topologia (51.2)
alternative label: Algebroiden geometriat (51.2)
alternative label: Algebrornas geometrier (51.2) @sv
alternative label: Alkeisgeometria (51.2)
alternative label: Analytisk geometri (51.2) @sv
alternative label: Analyyttinen geometria (51.2)
alternative label: Avaruusgeometria (51.2)
alternative label: Bolltrigonometri (51.2) @sv
alternative label: Deskriptiivinen geometria (51.2)
alternative label: Deskriptiv geometri (51.2) @sv
alternative label: Differentiaaligeometria (51.2)
alternative label: Differentialgeometri (51.2) @sv
alternative label: Dimensionsteori (51.2) @sv
alternative label: Dimensioteoria (51.2)
alternative label: Elementär geometri (51.2) @sv
alternative label: Epäeuklidinen geometria (51.2)
alternative label: Euklidinen geometria (51.2)
alternative label: Euklidisk geometri (51.2) @sv
alternative label: Fraktaaligeometria (51.2)
alternative label: Fraktalgeometri (51.2) @sv
alternative label: Geometri (51.2) @sv
alternative label: Geometria (51.2)
alternative label: Hyperbolinen geometria (51.2)
alternative label: Hyperbolisk geometri (51.2) @sv
alternative label: Icke-euklidisk geometri (51.2) @sv
alternative label: Pallotrigonometria (51.2)
alternative label: Perspektiivioppi, geometria (51.2)
alternative label: Perspektivlära, geometri (51.2) @sv
alternative label: Polygonometri (51.2) @sv
alternative label: Polygonometria (51.2)
alternative label: Projektiivigeometriat (51.2)
alternative label: Projektio-oppi, geometria (51.2)
alternative label: Projektionslära, geometri (51.2) @sv
alternative label: Projektiva geometrier (51.2) @sv
alternative label: Rum, geometri (51.2) @sv
alternative label: Rymdgeometri (51.2) @sv
alternative label: Stereometri (51.2) @sv
alternative label: Stereometria (51.2)
alternative label: Tila, geometria (51.2)
alternative label: Topologi, matematik (51.2) @sv
alternative label: Topologia, matematiikka (51.2)
alternative label: Trigonometri (51.2) @sv
alternative label: Trigonometria (51.2)
broader: MATEMATIIKKA
in scheme: YKL - Yleisten kirjastojen luokitusjärjestelmä
notation: 51.2
preferred label: Geometri @sv
preferred label: Geometry @en
scope note: Allmän geometri. Elementär geometri Trigonometri. Polygonometri. Rymdgeometri Euklidisk, icke-euklidisk och analytisk geometri Affina och projektiva geometrier Algebraiska geometrier. Deskriptiv geometri Differentialgeometri. Topologi. Fraktalgeometri Formtillägget 01 används inte i samband med klasserna 51-51.8 @sv
scope note: Yleinen geometria. Alkeisgeometria Trigonometria. Polygonometria Euklidinen, epäeuklidinen ja analyyttinen geometria Affiinit ja projektiiviset geometriat Algebroiden geometriat. Deskriptiivinen geometria Differentiaaligeometria. Topologia. Fraktaaligeometria Muotoluokkaa 01 ei käytetä luokkien 51-51.8 yhteydessä

Analyysi
type: Concept
type: YKL-luokka
alternative label: Analys, matematik (51.3) @sv
alternative label: Analyysi, matematiikka (51.3)
alternative label: Differentiaalilaskenta (51.3)
alternative label: Differentiaaliyhtälöt (51.3)
alternative label: Differentialekvationer (51.3) @sv
alternative label: Differentialräkning (51.3) @sv
alternative label: Funktioanalyysi, matematiikka (51.3)
alternative label: Funktioner, matematik (51.3) @sv
alternative label: Funktionsanalys, matematik (51.3) @sv
alternative label: Funktiot, matematiikka (51.3)
alternative label: Integraalilaskenta (51.3)
alternative label: Integraalimuunnokset (51.3)
alternative label: Integraaliyhtälöt (51.3)
alternative label: Integralekvationer (51.3) @sv
alternative label: Integralkalkyl (51.3) @sv
alternative label: Integraltransformationer (51.3) @sv
alternative label: Inversa problem (51.3) @sv
alternative label: Inversio-ongelmat (51.3)
alternative label: Matemaattinen analyysi (51.3)
alternative label: Matemaattiset sarjat (51.3)
alternative label: Matematisk analys (51.3) @sv
alternative label: Matematiska serier (51.3) @sv
alternative label: Operaattorilaskenta (51.3)
alternative label: Operaattorit, matematiikka (51.3)
alternative label: Operaattoriteoria, matematiikka (51.3)
alternative label: Operatorkalkyl (51.3) @sv
alternative label: Operatorteori, matematik (51.3) @sv
alternative label: Operatörer, matematik (51.3) @sv
alternative label: Osittaisdifferentiaaliyhtälöt (51.3)
alternative label: Partiella differentialekvationer (51.3) @sv
alternative label: Sarjat, matematiikka (51.3)
alternative label: Serier, matematik (51.3) @sv
alternative label: Variaatiolaskenta (51.3)
alternative label: Variationskalkyl (51.3) @sv
broader: MATEMATIIKKA
in scheme: YKL - Yleisten kirjastojen luokitusjärjestelmä
notation: 51.3
preferred label: Analys @sv
preferred label: Analysis @en
scope note: Differentiaalilaskenta. Integraalilaskenta. Integraalimuunnokset Operaattoriteoria. Operaattorilaskenta Funktiot. Funktioanalyysi Matemaattiset sarjat Variaatiolaskenta. Matemaattinen säätöteoria Muotoluokkaa 01 ei käytetä luokkien 51-51.8 yhteydessä
scope note: Differentialkalkyl. Integralkalkyl. Integraltransformationer Operatorteori. Operatorkalkyl Funktioner. Funktionsanalys Matematiska serier Variationskalkyl. Matematisk reglerteori Formtillägget 01 används inte i samband med klasserna 51-51.8 @sv

Todennäköisyyslaskenta
type: Concept
References: Kommunikaatioteoria
References: TILASTOTIEDE
type: YKL-luokka
alternative label: Beslutsfattningsteorier, matematik (51.4) @sv
alternative label: Etsintäteoriat, matematiikka (51.4)
alternative label: Hyötyteoriat, matematiikka (51.4)
alternative label: Jonoteoria, matematiikka (51.4)
alternative label: Kombinatoriikka (51.4)
alternative label: Kombinatorik, sannolikhetskalkyl (51.4) @sv
alternative label: Köteori, matematik (51.4) @sv
alternative label: Lagerteorier, matematik (51.4) @sv
alternative label: Luotettavuusteoriat, matematiikka (51.4)
alternative label: Markovin prosessit (51.4)
alternative label: Markovs processer (51.4) @sv
alternative label: Nyttoteorier, matematik (51.4) @sv
alternative label: Nätteori, matematik (51.4) @sv
alternative label: Ohjelmointi, matematiikka (51.4)
alternative label: Ongelmanratkaisu, matemaattinen teoria (51.4)
alternative label: Operaatioanalyysi, matematiikka (51.4)
alternative label: Operationsanalys, matematik (51.4) @sv
alternative label: Optimering, matematik (51.4) @sv
alternative label: Optimointi, matematiikka (51.4)
alternative label: Peliteoria, matematiikka (51.4)
alternative label: Problemlösning, matematisk teori (51.4) @sv
alternative label: Programmering, matematik (51.4) @sv
alternative label: Päätöksentekoteoriat, matematiikka (51.4)
alternative label: Reglerteori, matematik (51.4) @sv
alternative label: Sannolikhetskalkyl (51.4) @sv
alternative label: Sannolikhetsteori, matematik (51.4) @sv
alternative label: Simulering, matematik (51.4) @sv
alternative label: Simulointi, matematiikka (51.4)
alternative label: Spelteori, matematik (51.4) @sv
alternative label: Stokastiset prosessit, matematiikka (51.4)
alternative label: Stokastiska processer, matematik (51.4) @sv
alternative label: Säätöteoria, matematiikka (51.4)
alternative label: Sökteorier, matematik (51.4) @sv
alternative label: Tillförlitlighetsteorier, matematik (51.4) @sv
alternative label: Todennäköisyyslaskenta (51.4)
alternative label: Todennäköisyysteoria, matematiikka (51.4)
alternative label: Varastoteoriat, matematiikka (51.4)
alternative label: Verkkoteoria, matematiikka (51.4)
broader: MATEMATIIKKA
in scheme: YKL - Yleisten kirjastojen luokitusjärjestelmä
notation: 51.4
preferred label: Probability calculus @en
preferred label: Sannolikhetskalkyl @sv
scope note: Sannolikhetsteorin. Stokastiska processer Markovprocesser. Specialprocesser Operationsanalys Matematisk tillförlitlighets-, spel- och beslutsteori Matematisk optimering. Matematisk simulering Spelteori. Köteori. Kombinatorik. Nätverksteori Formtillägget 01 används inte i samband med klasserna 51-51.8 @sv
scope note: Todennäköisyysteoria. Stokastiset prosessit Markovin prosessit. Erikoisprosessit Operaatioanalyysi Matemaattiset hyöty-, luotettavuus-, varasto-, etsintä- ja päätöksentekoteoriat Matemaattinen optimointi. Matemaattinen simulointi Peliteoria. Jonoteoria. Kombinatoriikka. Verkkoteoria Muotoluokkaa 01 ei käytetä luokkien 51-51.8 yhteydessä

Erityiset laskentamenetelmät
type: Concept
References: TIETOTEKNIIKKA. TIETOLIIKENNE. VIESTINTÄTEKNIIKKA. TEKOÄLY
References: Toimistotyö. Toimistotekniikka
References: Liiketaloudellinen laskentatoimi
References: Liiketaloudellinen kirjanpito ja tilintarkastus
type: YKL-luokka
alternative label: Algoritmer, matematik (51.5) @sv
alternative label: Algoritmiikka, matematiikka (51.5)
alternative label: Algoritmik, matematik (51.5) @sv
alternative label: Algoritmit, matematiikka (51.5)
alternative label: Excel, kalkyleringsprogram (51.5) @sv
alternative label: Excel, taulukkolaskentaohjelma (51.5)
alternative label: Fickräknare (51.5) @sv
alternative label: Geneettiset algoritmit, matematiikka (51.5)
alternative label: Genetiska algoritmer, matematik (51.5) @sv
alternative label: Graafinen esitys, matematiikka (51.5)
alternative label: Graafinen laskenta (51.5)
alternative label: Grafisk framställning, matematik (51.5) @sv
alternative label: Grafisk kalkyl (51.5) @sv
alternative label: Kalkylering (51.5) @sv
alternative label: Kalkylprogram (51.5) @sv
alternative label: Laskentamenetelmät, numeerinen matematiikka (51.5)
alternative label: Laskentaohjelmat, numeerinen matematiikka (51.5)
alternative label: Laskimet, matematiikka (51.5)
alternative label: Laskukoneet, matematiikka (51.5)
alternative label: Laskumenetelmät, numeerinen matematiikka (51.5)
alternative label: Laskutikut, matematiikka (51.5)
alternative label: Lotus 1-2-3, taulukkolaskentaohjelma (51.5)
alternative label: Lotus 1-2-3-, kalkyleringsprogram (51.5) @sv
alternative label: Matematiikka, laskumenetelmät (51.5)
alternative label: Matematik, räknemetoder (51.5) @sv
alternative label: Nomografi (51.5) @sv
alternative label: Nomografia (51.5)
alternative label: Numeerinen matematiikka (51.5)
alternative label: Numerisk matematik (51.5) @sv
alternative label: Riskanalys, beräkningsmetoder (51.5) @sv
alternative label: Riskianalyysi, laskentamenetelmät (51.5)
alternative label: Räknare. matematik (51.5) @sv
alternative label: Räknemaskiner, matematik (51.5) @sv
alternative label: Räknemetoder, numerisk matematik (51.5) @sv
alternative label: Räknestickor, matematik (51.5) @sv
alternative label: Räkningsmetoder, numerisk matematik (51.5) @sv
alternative label: Räkningsprogram, numerisk matematik (51.5) @sv
alternative label: Taskulaskimet (51.5)
alternative label: Taulukkolaskenta (51.5)
alternative label: Taulukkolaskentaohjelmat (51.5)
alternative label: kvantberäkning, matematik (51.5) @sv
alternative label: kvanttilaskenta, matematiikka (51.5)
broader: MATEMATIIKKA
in scheme: YKL - Yleisten kirjastojen luokitusjärjestelmä
notation: 51.5
preferred label: Special calculation methods @en
preferred label: Särskilda kalkylmetoder @sv
scope note: Grafiska och maskinella metoder inom numerisk matematik Användning av räknesticka, kalkylatorer, räknemaskiner och datorer vid kalkylering Kalkylprogram för datorer. Tabellkalkyl Grafisk kalkyl. Grafisk framställning Nomografi Formtillägget 01 används inte i samband med klasserna 51-51.8 @sv
scope note: Numeerisen matematiikan koneelliset ja graafiset menetelmät Laskutikun, laskimien, laskukoneiden ja tietokoneiden käyttö laskentatehtävissä Tietokoneiden laskentaohjelmat. Taulukkolaskenta Graafinen laskenta. Graafinen esitys Nomografia Muotoluokkaa 01 ei käytetä luokkien 51-51.8 yhteydessä

Matematiikka harrasteena ja ajanvietteenä
type: Concept
type: YKL-luokka
alternative label: Ajanviete, matematiikka (51.8)
alternative label: Harrastukset, matematiikka (51.8)
alternative label: Hobbyer, matematik (51.8) @sv
alternative label: Matemaattinen ajanviete (51.8)
alternative label: Matematiskt tidsfördriv (51.8) @sv
alternative label: Probleemat, matemaattinen ajanviete (51.8)
alternative label: Problem, matematik som tidsfördriv (51.8) @sv
alternative label: Tidsfördriv, matematik (51.8) @sv
broader: MATEMATIIKKA
in scheme: YKL - Yleisten kirjastojen luokitusjärjestelmä
notation: 51.8
preferred label: Matematik som hobby och tidsfördriv @sv
preferred label: Mathematics as a hobby and pastime @en
scope note: Formtillägget 01 används inte i samband med klasserna 51-51.8 @sv
scope note: Muotoluokkaa 01 ei käytetä luokkien 51-51.8 yhteydessä

TÄHTITIEDE. GEODESIA
type: Concept
References: Ufot
References: Astrologia
type: YKL-luokka
alternative label: Astronomi (52+) @sv
alternative label: Astronomia (52+)
alternative label: Luonnontieteet (50 ... 58+)
alternative label: Luonnontutkimus (50 ... 58+)
alternative label: Naturforskning (50 ... 58+) @sv
alternative label: Naturvetenskaper (50 ... 58+) @sv
alternative label: Planetaariot (52+)
alternative label: Planetarier (52+) @sv
alternative label: Stjärnvetenskap (52+) @sv
alternative label: Tähtitiede (52+)
broader: LUONNONTIETEET. MATEMATIIKKA. LÄÄKETIEDE
in scheme: YKL - Yleisten kirjastojen luokitusjärjestelmä
narrower: Teoreettinen tähtitiede. Taivaanmekaniikka
narrower: Maailmankaikkeus. Tähdet. Tähtijärjestelmät
narrower: Tähtitieteelliset kojeet
narrower: Avaruustutkimus. Avaruustoiminta
narrower: Geodesia. Maanmittaus. Kartoitus
narrower: Ajanlasku
notation: 52
preferred label: ASTRONOMI. GEODESI @sv
preferred label: ASTRONOMY. GEODESY @en
scope note: Hit allmänna verk om astronomi. Stjärnkartor i allmänhet 52.02. Planetarier i allmänhet 52.062. Astronomins historia i allmänhet 52.09 @sv
scope note: Tähän tähtitieteen eli astronomian yleisteokset. Tähtikartat yleensä 52.02. Planetaariot yleensä 52.062. Tähtitieteen historia yleensä 52.09

Teoreettinen tähtitiede. Taivaanmekaniikka
type: Concept
References: URN:NBN:fi:au:ykl:52.02
type: YKL-luokka
alternative label: Astromekaniikka (52.1)
alternative label: Astromekanik (52.1) @sv
alternative label: Astrometri (52.1) @sv
alternative label: Astrometria (52.1)
alternative label: Auringonpimennykset (52.1)
alternative label: Bollastronomi (52.1) @sv
alternative label: Dragningskrafter, himlakropparnas banor (52.1) @sv
alternative label: Efemerider, beräkning (52.1) @sv
alternative label: Efemeridien laskeminen (52.1)
alternative label: Gravitaatio, taivaankappaleiden radat (52.1)
alternative label: Gravitation, himlakropparnas banor (52.1) @sv
alternative label: Himlakropparnas banor (52.1) @sv
alternative label: Himmelsmekanik (52.1) @sv
alternative label: Kuunpimennykset (52.1)
alternative label: Månförmörkelser (52.1) @sv
alternative label: Painovoima, taivaankappaleiden radat (52.1)
alternative label: Pallotähtitiede (52.1)
alternative label: Solförmörkelser (52.1) @sv
alternative label: Stjärnvetenskap, teoretisk (52.1) @sv
alternative label: Taivaankappaleiden radat (52.1)
alternative label: Taivaanmekaniikka (52.1)
alternative label: Teoreettinen tähtitiede (52.1)
alternative label: Teoretisk astronomi (52.1) @sv
alternative label: Tyngdkraft, himlakropparnas banor (52.1) @sv
alternative label: Tähtitiede, teoreettinen (52.1)
alternative label: Vetovoimat, taivaankappaleiden radat (52.1)
broader: TÄHTITIEDE. GEODESIA
in scheme: YKL - Yleisten kirjastojen luokitusjärjestelmä
notation: 52.1
preferred label: Teoretisk astronomi. Celest mekanik @sv
preferred label: Theoretical astronomy. Celestial mechanics @en
scope note: Dragningskraft mellan himlakroppar Himlakropparnas banor Sol- och månförmörkelser Astrometri. Sfärisk astronomi Beräkning av efemerider @sv
scope note: Taivaankappaleiden väliset vetovoimat Taivaankappaleiden radat Auringon- ja kuunpimennykset Astrometria. Pallotähtitiede Efemeridien laskeminen

Maailmankaikkeus. Tähdet. Tähtijärjestelmät
type: Concept
References: Ufot
References: URN:NBN:fi:au:ykl:52.02
References: Teoreettinen tähtitiede. Taivaanmekaniikka
References: Epäorgaaninen kemia
alternative label: Alkuaineet, synty (52.2+)
alternative label: Alkuräjähdysteoria (52.2)
alternative label: Antimateria (52.2)
alternative label: Astrobiologi (52.2+) @sv
alternative label: Astrobiologia (52.2+)
alternative label: Astrofysiikka (52.2+)
alternative label: Astrofysik (52.2+) @sv
alternative label: Astrokemi (52.2+) @sv
alternative label: Astrokemia (52.2+)
alternative label: Auringot (52.2+)
alternative label: Aurinkokunnat (52.2+)
alternative label: Avaruus, kosmologia (52.2+)
alternative label: Avaruusarkeologia (52.2)
alternative label: Dragningskrafter, kosmologi (52.2+) @sv
alternative label: Eksobiologia (52.2+)
alternative label: Elämä maailmankaikkeudessa (52.2+)
alternative label: Exobiologi (52.2+) @sv
alternative label: Fixstjärnor (52.2+) @sv
alternative label: Galaksit (52.2+)
alternative label: Galaxer (52.2+) @sv
alternative label: Gravitaatio, kosmologia (52.2+)
alternative label: Gravitation, kosmologi (52.2+) @sv
alternative label: Grundämnen, uppkomst (52.2+) @sv
alternative label: Himlakroppar (52.2+) @sv
alternative label: Kiertotähdet (52.2+)
alternative label: Kiintotähdet (52.2+)
alternative label: Kosminen säteily (52.2+)
alternative label: Kosmisk strålning (52.2+) @sv
alternative label: Kosmogoni (52.2+) @sv
alternative label: Kosmogonia (52.2+)
alternative label: Kosmologi, astronomi (52.2+) @sv
alternative label: Kosmologia, tähtitiede (52.2+)
alternative label: Kvasaarit (52.2)
alternative label: Kvasarer (52.2) @sv
alternative label: Linnunrata (52.2+)
alternative label: Liv i världsalltet (52.2+) @sv
alternative label: Maailmankaikkeus, tähtitiede (52.2+)
alternative label: Maailmanloppu, kosmologia (52.2+)
alternative label: Mustat aukot (52.2)
alternative label: Nebulosor (52.2+) @sv
alternative label: Neutronitähdet (52.2)
alternative label: Neutronstjärnor (52.2) @sv
alternative label: Novat (52.2)
alternative label: Novor (52.2) @sv
alternative label: Painovoima, kosmologia (52.2+)
alternative label: Planeter (52.2+) @sv
alternative label: Pulsarer (52.2) @sv
alternative label: Pulsarit (52.2)
alternative label: Rymdarkeologi (52.2) @sv
alternative label: Rymden, kosmologi (52.2+) @sv
alternative label: Solar (52.2+) @sv
alternative label: Solsystem (52.2+) @sv
alternative label: Stellaariastronomia (52.2+)
alternative label: Stellarastronomi (52.2+) @sv
alternative label: Stjärnhopar (52.2+) @sv
alternative label: Stjärnor (52.2+) @sv
alternative label: Stjärnsystem (52.2+) @sv
alternative label: Strålning, kosmisk (52.2+) @sv
alternative label: Supernovat (52.2)
alternative label: Supernovor (52.2) @sv
alternative label: Svarta hål (52.2) @sv
alternative label: Säteily, kosminen (52.2+)
alternative label: Taivaankappaleet (52.2+)
alternative label: Tähdet (52.2+)
alternative label: Tähtijoukot (52.2+)
alternative label: Tähtijärjestelmät (52.2+)
alternative label: Tähtisumut (52.2+)
alternative label: Valkoiset kääpiöt (52.2)
alternative label: Vetovoimat, kosmologia (52.2+)
broader: TÄHTITIEDE. GEODESIA
in scheme: YKL - Yleisten kirjastojen luokitusjärjestelmä
narrower: Aurinkokunta
notation: 52.2
scope note: Hit världsalltets ursprung, uppbyggnad och utveckling Kosmologi. Kosmogoni Teorin om Big Bang. Steady State -teorin Grundämnenas ursprung. Hur grundämnena bildats Svarta hål. Antimateria. Kosmisk strålning Astrofysik. Astrokemi Astrobiologi. Liv i världsalltet Stjärnhopar. Nebulosor. Galaxer. Vintergatan Stjärnor. Den interstellära materien @sv
scope note: Tähän maailmankaikkeuden alkuperä, rakenne ja kehitys Kosmologia. Kosmogonia Alkuräjähdysteoria. Pysyvän tilan teoria Alkuaineiden alkuperä ja muodostuminen Mustat aukot. Antimateria. Kosmiset säteet Astrofysiikka. Astrokemia Astrobiologia. Elämä maailmankaikkeudessa Tähtijoukot. Tähtisumut. Galaksit. Linnunrata Tähdet. Tähtienvälinen aine

Aurinkokunta
type: Concept
References: Teoreettinen tähtitiede. Taivaanmekaniikka
References: Avaruustutkimus. Avaruustoiminta
References: FYYSINEN MAANTIEDE. GEOLOGIA
References: Geologia. Geomorfologia
References: Mineralogia. Petrologia. Kristallografia
References: Meteorologia. Klimatologia
References: Hydrologia
type: YKL-luokka
alternative label: Asteroider (52.21) @sv
alternative label: Asteroidit (52.21)
alternative label: Auringonpilkut (52.21)
alternative label: Aurinko (52.21)
alternative label: Aurinkokunta (52.21)
alternative label: Aurinkotuuli (52.21)
alternative label: Ionosfääri (52.21)
alternative label: Jonosfären (52.21) @sv
alternative label: Jorden, astronomi (52.21) @sv
alternative label: Jordklotet, astronomi (52.21) @sv
alternative label: Jupiter, astronomi (52.21) @sv
alternative label: Jupiter, tähtitiede (52.21)
alternative label: Komeetat (52.21)
alternative label: Kometer (52.21) @sv
alternative label: Kuu (52.21)
alternative label: Kuut (52.21)
alternative label: Lähiavaruus (52.21)
alternative label: Maa, tähtitiede (52.21)
alternative label: Maapallo, tähtitiede (52.21)
alternative label: Magnetosfären (52.21) @sv
alternative label: Magnetosfääri (52.21)
alternative label: Mars, astronomi (52.21) @sv
alternative label: Mars, tähtitiede (52.21)
alternative label: Merkurius, astronomi (52.21) @sv
alternative label: Merkurius, tähtitiede (52.21)
alternative label: Meteorer, astronomi (52.21) @sv
alternative label: Meteorit, tähtitiede (52.21)
alternative label: Månar (52.21) @sv
alternative label: Månen (52.21) @sv
alternative label: Neptunus, astronomi (52.21) @sv
alternative label: Neptunus, tähtitiede (52.21)
alternative label: Närrymd (52.21) @sv
alternative label: Pikkuplaneetat (52.21)
alternative label: Planeetat (52.21)
alternative label: Planeter (52.21) @sv
alternative label: Pluto, astronomi (52.21) @sv
alternative label: Pluto, tähtitiede (52.21)
alternative label: Pyrstötähdet (52.21)
alternative label: Saturnus, astronomi (52.21) @sv
alternative label: Saturnus, tähtitiede (52.21)
alternative label: Småplaneter (52.21) @sv
alternative label: Solen (52.21) @sv
alternative label: Solfläckar (52.21) @sv
alternative label: Solsystemet (52.21) @sv
alternative label: Solvind (52.21) @sv
alternative label: Stratosfären (52.21) @sv
alternative label: Stratosfääri (52.21)
alternative label: Uranus, astronomi (52.21) @sv
alternative label: Uranus, tähtitiede (52.21)
alternative label: Venus, astronomi (52.21) @sv
alternative label: Venus, tähtitiede (52.21)
broader: Maailmankaikkeus. Tähdet. Tähtijärjestelmät
in scheme: YKL - Yleisten kirjastojen luokitusjärjestelmä
notation: 52.21
preferred label: Solsystemet @sv
preferred label: The solar system @en
scope note: Aurinko. Planeetat. Kuut Merkurius. Venus. Mars. Jupiter. Saturnus. Uranus. Neptunus. Pluto Maa tähtitieteelliseltä kannalta. Pikkuplaneetat. Asteroidit. Komeetat. Meteorit Lähiavaruus. Ionosfääri. Stratosfääri. Magnetosfääri Auringon rakenne ja aktiivisuus Auringonpilkut. Aurinkotuuli
scope note: Solen. Planeter. Månar Merkurius. Venus. Mars. Jupiter. Saturnus. Uranus. Neptunus. Pluto Jorden ur astronomisk synvinkel. Småplaneter. Asteroider. Kometer. Meteorer Närrymd. Jonosfären. Stratosfären. Magnetosfären Solens uppbyggnad och aktivitet Solfläckar. Solvind @sv

Tähtitieteelliset kojeet
type: Concept
References: URN:NBN:fi:au:ykl:52.02
References: Avaruustutkimus. Avaruustoiminta
References: Optiset ja lääketieteelliset laitteet
type: YKL-luokka
alternative label: Astrofotografering (52.3) @sv
alternative label: Astrofotometri (52.3) @sv
alternative label: Astrofotometria (52.3)
alternative label: Astronomiska apparater (52.3) @sv
alternative label: Astrospektrometri (52.3) @sv
alternative label: Astrospektrometria (52.3)
alternative label: Astrospektroskoopit (52.3)
alternative label: Astrospektroskop (52.3) @sv
alternative label: Kaukoputket, tähtitiede (52.3)
alternative label: Observatorier (52.3) @sv
alternative label: Observatoriot (52.3)
alternative label: Radioastronomi (52.3) @sv
alternative label: Radioastronomia (52.3)
alternative label: Radioteleskoopit (52.3)
alternative label: Radioteleskop (52.3) @sv
alternative label: Stjärnor, observationsteknik (52.3) @sv
alternative label: Teleskoopit (52.3)
alternative label: Teleskop (52.3) @sv
alternative label: Teleskop, astronomi (52.3) @sv
alternative label: Tähdet, havainnointitekniikka (52.3)
alternative label: Tähtitieteelliset kojeet (52.3)
alternative label: Tähtitornit (52.3)
alternative label: Tähtivalokuvaus (52.3)
broader: TÄHTITIEDE. GEODESIA
in scheme: YKL - Yleisten kirjastojen luokitusjärjestelmä
notation: 52.3
preferred label: Astronomical instruments @en
preferred label: Astronomiska instrument @sv
scope note: Användningen av astronomiska instrument i astronomisk forskning och vid observation av stjärnor Teleskop. Observatorier Astrospektroskopi. Astrofotometri Radioteleskop. Radioastronomi Stjärnfotografering @sv
scope note: Tähtitieteellisten kojeiden käyttö tähtitieteellisessä tutkimuksessa ja tähtien havainnoinnissa Kaukoputket. Teleskoopit. Tähtitornit. Observatoriot Astrospektrometria. Astrofotometria Radioteleskoopit. Radioastronomia Tähtivalokuvaus

Avaruustutkimus. Avaruustoiminta
type: Concept
References: Ilmavoimat. Ilmasodankäynti
References: Tähtitieteelliset kojeet
References: Meteorologia. Klimatologia
References: Tietoliikenne. Viestintätekniikka. Multimedia
References: Avaruusalukset. Avaruusteknologia
type: YKL-luokka
alternative label: Astronautiikka (52.4)
alternative label: Astronautik (52.4) @sv
alternative label: Avaruusalukset, avaruustutkimus (52.4)
alternative label: Avaruusasemat, avaruustutkimus (52.4)
alternative label: Avaruuskeskukset, avaruustutkimus (52.4)
alternative label: Avaruuslennot (52.4)
alternative label: Avaruusluotaimet, avaruustutkimus (52.4)
alternative label: Avaruusraketit, avaruustutkimus (52.4)
alternative label: Avaruussukkulat, avaruustutkimus (52.4)
alternative label: Avaruustutkimus (52.4)
alternative label: Kosmonautiikka (52.4)
alternative label: Kosmonautik (52.4) @sv
alternative label: Kuu, avaruuslennot (52.4)
alternative label: Kuulennot (52.4)
alternative label: Månen, rymdfärder (52.4) @sv
alternative label: Månflygningar (52.4) @sv
alternative label: Planeetat, avaruuslennot (52.4)
alternative label: Planeter, rymdfärder (52.4) @sv
alternative label: Raketer, rymdfärder (52.4) @sv
alternative label: Raketit, avaruuslennot (52.4)
alternative label: Rymdcentraler, rymdforskning (52.4) @sv
alternative label: Rymdfarkoster, rymdforskning (52.4) @sv
alternative label: Rymdforskning (52.4) @sv
alternative label: Rymdfärder (52.4) @sv
alternative label: Rymdraketer, rymdforskning (52.4) @sv
alternative label: Rymdskyttlar, rymdforskning (52.4) @sv
alternative label: Rymdsonder, rymdforskning (52.4) @sv
alternative label: Rymdstationer, rymdforskning (52.4) @sv
alternative label: Satelliitit, avaruustutkimus (52.4)
alternative label: Satelliter, rymdforskning (52.4) @sv
alternative label: Tekokuut, avaruustutkimus (52.4)
broader: TÄHTITIEDE. GEODESIA
in scheme: YKL - Yleisten kirjastojen luokitusjärjestelmä
notation: 52.4
preferred label: Rymdforskning. Rymdverksamhet @sv
preferred label: Space research. Space exploration @en
scope note: Bemannade och obemannade rymdflygningar Användning av raketer, satelliter och sonder i rymdforskningen Astronautik. Kosmonautik Om verket behandlar både rymdflygningar och rymdfarkoster, ges företräde åt klass 52.4 @sv
scope note: Miehitetyt ja miehittämättömät avaruuslennot Rakettien, satelliittien ja luotaimien käyttö avaruustutkimuksessa Astronautiikka. Kosmonautiikka Jos teos koskee sekä avaruuslentoja että avaruusaluksia, annetaan etusija luokalle 52.4

Geodesia. Maanmittaus. Kartoitus
type: Concept
References: Maailmankartat ja -kartastot
References: Historialliset maailmankartat ja -kartastot
alternative label: Astemittaus (52.6)
alternative label: Avvägning, lantmäteri (52.6) @sv
alternative label: Datorstödd kartografi (52.6) @sv
alternative label: Fixpunktsmätning (52.6) @sv
alternative label: Flygfotografering (52.6) @sv
alternative label: Flygkartläggning (52.6) @sv
alternative label: Fotogrammetri (52.6) @sv
alternative label: Fotogrammetria (52.6)
alternative label: Fältmätning (52.6) @sv
alternative label: GPS, paikannus (52.6)
alternative label: GPS, positionsbestämning (52.6) @sv
alternative label: Geodeettiset projektiot (52.6)
alternative label: Geodesi (52.6) @sv
alternative label: Geodesia (52.6)
alternative label: Geodetiska projektioner (52.6) @sv
alternative label: Geografi, matematisk geografi (52.6) @sv
alternative label: Geografiska informationssystem (52.6) @sv
alternative label: Gradmätning (52.6) @sv
alternative label: Ilmakuvamittaus (52.6)
alternative label: Ilmakuvaus (52.6)
alternative label: Kartanpiirustus (52.6)
alternative label: Kartläggning (52.6) @sv
alternative label: Kartlära (52.6) @sv
alternative label: Kartografi (52.6) @sv
alternative label: Kartografia (52.6)
alternative label: Kartoitus (52.6)
alternative label: Kartprojektioner (52.6) @sv
alternative label: Kartritning (52.6) @sv
alternative label: Karttaoppi (52.6)
alternative label: Karttaprojektiot (52.6)
alternative label: Kaupunkimittaus (52.6)
alternative label: Kenttämittaus (52.6)
alternative label: Kiintopistemittaus (52.6)
alternative label: Kolmiomittaus (52.6)
alternative label: Koordinaattijärjestelmät (52.6)
alternative label: Koordinatsystem (52.6) @sv
alternative label: Lantmäteri (52.6) @sv
alternative label: Maanmittaus (52.6)
alternative label: Maantiede, matemaattinen (52.6)
alternative label: Matemaattinen maantiede (52.6)
alternative label: Matematisk geografi (52.6) @sv
alternative label: Mittaustekniikka, maanmittaus (52.6)
alternative label: Mätningsteknik, lantmäteri (52.6) @sv
alternative label: Ortnamn, kartografi (52.6) @sv
alternative label: Paikannimet, karttaoppi (52.6)
alternative label: Paikannus (52.6)
alternative label: Paikantimet (52.6)
alternative label: Paikkatietojärjestelmät (52.6)
alternative label: Piirustus, karttaoppi (52.6)
alternative label: Pinnanmuodostus, karttaoppi (52.6)
alternative label: Positioneringsutrustningar (52.6) @sv
alternative label: Positionsbestämning (52.6) @sv
alternative label: Ritning, kartografi (52.6) @sv
alternative label: Satelliitit, karttakuvaus (52.6)
alternative label: Satelliittipaikannus (52.6)
alternative label: Satelliter, kartfotografering (52.6) @sv
alternative label: Satellitnavigering (52.6) @sv
alternative label: Stadsmätning (52.6) @sv
alternative label: Tietokoneavusteinen kartografia (52.6)
alternative label: Topografi, kartografi (52.6) @sv
alternative label: Topografia, karttaoppi (52.6)
alternative label: Topologi, kartografi (52.6) @sv
alternative label: Topologia, karttaoppi (52.6)
alternative label: Triangelmätning (52.6) @sv
alternative label: Vaakitus, maanmittaus (52.6)
alternative label: Ytbildning, kartografi (52.6) @sv
alternative label: fjärranalys (52.6) @sv
alternative label: geoinformatiikka (52.6)
alternative label: geoinformatik (52.6) @sv
alternative label: kaukokartoitus (52.6)
broader: TÄHTITIEDE. GEODESIA
in scheme: YKL - Yleisten kirjastojen luokitusjärjestelmä
notation: 52.6
preferred label: Geodesi. Lantmäteri. Kartering @sv
preferred label: Geodesy. Land surveying. Mapping @en
scope note: Geodeettiset projektiot. Karttaprojektiot Koordinaattijärjestelmät. Kiintopistemittaus Kolmiomittaus. Maastomittaus. Kaupunkimittaus Fotogrammetria. Ilmakuvaus. Ilmakuvamittaus Kartografia. Kartanpiirustus. Karttaoppi Paikannus, satelliittipaikannus ja GPS yleensä Erikoisalojen kartat luokitetaan alan mukaan
scope note: Geodetiska projektioner. Kartprojektioner Koordinatsystem. Fixpunktsmätning Triangelmätning. Terrängmätning. Stadsmätning Fotogrammetri. Flygfotografering. Flygfotografimätning Kartografi. Kartritning. Kartlära Positionsbestämning, satellitnavigering och GPS i allmänhet Kartor för specialområden klassificeras enligt område @sv

Ajanlasku
type: Concept
References: Vuosikirjat. Kalenterit. Almanakat
References: Kelloteollisuus
type: YKL-luokka
alternative label: Aika, yl. (52.8)
alternative label: Ajan mittaus (52.8)
alternative label: Ajanlasku (52.8)
alternative label: Ajanmittauskojeet (52.8)
alternative label: Almanackor, tideräkning (52.8) @sv
alternative label: Almanakat, ajanlasku (52.8)
alternative label: Aurinkokellot (52.8)
alternative label: Kalendrar, tideräkning (52.8) @sv
alternative label: Kalenterit, ajanlasku (52.8)
alternative label: Kronologi, astronomi (52.8) @sv
alternative label: Kronologi, tideräkning (52.8) @sv
alternative label: Kronologia, ajanlasku (52.8)
alternative label: Kronologia, tähtitiede (52.8)
alternative label: Solur (52.8) @sv
alternative label: Tid, allm. (52.8) @sv
alternative label: Tideräkning (52.8) @sv
alternative label: Tidmätning (52.8) @sv
alternative label: Tidmätningsapparater (52.8) @sv
broader: TÄHTITIEDE. GEODESIA
in scheme: YKL - Yleisten kirjastojen luokitusjärjestelmä
notation: 52.8
preferred label: Chronology @en
preferred label: Tideräkning @sv
scope note: Aika yleensä. Ajan mittaus. Ajanmittauskojeet Kalentereiden ja almanakan laatiminen Erikoisalojen kalenterit luokitetaan alan mukaan
scope note: Tid i allmänhet. Mätning av tid. Apparater för mätning av tid Utarbetande av almanackor och kalendrar Kalendrar för specialområden klassificeras enligt område @sv

FYSIIKKA
type: Concept
References: Maailmankaikkeus. Tähdet. Tähtijärjestelmät
References: Teoreettinen ja fysikaalinen kemia
References: Biokemia. Biofysiikka. Molekyylibiologia
References: SOVELLETUT TIETEET
type: YKL-luokka
alternative label: Experimentell fysik (53+) @sv
alternative label: Fysiikka (53+)
alternative label: Fysiikka, kokeellinen (53+)
alternative label: Fysik (53+) @sv
alternative label: Fysik, experimentell (53+) @sv
alternative label: Kokeellinen fysiikka (53+)
alternative label: Luonnontieteet (50 ... 58+)
alternative label: Luonnontutkimus (50 ... 58+)
alternative label: Nanohiukkaset, fysiikka (53+)
alternative label: Nanopartiklar, fysik (53+) @sv
alternative label: Naturforskning (50 ... 58+) @sv
alternative label: Naturvetenskaper (50 ... 58+) @sv
alternative label: Pienhiukkaset, fysiikka (53+)
alternative label: Småpartiklar, fysik (53+) @sv
broader: LUONNONTIETEET. MATEMATIIKKA. LÄÄKETIEDE
in scheme: YKL - Yleisten kirjastojen luokitusjärjestelmä
narrower: Yleinen ja teoreettinen fysiikka
narrower: Mekaniikka
narrower: Äänioppi. Mekaaniset värähtelyt
narrower: Lämpöoppi
narrower: Valo-oppi. Säteilyoppi
narrower: Sähköoppi. Magnetismi
narrower: Fysiikka harrasteena ja ajanvietteenä
notation: 53
preferred label: FYSIK @sv
preferred label: PHYSICS @en
scope note: Hit allmänna verk i fysik. Tekniska och industriella tillämpningar av fysik klassificeras enligt område. Fysikläroböcker som riktar sig till olika yrkesgrupper hit. Allmänna läroböcker i fysik 53.07 @sv
scope note: Tähän fysiikan yleisteokset. Fysiikan tekniset ja teolliset sovellukset luokitetaan alan mukaan. Eri ammattialojen fysiikan oppikirjat tähän. Yleiset fysiikan oppikirjat 53.07

Yleinen ja teoreettinen fysiikka
type: Concept
References: FYSIIKKA
type: YKL-luokka
alternative label: Dragningskrafter, teoretisk fysik (53.1) @sv
alternative label: Enhetsteori, teoretisk fysik (53.1) @sv
alternative label: Fysiikka, peruslait (53.1)
alternative label: Fysiikka, teoreettinen (53.1+)
alternative label: Fysik, fundamentala lagar (53.1) @sv
alternative label: Fysik, teoretisk (53.1+) @sv
alternative label: Gravitaatio, teoreettinen fysiikka (53.1)
alternative label: Gravitation, teoretisk fysik (53.1) @sv
alternative label: Painovoima, teoreettinen fysiikka (53.1)
alternative label: Teoreettinen fysiikka (53.1+)
alternative label: Teoretisk fysik (53.1+) @sv
alternative label: Tyngdkraft, teoretisk fysik (53.1) @sv
alternative label: Vetovoimat, teoreettinen fysiikka (53.1)
alternative label: Yhtenäisteoria, teoreettinen fysiikka (53.1)
broader: FYSIIKKA
in scheme: YKL - Yleisten kirjastojen luokitusjärjestelmä
narrower: Suhteellisuusteoria
narrower: Ydinfysiikka. Atomifysiikka. Molekyylifysiikka
narrower: Kvanttiteoria. Kvanttimekaniikka
notation: 53.1
preferred label: Allmän och teoretisk fysik @sv
preferred label: General and theoretical physics @en
scope note: Fysiikan peruslait Muotoluokkaa 01 ei käytetä luokan 53.1 yhteydessä
scope note: Fysikens grundlagar Formtillägget 01 används inte i samband med klassen 53.1 @sv

Suhteellisuusteoria
type: Concept
type: YKL-luokka
alternative label: Relativitetsteorin (53.11) @sv
alternative label: Suhteellisuusteoria (53.11)
broader: Yleinen ja teoreettinen fysiikka
in scheme: YKL - Yleisten kirjastojen luokitusjärjestelmä
notation: 53.11
preferred label: Relativitetsteorin @sv
preferred label: Theory of relativity @en

Ydinfysiikka. Atomifysiikka. Molekyylifysiikka
type: Concept
References: Palo- ja pelastustoimi
References: Aseistus. Asevarustelu. Asekauppa
References: Tapaturmantorjunta. Ensiapu
References: Sosiaalilääketiede. Ympäristölääketiede
References: Elimet. Taudit
References: Ydinenergia
alternative label: Alfastrålning, fysik (53.12) @sv
alternative label: Alfasäteily, fysiikka (53.12)
alternative label: Alkeishiukkaset (53.12)
alternative label: Atomer, fysik (53.12) @sv
alternative label: Atomfysik (53.12) @sv
alternative label: Atomifysiikka (53.12)
alternative label: Atomireaktorit, ydinfysiikka (53.12)
alternative label: Atomit, fysiikka (53.12)
alternative label: Atomiteoria, fysiikka (53.12)
alternative label: Atomreaktorer, kärnfysik (53.12) @sv
alternative label: Atomteori, fysik (53.12) @sv
alternative label: Beetasäteily, fysiikka (53.12)
alternative label: Betastrålning, fysik (53.12) @sv
alternative label: Elektroner, kärnfysik (53.12) @sv
alternative label: Elektronit, ydinfysiikka (53.12)
alternative label: Elementarpartiklar (53.12) @sv
alternative label: Fasta ämnens fysik (53.12) @sv
alternative label: Fissio, ydinfysiikka (53.12)
alternative label: Fission, kärnfysik (53.12) @sv
alternative label: Fusion, kärnfysik (53.12) @sv
alternative label: Fuusio, ydinfysiikka (53.12)
alternative label: Gammastrålning, fysik (53.12) @sv
alternative label: Gammasäteily, fysiikka (53.12)
alternative label: Hiukkasfysiikka (53.12)
alternative label: Hyperoner (53.12) @sv
alternative label: Hyperonit (53.12)
alternative label: Isotoopit, ydinfysiikka (53.12)
alternative label: Isotoper, kärnfysik (53.12) @sv
alternative label: Kedjereaktion, kärnfysik (53.12) @sv
alternative label: Ketjureaktio, ydinfysiikka (53.12)
alternative label: Kidetiede, fysiikka (53.12)
alternative label: Kiinteiden aineiden fysiikka (53.12)
alternative label: Kiteet, fysiikka (53.12)
alternative label: Kristaller, fysik (53.12) @sv
alternative label: Kristallografi, fysik (53.12) @sv
alternative label: Kristallografia, fysiikka (53.12)
alternative label: Kvarkar (53.12) @sv
alternative label: Kvarkit (53.12)
alternative label: Kärnfysik (53.12) @sv
alternative label: Kärnreaktioner, kärnfysik (53.12) @sv
alternative label: Mesoner (53.12) @sv
alternative label: Mesonit (53.12)
alternative label: Molekyler, fysik (53.12) @sv
alternative label: Molekylärfysik (53.12) @sv
alternative label: Molekyylifysiikka (53.12)
alternative label: Molekyylit, fysiikka (53.12)
alternative label: Neutriinot (53.12)
alternative label: Neutrinor (53.12) @sv
alternative label: Neutroner (53.12) @sv
alternative label: Neutronit (53.12)
alternative label: Nukleoner (53.12) @sv
alternative label: Nukleonit (53.12)
alternative label: Partikelfysik (53.12) @sv
alternative label: Pintafysiikka (53.12)
alternative label: Positroner (53.12) @sv
alternative label: Positronit (53.12)
alternative label: Radioaktiivisuus, ydinfysiikka (53.12)
alternative label: Radioaktivitet, kärnfysik (53.12) @sv
alternative label: Radiofysiikka (53.12)
alternative label: Radiofysik (53.12) @sv
alternative label: Reaktorfysik (53.12) @sv
alternative label: Reaktorifysiikka (53.12)
alternative label: Röntgenstrålar, fysik (53.12) @sv
alternative label: Röntgensäteet, fysiikka (53.12)
alternative label: Strålning, kärnfysik (53.12) @sv
alternative label: Säteily, ydinfysiikka (53.12)
alternative label: Ydinfysiikka (53.12)
alternative label: Ydinreaktiot, ydinfysiikka (53.12)
broader: Yleinen ja teoreettinen fysiikka
in scheme: YKL - Yleisten kirjastojen luokitusjärjestelmä
notation: 53.12
scope note: Allmän atomteori Elementarpartikelfysik. Reaktorfysik Atomers och kärnors uppbyggnad och fysik. Isotoper Kärnreaktorer. Fission. Fusion. Kedjereaktion Radioaktivitet. Radioaktiv strålning i allmänhet Alfa-, beta- och gammastrålning Molekylers och fasta ämnens uppbyggnad och fysik @sv
scope note: Yleinen atomiteoria Alkeishiukkasfysiikka. Reaktorifysiikka Atomien ja ytimien rakenne ja fysiikka. Isotoopit Ydinreaktiot. Fissio. Fuusio. Ketjureaktio Radioaktiivisuus. Radioaktiivinen säteily yleensä Alfa-, beeta- ja gammasäteily Molekyylien ja kiinteiden aineiden rakenne ja fysiikka

Kvanttiteoria. Kvanttimekaniikka
type: Concept
type: YKL-luokka
alternative label: Aaltomekaniikka (53.13)
alternative label: Fotoner, kvantfysik (53.13) @sv
alternative label: Fotonit, kvanttifysiikka (53.13)
alternative label: Kvantfysik (53.13) @sv
alternative label: Kvantmekanik (53.13) @sv
alternative label: Kvantteori (53.13) @sv
alternative label: Kvanttifysiikka (53.13)
alternative label: Kvanttimekaniikka (53.13)
alternative label: Kvanttiteoria (53.13)
alternative label: Mekaniikka, kvanttimekaniikka (53.13)
alternative label: Mekanik, kvantmekanik (53.13) @sv
alternative label: Vågmekanik (53.13) @sv
broader: Yleinen ja teoreettinen fysiikka
in scheme: YKL - Yleisten kirjastojen luokitusjärjestelmä
notation: 53.13
preferred label: Kvantteori. Kvantmekanik @sv
preferred label: Quantum theory. Quantum mechanics @en

Mekaniikka
type: Concept
References: Aseistus. Asevarustelu. Asekauppa
References: Aineoppi. Aineenkoetus. Tekninen mekaniikka
References: METALLITEOLLISUUS. KONETEKNIIKKA. LIIKENNEVÄLINEET SÄHKÖTEKNIIKKA
alternative label: Acceleration, fysik (53.3) @sv
alternative label: Aerodynamiikka, fysiikka (53.3)
alternative label: Aerodynamik, fysik (53.3) @sv
alternative label: Aeromekaniikka, fysiikka (53.3)
alternative label: Aeromekanik, fysik (53.3) @sv
alternative label: Aerostatiikka, fysiikka (53.3)
alternative label: Aerostatik, fysik (53.3) @sv
alternative label: Arbete, fysik (53.3) @sv
alternative label: Densitet, fysik (53.3) @sv
alternative label: Diffusion, fysik (53.3) @sv
alternative label: Diffuusio, fysiikka (53.3)
alternative label: Dragningskrafter, mekanik (53.3) @sv
alternative label: Dynamiikka, mekaniikka (53.3)
alternative label: Dynamik, mekanik (53.3) @sv
alternative label: Elasticitet, fysik (53.3) @sv
alternative label: Elastisuus, fysiikka (53.3)
alternative label: Fasta kroppars mekanik, fysik (53.3) @sv
alternative label: Flöde, fysik (53.3) @sv
alternative label: Friktion, fysik (53.3) @sv
alternative label: Gaser, mekanik (53.3) @sv
alternative label: Gravitaatio, mekaniikka (53.3)
alternative label: Gravitation, mekanik (53.3) @sv
alternative label: Hastighet, fysik (53.3) @sv
alternative label: Heiluri, fysiikka (53.3)
alternative label: Hitausvoima, fysiikka (53.3)
alternative label: Hydrodynamiikka, fysiikka (53.3)
alternative label: Hydrodynamik, fysik (53.3) @sv
alternative label: Hydromekaniikka, fysiikka (53.3)
alternative label: Hydromekanik, fysik (53.3) @sv
alternative label: Hydrostatiikka, fysiikka (53.3)
alternative label: Hydrostatik, fysik (53.3) @sv
alternative label: Hållfasthet, fysik (53.3) @sv
alternative label: Kaasut, mekaniikka (53.3)
alternative label: Kapillariteetti, fysiikka (53.3)
alternative label: Kapillaritet, fysik (53.3) @sv
alternative label: Kiihtyvyys, fysiikka (53.3)
alternative label: Kiinteiden kappaleiden mekaniikka, fysiikka (53.3)
alternative label: Kimmoisuus, fysiikka (53.3)
alternative label: Kinetiikka, mekaniikka (53.3)
alternative label: Kinetik, mekanik (53.3) @sv
alternative label: Kitka, fysiikka (53.3)
alternative label: Kraft, fysik (53.3) @sv
alternative label: Liike, fysiikka (53.3)
alternative label: Lujuus, fysiikka (53.3)
alternative label: Massa, fysiikka (53.3)
alternative label: Massa, fysik (53.3) @sv
alternative label: Mekaaninen energia, fysiikka (53.3)
alternative label: Mekaniikka, fysiikka (53.3)
alternative label: Mekaniikka, kaasujen (53.3)
alternative label: Mekaniikka, kiinteiden kappaleiden (53.3)
alternative label: Mekaniikka, nesteiden (53.3)
alternative label: Mekanik, fasta kroppar (53.3) @sv
alternative label: Mekanik, fysik (53.3) @sv
alternative label: Mekanik, gaser (53.3) @sv
alternative label: Mekanik, vätskor (53.3) @sv
alternative label: Mekanisk energi, fysik (53.3) @sv
alternative label: Nesteet, mekaniikka (53.3)
alternative label: Nopeus, fysiikka (53.3)
alternative label: Osmoosi, fysiikka (53.3)
alternative label: Paino, mekaniikka (53.3)
alternative label: Painovoima, mekaniikka (53.3)
alternative label: Plasmafysiikka (53.3)
alternative label: Plastisuus, fysiikka (53.3)
alternative label: Statiikka, mekaniikka (53.3)
alternative label: Tiheys, fysiikka (53.3)
alternative label: Tribologia, fysiikka (53.3)
alternative label: Työ, fysiikka (53.3)
alternative label: Vastus, mekaniikka (53.3)
alternative label: Vetovoimat, mekaniikka (53.3)
alternative label: Virtaus, fysiikka (53.3)
alternative label: Voima, fysiikka (53.3)
broader: FYSIIKKA
in scheme: YKL - Yleisten kirjastojen luokitusjärjestelmä
notation: 53.3
scope note: Fasta och styva kroppars mekanik Vätskors mekanik. Gasers mekanik Statik. Dynamik. Kinetik Tyngdkraft. Pendeln Hållfasthet. Elasticitet. Plasticitet Hydrostatik. Hydrodynamik Aerostatik. Aerodynamik Strömning. Kapillaritet. Osmos. Diffusion Plasmafysik @sv
scope note: Kiinteiden ja jäykkien kappaleiden mekaniikka Nesteiden mekaniikka. Kaasujen mekaniikka Statiikka. Dynamiikka. Kinetiikka Painovoima. Heiluri Lujuus. Kimmoisuus. Plastisuus Hydrostatiikka. Hydrodynamiikka Aerostatiikka. Aerodynamiikka Virtaus. Kapillariteetti. Osmoosi. Diffuusio Plasmafysiikka

Äänioppi. Mekaaniset värähtelyt
type: Concept
References: Sähköoppi. Magnetismi
References: Aistinelimet. Silmätaudit. Kurkku-, nenä- ja korvataudit
References: Äänitekniikka. Radiotekniikka
References: Huoneakustiikka
type: YKL-luokka
alternative label: Aaltoliike, mekaaniset värähtelyt (53.4)
alternative label: Aaltoliike, äänioppi (53.4)
alternative label: Akustiikka (53.4)
alternative label: Akustiikka, fysiikka (53.4)
alternative label: Akustik (53.4) @sv
alternative label: Akustik, fysik (53.4) @sv
alternative label: Eko, akustik (53.4) @sv
alternative label: Ekolodning, akustik (53.4) @sv
alternative label: Heijastuminen, äänioppi (53.4)
alternative label: Infraljud, fysik (53.4) @sv
alternative label: Infraäänet, fysiikka (53.4)
alternative label: Kaiku, äänioppi (53.4)
alternative label: Kaikuluotaus, äänioppi (53.4)
alternative label: Ljud, fysik (53.4) @sv
alternative label: Ljudlära, fysik (53.4) @sv
alternative label: Ljudvågor, fysik (53.4) @sv
alternative label: Mekaaniset värähtelyt, fysiikka (53.4)
alternative label: Mekaniska vibrationer, fysik (53.4) @sv
alternative label: Reflexion, akustik (53.4) @sv
alternative label: Ultraljud, fysik (53.4) @sv
alternative label: Ultraäänet, fysiikka (53.4)
alternative label: Vibrationer, mekaniska (53.4) @sv
alternative label: Värähtelyt, mekaaniset (53.4)
alternative label: Vågrörelse, akustik (53.4) @sv
alternative label: Vågrörelse, mekaniska svängningar (53.4) @sv
alternative label: Ääni, fysiikka (53.4)
alternative label: Ääniaallot, fysiikka (53.4)
alternative label: Äänioppi, fysiikka (53.4)
broader: FYSIIKKA
in scheme: YKL - Yleisten kirjastojen luokitusjärjestelmä
notation: 53.4
preferred label: Acoustics. Mechanical vibrations @en
preferred label: Ljudlära. Mekaniska svängningar @sv
scope note: Hit mekaniska svängningar i allmänhet Akustik i allmänhet Ljudvågor. Infraljud. Ultraljud Reflekterande vågor. Eko. Ekolod @sv
scope note: Tähän mekaaniset värähtelyt yleensä Akustiikka yleensä Ääniaallot. Infraäänet. Ultraäänet Aaltojen heijastuminen. Kaiku. Kaikuluotaus

Lämpöoppi
type: Concept
References: Teoreettinen ja fysikaalinen kemia
References: Meteorologia. Klimatologia
References: Mekaaninen teknologia. Metallin työstö
References: Hienomekaaninen teollisuus
References: Lämmitys
type: YKL-luokka
alternative label: Energetiikka, fysiikka (53.5)
alternative label: Energetik, fysik (53.5) @sv
alternative label: Entropi, fysik (53.5) @sv
alternative label: Entropia, fysiikka (53.5)
alternative label: Förbränning (53.5) @sv
alternative label: Härmistyminen (53.5)
alternative label: Högtemperaturfysik (53.5) @sv
alternative label: Höyrystyminen (53.5)
alternative label: Isbildning (53.5) @sv
alternative label: Jähmettyminen, lämpöoppi (53.5)
alternative label: Jäätyminen (53.5)
alternative label: Kalorimetri (53.5) @sv
alternative label: Kalorimetria (53.5)
alternative label: Kiehuminen (53.5)
alternative label: Kokning (53.5) @sv
alternative label: Kondensering (53.5) @sv
alternative label: Kondensoituminen (53.5)
alternative label: Korkeiden lämpötilojen fysiikka (53.5)
alternative label: Kylmäfysiikka (53.5)
alternative label: Köldfysik (53.5) @sv
alternative label: Lämmön johtuminen, fysiikka (53.5)
alternative label: Lämpö, fysiikka (53.5)
alternative label: Lämpömittari, fysiikka (53.5)
alternative label: Lämpöoppi (53.5)
alternative label: Lämpösäteily, fysiikka (53.5)
alternative label: Lämpötila, fysiikka (53.5)
alternative label: Lämpötilan mittaus, fysiikka (53.5)
alternative label: Lämpötilan säätö, fysiikka (53.5)
alternative label: Palaminen (53.5)
alternative label: Smältning (53.5) @sv
alternative label: Stelning, värmelära (53.5) @sv
alternative label: Strålning, värmestrålning (53.5) @sv
alternative label: Sublimering (53.5) @sv
alternative label: Sublimoituminen (53.5)
alternative label: Sulaminen (53.5)
alternative label: Säteily, lämpösäteily (53.5)
alternative label: Temperatur, fysik (53.5) @sv
alternative label: Temperaturmätning, fysik (53.5) @sv
alternative label: Temperaturreglering, fysik (53.5) @sv
alternative label: Termodynamiikka (53.5)
alternative label: Termodynamik (53.5) @sv
alternative label: Termometer, fysik (53.5) @sv
alternative label: Termometri, fysiikka (53.5)
alternative label: Termostaatti, fysiikka (53.5)
alternative label: Termostat, fysik (53.5) @sv
alternative label: Värme, fysik (53.5) @sv
alternative label: Värmeledning, fysik (53.5) @sv
alternative label: Värmelära (53.5) @sv
alternative label: Värmestrålning, fysik (53.5) @sv
alternative label: Ångbildning (53.5) @sv
broader: FYSIIKKA
in scheme: YKL - Yleisten kirjastojen luokitusjärjestelmä
notation: 53.5
preferred label: Thermology @en
preferred label: Värmelära @sv
scope note: Lämpösäteily. Lämmön johtuminen Lämpötilan vaikutus aineisiin Korkeiden ja matalien lämpötilojen fysiikka Lämpötilan mittaus ja säätö. Kalorimetria Lämpömittarin ja termostaatin fysiikka Termodynamiikka. Energetiikka. Entropia
scope note: Värmestrålning. Värmeledare Värmets inverkan på ämnen Höga och låga temperaturers fysik Mätning och reglering av temperaturen. Kalorimetri Termometrar och termostat samt deras fysik Termodynamik. Energetik. Entropi @sv

Valo-oppi. Säteilyoppi
type: Concept
References: Teoreettinen ja fysikaalinen kemia
References: Aistinelimet. Silmätaudit. Kurkku-, nenä- ja korvataudit
References: Sähkötekniikka
References: Elektroniikka
References: Optiset ja lääketieteelliset laitteet
References: LVI-työt. Sähkötyöt
References: UUDET TAIDEMUODOT
alternative label: Aaltoliike, valo-oppi (53.6+)
alternative label: Absorptio, valo-oppi (53.6+)
alternative label: Absorption, optik (53.6+) @sv
alternative label: Brytning, optik (53.6+) @sv
alternative label: Diffraktion, optik (53.6+) @sv
alternative label: Dubbelbrytning (53.6+) @sv
alternative label: Emissio, säteilyoppi (53.6+)
alternative label: Emission, radiologi (53.6+) @sv
alternative label: Fotoelektricitet (53.6) @sv
alternative label: Fotometri (53.6+) @sv
alternative label: Fotometria (53.6+)
alternative label: Heijastuminen, valo-oppi (53.6+)
alternative label: Holografi, fysik (53.6) @sv
alternative label: Holografia, fysiikka (53.6)
alternative label: Infrapunasäteet (53.6)
alternative label: Infraröd strålning (53.6) @sv
alternative label: Interferens, optik (53.6+) @sv
alternative label: Interferenssi, valo-oppi (53.6+)
alternative label: Kahtaistaittuminen (53.6+)
alternative label: Laser, fysiikka (53.6)
alternative label: Laser, fysik (53.6) @sv
alternative label: Linser, optik (53.6+) @sv
alternative label: Linssit, valo-oppi (53.6+)
alternative label: Ljus, fysik (53.6+) @sv
alternative label: Loistevalo, fysiikka (53.6)
alternative label: Luminenssi, fysiikka (53.6)
alternative label: Luminiscens, fysik (53.6) @sv
alternative label: Maser, fysiikka (53.6)
alternative label: Maser, fysik (53.6) @sv
alternative label: Näkyvä valo (53.6+)
alternative label: Optiikka, fysiikka (53.6+)
alternative label: Optik (53.6+) @sv
alternative label: Optik, fysik (53.6+) @sv
alternative label: Peilit, valo-oppi (53.6+)
alternative label: Polarisaatio, valo-oppi (53.6+)
alternative label: Polarisation, optik (53.6+) @sv
alternative label: Prismat, valo-oppi (53.6+)
alternative label: Prismer, optik (53.6+) @sv
alternative label: Radiologi, fysik (53.6) @sv
alternative label: Radiometri (53.6) @sv
alternative label: Radiometria (53.6)
alternative label: Reflexion, optik (53.6+) @sv
alternative label: Speglar, optik (53.6+) @sv
alternative label: Spektra, optik (53.6+) @sv
alternative label: Spektrit, valo-oppi (53.6+)
alternative label: Spektrografi, optik (53.6+) @sv
alternative label: Spektrografia, valo-oppi (53.6+)
alternative label: Spektroskopi, optik (53.6+) @sv
alternative label: Spektroskopia, valo-oppi (53.6+)
alternative label: Strålning, infraröd (53.6) @sv
alternative label: Strålning, synligt ljus (53.6+) @sv
alternative label: Strålning, ultraviolett (53.6) @sv
alternative label: Strålningsenergi, radiologi (53.6) @sv
alternative label: Synligt ljus (53.6+) @sv
alternative label: Säteily, infrapunasäteily (53.6)
alternative label: Säteily, näkyvä valo (53.6+)
alternative label: Säteily, ultraviolettisäteily (53.6)
alternative label: Säteilyenergia, säteilyoppi (53.6)
alternative label: Säteilyoppi, fysiikka (53.6)
alternative label: Taipuminen, valo-oppi (53.6+)
alternative label: Taittuminen, valo-oppi (53.6+)
alternative label: Ultraviolettisäteet, fysiikka (53.6)
alternative label: Ultraviolettstrålar, fysik (53.6) @sv
alternative label: Valo, fysiikka (53.6+)
alternative label: Valo-oppi (53.6+)
alternative label: Valosähköilmiö (53.6)
broader: FYSIIKKA
in scheme: YKL - Yleisten kirjastojen luokitusjärjestelmä
narrower: Värioppi
notation: 53.6
scope note: Teorier om ljuset. Optik Synligt ljus. Infraröd och ultraviolett strålning Ljusets fortplantning. Reflexion. Brytning Absorption. Emission. Interferens. Diffraktion Spektrum. Spektroskopi. Spektrografi Spegelns, prismats och linsens fysik Polarisation. Dubbelbrytning Strålningsenergi. Fotometri. Radiometri Fotoelektriska fenomen. Luminiscens Holografins fysik. Laser- och maserfysik @sv
scope note: Valon teoriat. Optiikka Näkyvä valo. Infrapuna- ja ultraviolettisäteet Valon eteneminen. Heijastuminen. Taittuminen Absorptio. Emissio. Interferenssi. Taipuminen Spektrit. Spektroskopia. Spektrografia Peilin, prisman ja linssin fysiikka Polarisaatio. Kahtaistaittuminen Säteilyenergia. Fotometria. Radiometria Valosähköilmiö. Loistevalo. Luminenssi Holografian, laserin ja maserin fysiikka

Värioppi
type: Concept
References: Aistinelimet. Silmätaudit. Kurkku-, nenä- ja korvataudit
References: Taiteen estetiikka
type: YKL-luokka
alternative label: Färger, fysik (53.66) @sv
alternative label: Färglära, fysik (53.66) @sv
alternative label: Färgmetrik, fysik (53.66) @sv
alternative label: Spektra, synligt ljus (53.66) @sv
alternative label: Spektrit, näkyvä valo (53.66)
alternative label: Värimetriikka, fysiikka (53.66)
alternative label: Värioppi, fysiikka (53.66)
alternative label: Värit, fysiikka (53.66)
broader: Valo-oppi. Säteilyoppi
in scheme: YKL - Yleisten kirjastojen luokitusjärjestelmä
notation: 53.66
preferred label: Chromatics @en
preferred label: Färglära @sv
scope note: Färgernas sammansättning. Färgskalor Färgsystem. Färgmetrik @sv
scope note: Värien koostumus. Väriasteikot Värijärjestelmät. Värimetriikka

Sähköoppi. Magnetismi
type: Concept
References: Teoreettinen ja fysikaalinen kemia
References: Geologia. Geomorfologia
References: Sähkötekniikka
References: Elektroniikka
type: YKL-luokka
alternative label: Aaltoliike, sähköoppi (53.7)
alternative label: Dynamiikka, sähköoppi (53.7)
alternative label: Dynamik, elektricitetslära (53.7) @sv
alternative label: Effekt, elektricitetslära (53.7) @sv
alternative label: Elektricitet, fysik (53.7) @sv
alternative label: Elektricitetslära, fysik (53.7) @sv
alternative label: Elektrisk ström, fysik (53.7) @sv
alternative label: Elektriska ledare, fysik (53.7) @sv
alternative label: Elektriska urladdningar, fysik (53.7) @sv
alternative label: Elektriskt fält, fysik (53.7) @sv
alternative label: Elektrodynamik, fysik (53.7) @sv
alternative label: Elektrokinetik, fysik (53.7) @sv
alternative label: Elektromagnetism, fysik (53.7) @sv
alternative label: Elektrostatik, fysik (53.7) @sv
alternative label: Frekvens, elektricitetslära (53.7) @sv
alternative label: Galvanism, elektricitetslära (53.7) @sv
alternative label: Galvanismi, sähköoppi (53.7)
alternative label: Isolatorer, fysik (53.7) @sv
alternative label: Johteet, sähköoppi (53.7)
alternative label: Jännite, sähköoppi (53.7)
alternative label: Kinetiikka, sähköoppi (53.7)
alternative label: Kinetik, elektricitetslära (53.7) @sv
alternative label: Ledare, elektricitetslära (53.7) @sv
alternative label: Magneettiset kentät, fysiikka (53.7)
alternative label: Magnetisering, fysik (53.7) @sv
alternative label: Magnetiska fält, fysik (53.7) @sv
alternative label: Magnetism, fysik (53.7) @sv
alternative label: Magnetismi, fysiikka (53.7)
alternative label: Magnetisoituminen, fysiikka (53.7)
alternative label: Oscillografi, fysik (53.7) @sv
alternative label: Oskillografia, fysiikka (53.7)
alternative label: Polarisaatio, sähköoppi (53.7)
alternative label: Polarisation, elektricitetslära (53.7) @sv
alternative label: Radioaallot, sähköoppi (53.7)
alternative label: Radiovågor, electricitetslära (53.7) @sv
alternative label: Resistans, elektricitetslära (53.7) @sv
alternative label: Spänning, elektricitetslära (53.7) @sv
alternative label: Statiikka, sähköoppi (53.7)
alternative label: Statik, elektricitetslära (53.7) @sv
alternative label: Strålning, elektromagnetisk (53.7) @sv
alternative label: Sähkö, fysiikka (53.7)
alternative label: Sähködynamiikka, fysiikka (53.7)
alternative label: Sähköeristeet, fysiikka (53.7)
alternative label: Sähkökenttä, fysiikka (53.7)
alternative label: Sähkökinetiikka, fysiikka (53.7)
alternative label: Sähkömagnetismi, fysiikka (53.7)
alternative label: Sähkönjohtimet, fysiikka (53.7)
alternative label: Sähköoppi, fysiikka (53.7)
alternative label: Sähköpurkaukset, fysiikka (53.7)
alternative label: Sähköstatiikka, fysiikka (53.7)
alternative label: Sähkövirta, fysiikka (53.7)
alternative label: Säteily, sähkömagneettinen (53.7)
alternative label: Taajuus, sähköoppi (53.7)
alternative label: Teho, sähköoppi (53.7)
alternative label: Vaihtovirta, sähköoppi (53.7)
alternative label: Vastus, sähköoppi (53.7)
alternative label: Vibrationer, elektromagnetiska (53.7) @sv
alternative label: Värähtelyt, sähkömagneettiset (53.7)
alternative label: Växelström, elektricitetslära (53.7) @sv
alternative label: Vågrörelse, elektricitetslära (53.7) @sv
broader: FYSIIKKA
in scheme: YKL - Yleisten kirjastojen luokitusjärjestelmä
notation: 53.7
preferred label: Electricity. Magnetism @en
preferred label: Elektricitetslära. Magnetism @sv
scope note: Elektrostatik. Elektrodynamik. Elektrokinetik Statisk elektricitet. Elektriska fält. Elektrisk ström Hur elektricitet leds. Motstånd. Spänning. Elektriska urladdningar Magnetiska fält. Magnetisering. Elektromagnetism Elektromagnetiska svängningar och vågor i allmänhet. Växelström @sv
scope note: Sähköstatiikka. Sähködynamiikka. Sähkökinematiikka Staattinen sähkö. Sähkökentät. Sähkövirta Sähkön johtuminen. Vastus. Jännite. Sähköpurkaukset Magneettiset kentät. Magnetisoituminen. Sähkömagnetismi Sähkömagneettiset värähtelyt ja aallot yleensä. Vaihtovirta

Fysiikka harrasteena ja ajanvietteenä
type: Concept
type: YKL-luokka
alternative label: Ajanviete, fysiikka (53.8)
alternative label: Askartelu, fysiikka (53.8)
alternative label: Fysiikka ajanvietteenä (53.8)
alternative label: Fysik som tidsfördriv (53.8) @sv
alternative label: Harrastukset, fysiikka (53.8)
alternative label: Hobbyarbete, fysik (53.8) @sv
alternative label: Hobbyer, fysik (53.8) @sv
alternative label: Tidsfördriv, fysik (53.8) @sv
broader: FYSIIKKA
in scheme: YKL - Yleisten kirjastojen luokitusjärjestelmä
notation: 53.8
preferred label: Fysik som hobby och tidsfördriv @sv
preferred label: Physics as a hobby and pastime @en

KEMIA
type: Concept
References: Okkultismi. Spiritismi. Spiritualismi. Henkimaailma
References: Aseistus. Asevarustelu. Asekauppa
References: Maailmankaikkeus. Tähdet. Tähtijärjestelmät
References: Geologia. Geomorfologia
References: Hydrologia
References: Biokemia. Biofysiikka. Molekyylibiologia
References: Lääkehoito. Lääkeaineoppi
References: Kemianteollisuus
References: Paperi- ja selluloosateollisuus
References: Maanviljely. Puutarhanhoito. Hyötykasvit
type: YKL-luokka
alternative label: Doft, kemi (54+) @sv
alternative label: Experimentell kemi (54+) @sv
alternative label: Kemi (54+) @sv
alternative label: Kemi, experimentell (54+) @sv
alternative label: Kemi, tillämpad, allm. (54) @sv
alternative label: Kemia (54+)
alternative label: Kemia, kokeellinen (54+)
alternative label: Kemia, sovellettu, yl. (54)
alternative label: Kokeellinen kemia (54+)
alternative label: Luonnontieteet (50 ... 58+)
alternative label: Luonnontutkimus (50 ... 58+)
alternative label: Naturforskning (50 ... 58+) @sv
alternative label: Naturvetenskaper (50 ... 58+) @sv
alternative label: Recept, kemi (54+) @sv
alternative label: Reseptit, kemia (54+)
alternative label: Tuoksu, kemia (54+)
broader: LUONNONTIETEET. MATEMATIIKKA. LÄÄKETIEDE
in scheme: YKL - Yleisten kirjastojen luokitusjärjestelmä
narrower: Teoreettinen ja fysikaalinen kemia
narrower: Epäorgaaninen kemia
narrower: Orgaaninen kemia. Muovien kemia
narrower: Analyyttinen kemia
narrower: Kemia harrasteena ja ajanvietteenä
notation: 54
preferred label: CHEMISTRY @en
preferred label: KEMI @sv
scope note: Hit allmänna verk i kemi Tillämpad kemi klassificeras enligt område Allmänna läroböcker i kemi 54.07 @sv
scope note: Tähän kemian yleisteokset. Sovellettu kemia luokitetaan alan mukaan. Eri ammattialojen kemian oppikirjat tähän. Yleiset kemian oppikirjat 54.07

Teoreettinen ja fysikaalinen kemia
type: Concept
References: Ydinfysiikka. Atomifysiikka. Molekyylifysiikka
alternative label: Aggregationstillstånd, kemi (54.1) @sv
alternative label: Aine, olomuodot (54.1)
alternative label: Atomipainot (54.1)
alternative label: Atomiteoria, kemia (54.1)
alternative label: Atomteori, kemi (54.1) @sv
alternative label: Atomvikter (54.1) @sv
alternative label: Bindningar, kemi (54.1) @sv
alternative label: Elektrokemi, fysik (54.1) @sv
alternative label: Elektrolys, kemi (54.1) @sv
alternative label: Elektrolyysi, kemia (54.1)
alternative label: Elektroner, fysikalisk kemi (54.1) @sv
alternative label: Elektronit, fysikaalinen kemia (54.1)
alternative label: Fast tillstånd (54.1) @sv
alternative label: Flytande tillstånd (54.1) @sv
alternative label: Fotokemi (54.1) @sv
alternative label: Fotokemia (54.1)
alternative label: Fysikaalinen kemia (54.1)
alternative label: Fysikalisk kemi (54.1) @sv
alternative label: Gaser, kemi (54.1) @sv
alternative label: Gasformigt tillstånd (54.1) @sv
alternative label: Ionit, kemia (54.1)
alternative label: Isotoopit, fysikaalinen kemia (54.1)
alternative label: Isotoper, fysikalisk kemi (54.1) @sv
alternative label: Joner, kemi (54.1) @sv
alternative label: Kaasumainen olomuoto (54.1)
alternative label: Kaasut, kemia (54.1)
alternative label: Katalys, kemi (54.1) @sv
alternative label: Katalysaattorit (54.1)
alternative label: Katalysatorer (54.1) @sv
alternative label: Katalysatorer, kemi (54.1) @sv
alternative label: Katalyysi, kemia (54.1)
alternative label: Katalyytit, kemia (54.1)
alternative label: Kemi, fysikalisk (54.1) @sv
alternative label: Kemi, teoretisk (54.1) @sv
alternative label: Kemia, fysikaalinen (54.1)
alternative label: Kemia, teoreettinen (54.1)
alternative label: Kemiallinen mekaniikka (54.1)
alternative label: Kemisk mekanik (54.1) @sv
alternative label: Kemiska föreningar, kemi (54.1) @sv
alternative label: Kiinteä olomuoto (54.1)
alternative label: Kolloidikemia (54.1)
alternative label: Kolloidkemi (54.1) @sv
alternative label: Liuokset, kemia (54.1)
alternative label: Lämpökemia (54.1)
alternative label: Lösningar, kemi (54.1) @sv
alternative label: Materien, aggregationstillstånd (54.1) @sv
alternative label: Molekyler, fysikalisk kemi (54.1) @sv
alternative label: Molekylvikter (54.1) @sv
alternative label: Molekyylipainot (54.1)
alternative label: Molekyylit, fysikaalinen kemia (54.1)
alternative label: Nesteet, kemia (54.1)
alternative label: Nestemäinen olomuoto (54.1)
alternative label: Olomuodot, kemia (54.1)
alternative label: Pintakemia (54.1)
alternative label: Radioaktiivisuus, kemia (54.1)
alternative label: Radioaktivitet, kemi (54.1) @sv
alternative label: Radiokemi (54.1) @sv
alternative label: Radiokemia (54.1)
alternative label: Reaktioner, kemi (54.1) @sv
alternative label: Reaktiot, kemia (54.1)
alternative label: Sidokset, kemia (54.1)
alternative label: Strålning, kemi (54.1) @sv
alternative label: Stökiometriset lait (54.1)
alternative label: Stökiometriska lagar (54.1) @sv
alternative label: Sähkökemia, fysiikka (54.1)
alternative label: Säteily, kemia (54.1)
alternative label: Teoreettinen kemia (54.1)
alternative label: Teoretisk kemi (54.1) @sv
alternative label: Termokemia (54.1)
alternative label: Valenssit, kemia (54.1)
alternative label: Valokemia (54.1)
alternative label: Yhdisteeet, kemia (54.1)
alternative label: Yhdisteet, kemia (54.1)
broader: KEMIA
in scheme: YKL - Yleisten kirjastojen luokitusjärjestelmä
notation: 54.1
scope note: Aggregationstillstånd. Fast tillstånd, flytande tillstånd, gas- och kolloidaltillstånd Stökiometriska lagar. Atom- och molekylvikt. Valenser Kemiska reaktioner, föreningar, bindningar, lösningar och katalysatorer i allmänhet. Elektrolys. Joner Termokemi. Elektrokemi. Fotokemi. Radiokemi Kolloidkemi. Ytkemi Formtillägget 01 används inte i samband med klassen 54.1 @sv
scope note: Aineen olomuodot. Kiinteä, kaasumainen, nestemäinen ja kolloidinen olomuoto Stökiometriset lait. Atomi- ja molekyylipaino. Valenssit Kemialliset reaktiot, yhdisteet, sidokset, liuokset ja katalysaattorit yleensä. Elektrolyysi. Ionit Termokemia. Sähkökemia. Fotokemia. Radiokemia Kolloidikemia. Pintakemia Muotoluokkaa 01 ei käytetä luokan 54.1 yhteydessä

Epäorgaaninen kemia
type: Concept
References: Mineralogia. Petrologia. Kristallografia
References: Metallurgia
type: YKL-luokka
alternative label: Alkuaineet, kemia (54.2)
alternative label: Alkuaineiden järjestelmä (54.2)
alternative label: Epämetallit, kemia (54.2)
alternative label: Epäorgaaninen kemia (54.2)
alternative label: Grundämnen, kemi (54.2) @sv
alternative label: Grundämnenas system (54.2) @sv
alternative label: Icke-metaller, kemi (54.2) @sv
alternative label: Jordmetaller, kemi (54.2) @sv
alternative label: Kemi, oorganisk (54.2) @sv
alternative label: Kemia, epäorgaaninen (54.2)
alternative label: Kemiska föreningar, oorganisk kemi (54.2) @sv
alternative label: Maametallit, kemia (54.2)
alternative label: Metaller, kemi (54.2) @sv
alternative label: Metallit, kemia (54.2)
alternative label: Metalloider, kemi (54.2) @sv
alternative label: Metalloidit, kemia (54.2)
alternative label: Oorganisk kemi (54.2) @sv
alternative label: Reaktioner, oorganisk kemi (54.2) @sv
alternative label: Reaktiot, epäorgaaninen kemia (54.2)
alternative label: Yhdisteet, epäorgaaninen kemia (54.2)
broader: KEMIA
in scheme: YKL - Yleisten kirjastojen luokitusjärjestelmä
notation: 54.2
preferred label: Inorganic chemistry @en
preferred label: Oorganisk kemi @sv
scope note: Alkuaineiden järjestelmä Metallit. Metalloidit. Epämetallit Tähän eri alkuaineiden kemialliset ominaisuudet sekä niiden epäorgaaniset reaktiot ja yhdisteet
scope note: Grundämnenas periodiska system Metaller. Metalloider. Icke-metaller Hit kemiska egenskaper hos olika grundämnen samt deras oorganiska reaktioner och föreningar @sv

Orgaaninen kemia. Muovien kemia
type: Concept
References: Biokemia. Biofysiikka. Molekyylibiologia
References: Kemianteollisuus
References: Muovi- ja kumiteollisuus
type: YKL-luokka
alternative label: Acykliska föreningar, organisk kemi (54.3) @sv
alternative label: Alkaloider, organisk kemi (54.3) @sv
alternative label: Alkaloidit, orgaaninen kemia (54.3)
alternative label: Alkoholer, organisk kemi (54.3) @sv
alternative label: Alkoholit, orgaaninen kemia (54.3)
alternative label: Asykliset yhdisteet, orgaaninen kemia (54.3)
alternative label: Balsamer, organisk kemi (54.3) @sv
alternative label: Cykliska föreningar, organisk kemi (54.3) @sv
alternative label: Fetter, organisk kemi (54.3) @sv
alternative label: Färgämnen, organisk kemi (54.3) @sv
alternative label: Gummin, organisk kemi (54.3) @sv
alternative label: Hiilihydraatit, orgaaninen kemia (54.3)
alternative label: Hiilivedyt, orgaaninen kemia (54.3)
alternative label: Kemi, organisk (54.3) @sv
alternative label: Kemia, orgaaninen (54.3)
alternative label: Kemiska föreningar, organisk kemi (54.3) @sv
alternative label: Kolhydrater, organisk kemi (54.3) @sv
alternative label: Kolväten, organisk kemi (54.3) @sv
alternative label: Kumit, orgaaninen kemia (54.3)
alternative label: Luonnonaineet, orgaaninen kemia (54.3)
alternative label: Muovit, orgaaninen kemia (54.3)
alternative label: Naturämnen, organisk kemi (54.3) @sv
alternative label: Olja, organisk kemi (54.3) @sv
alternative label: Oljor, organisk kemi (54.3) @sv
alternative label: Orgaaninen kemia (54.3)
alternative label: Organisk kemi (54.3) @sv
alternative label: Palsamit, orgaaninen kemia (54.3)
alternative label: Plaster, organisk kemi (54.3) @sv
alternative label: Polymeerit, orgaaninen kemia (54.3)
alternative label: Polymerer, organisk kemi (54.3) @sv
alternative label: Proteiinit, orgaaninen kemia (54.3)
alternative label: Proteiner, organisk kemi (54.3) @sv
alternative label: Rasvat, orgaaninen kemia (54.3)
alternative label: Reaktioner, organisk kemi (54.3) @sv
alternative label: Reaktiot, orgaaninen kemia (54.3)
alternative label: Steroider, organisk kemi (54.3) @sv
alternative label: Steroidit, orgaaninen kemia (54.3)
alternative label: Sykliset yhdisteet, orgaaninen kemia (54.3)
alternative label: Vahat, orgaaninen kemia (54.3)
alternative label: Valkuaisaineet, orgaaninen kemia (54.3)
alternative label: Vaxer, organisk kemi (54.3) @sv
alternative label: Väriaineet, orgaaninen kemia (54.3)
alternative label: Yhdisteet, orgaaninen kemia (54.3)
alternative label: Äggviteämnen, organisk kemi (54.3) @sv
alternative label: Öljy, orgaaninen kemia (54.3)
alternative label: Öljyt, orgaaninen kemia (54.3)
broader: KEMIA
in scheme: YKL - Yleisten kirjastojen luokitusjärjestelmä
notation: 54.3
preferred label: Organic chemistry. Chemistry of plastics @en
preferred label: Organisk kemi. Plasternas kemi @sv
scope note: Orgaaniset reaktiot ja yhdisteet Hiilivedyt. Polymeerit. Asykliset ja sykliset yhdisteet Luonnonaineet orgaanisen kemian kannalta
scope note: Organiska reaktioner och föreningar Kolväten. Polymerer. Acykliska och cykliska föreningar Naturliga ämnen ur den organiska kemins synvinkel @sv

Analyyttinen kemia
type: Concept
type: YKL-luokka
alternative label: Analyser, kemi (54.4) @sv
alternative label: Analytisk kemi (54.4) @sv
alternative label: Analyysit, kemia (54.4)
alternative label: Analyyttinen kemia (54.4)
alternative label: Elektroforeesi (54.4)
alternative label: Elektrofores (54.4) @sv
alternative label: Elektrokemiska analyser (54.4) @sv
alternative label: Epäorgaaniset analyysit (54.4)
alternative label: Fysikokemialliset analyysit (54.4)
alternative label: Fysisk-kemiska analyser (54.4) @sv
alternative label: Kemi, analytisk (54.4) @sv
alternative label: Kemia, analyyttinen (54.4)
alternative label: Kemialliset analyysit (54.4)
alternative label: Kemiska analyser (54.4) @sv
alternative label: Kromatografi (54.4) @sv
alternative label: Kromatografia (54.4)
alternative label: Kvalitatiiviset analyysit, kemia (54.4)
alternative label: Kvalitativa analyser, kemi (54.4) @sv
alternative label: Kvantitatiiviset analyysit, kemia (54.4)
alternative label: Kvantitativa analyser, kemi (54.4) @sv
alternative label: Oorganiska analyser (54.4) @sv
alternative label: Optiset analyysit, kemia (54.4)
alternative label: Optiska analyser, kemi (54.4) @sv
alternative label: Orgaaniset analyysit (54.4)
alternative label: Organiska analyser (54.4) @sv
alternative label: Spektralanalyser, kemi (54.4) @sv
alternative label: Spektroanalyysit, kemia (54.4)
alternative label: Sähkökemialliset analyysit (54.4)
broader: KEMIA
in scheme: YKL - Yleisten kirjastojen luokitusjärjestelmä
notation: 54.4
preferred label: Analytical chemistry @en
preferred label: Analytisk kemi @sv
scope note: Kemialliset analyysit Orgaaniset ja epäorgaaniset analyysit Kvalitatiiviset ja kvantitatiiviset analyysit Tähän myös fysikokemialliset, optiset ja sähkökemialliset analyysimenetelmät Elektroforeesi. Spektroanalyysi. Kromatografia
scope note: Kemiska analyser Organiska och oorganiska analyser Kvalitativa och kvantitativa analyser Hit också fysisk-kemiska, optiska och elektrokemiska analysmetoder Elektrofores. Spektralanalys. Kromatografi @sv

Kemia harrasteena ja ajanvietteenä
type: Concept
type: YKL-luokka
alternative label: Ajanviete, kemia (54.8)
alternative label: Askartelu, kemia (54.8)
alternative label: Harrastukset, kemia (54.8)
alternative label: Hobbyarbete, kemi (54.8) @sv
alternative label: Hobbyer, kemi (54.8) @sv
alternative label: Kemi som tidsfördriv (54.8) @sv
alternative label: Kemia ajanvietteenä (54.8)
alternative label: Tidsfördriv, kemi (54.8) @sv
broader: KEMIA
in scheme: YKL - Yleisten kirjastojen luokitusjärjestelmä
notation: 54.8
preferred label: Chemistry as a hobby and pastime @en
preferred label: Kemi som hobby och tidsfördriv @sv

FYYSINEN MAANTIEDE. GEOLOGIA
type: Concept
References: MAANTIEDE
References: EUROOPPA
References: SUOMI
References: POHJOISMAAT
References: KESKI-EUROOPPA
References: BRITTEINSAARET
References: ETELÄ-EUROOPPA
References: ITÄ-EUROOPPA
References: MUUT MAANOSAT
References: Ekologia. Eliömaantiede
References: Kasviekologia. Kasvimaantiede
References: Eläinten elintavat
type: YKL-luokka
alternative label: Fysisk geografi (55+) @sv
alternative label: Fyysinen maantiede (55+)
alternative label: Geografi, fysisk (55+) @sv
alternative label: Geografi, naturgeografi, allm. (55) @sv
alternative label: Geotieteet (55+)
alternative label: Geovetenskaper (55+) @sv
alternative label: Jorden, fysisk geografi, allm. (55) @sv
alternative label: Jorden, naturgeografi, allm. (55) @sv
alternative label: Jordklotet, fysisk geografi, allm. (55) @sv
alternative label: Jordklotet, naturgeografi, yl. (55) @sv
alternative label: Katastrofer, naturkatastrofer, allm. (55) @sv
alternative label: Katastrofit, luonnonkatastrofit, yl. (55)
alternative label: Luonnonkatastrofit, yl. (55)
alternative label: Luonnonmaantiede, yl. (55)
alternative label: Luonnononnettomuudet, yl. (55)
alternative label: Luonnontieteet (50 ... 58+)
alternative label: Luonnontutkimus (50 ... 58+)
alternative label: Maa, fyysinen maantiede, yl. (55)
alternative label: Maa, luonnonmaantiede, yl. (55)
alternative label: Maantiede, fyysinen (55+)
alternative label: Maantiede, luonnonmaantiede, yl. (55)
alternative label: Maapallo, fyysinen maantiede, yl. (55)
alternative label: Maapallo, luonnonmaantiede, yl. (55)
alternative label: Naturforskning, allm. (50 ... 58+) @sv
alternative label: Naturgeografi, allm. (55) @sv
alternative label: Naturkatastrofer (55) @sv
alternative label: Naturolyckor, allm. (55) @sv
alternative label: Naturvetenskaper (50 ... 58+) @sv
alternative label: Olyckor, naturolyckor, allm. (55) @sv
alternative label: Onnettomuudet, luonnononnettomuudet, yl. (55)
broader: LUONNONTIETEET. MATEMATIIKKA. LÄÄKETIEDE
in scheme: YKL - Yleisten kirjastojen luokitusjärjestelmä
narrower: Geologia. Geomorfologia
narrower: Mineralogia. Petrologia. Kristallografia
narrower: Paleontologia
narrower: Meteorologia. Klimatologia
narrower: Hydrologia
notation: 55
preferred label: FYSISK GEOGRAFI. GEOLOGI @sv
preferred label: PHYSICAL GEOGRAPHY. GEOLOGY @en
scope note: Hit allmänna verk om fysisk geografi och naturgeografi @sv
scope note: Tähän fyysisen ja luonnonmaantieteen yleisteokset

Geologia. Geomorfologia
type: Concept
References: Okkultismi. Spiritismi. Spiritualismi. Henkimaailma
References: Maaperänsuojelu
References: Aurinkokunta
References: Mineralogia. Petrologia. Kristallografia
References: Paleontologia
References: Ekologia. Eliömaantiede
References: Kaivannaisteollisuus
alternative label: Ajanmääritys, geologia (55.2)
alternative label: Atollit, geologia (55.2)
alternative label: Drumliinit, geologia (55.2)
alternative label: Eloperäiset maalajit, geologia (55.2)
alternative label: Elottomat maalajit, geologia (55.2)
alternative label: Eroosio, geologia (55.2)
alternative label: Geodynamiikka (55.2)
alternative label: Geofysiikka (55.2)
alternative label: Geokemia (55.2)
alternative label: Geologia (55.2)
alternative label: Geologia, alueellinen (55.2)
alternative label: Geologia, historiallinen (55.2)
alternative label: Geologiset aikakaudet (55.2)
alternative label: Geologiset kerrostumat (55.2)
alternative label: Geologiset muodostumat (55.2)
alternative label: Geomorfogenia (55.2)
alternative label: Geomorfologia (55.2)
alternative label: Geotektoniikka (55.2)
alternative label: Geysirit, geologia (55.2)
alternative label: Glasiologia (55.2)
alternative label: Harjut, geologia (55.2)
alternative label: Historiallinen geologia (55.2)
alternative label: Hyökyaallot (55.2)
alternative label: Jää, geologia (55.2)
alternative label: Jääkauden jäljet, geologia (55.2)
alternative label: Jääkaudet (55.2)
alternative label: Jääkaudet, geologia (55.2)
alternative label: Jäätikkötiede (55.2)
alternative label: Katastrofit, hyökyaallot (55.2)
alternative label: Katastrofit, maanjäristykset (55.2)
alternative label: Katastrofit, maanvyörymät (55.2)
alternative label: Katastrofit, tulivuorenpurkaukset (55.2)
alternative label: Kerrostumat, geologia (55.2)
alternative label: Koralliriutat, geologia (55.2)
alternative label: Kronologia, geologia (55.2)
alternative label: Kuumat lähteet, geologia (55.2)
alternative label: Kvartäärigeologia (55.2)
alternative label: Litosfääri, geologia (55.2)
alternative label: Luolat, geologia (55.2)
alternative label: Luonnonkatastrofit, hyökyaallot (55.2)
alternative label: Luonnonkatastrofit, maanjäristykset (55.2)
alternative label: Luonnonkatastrofit, maanvyörymät (55.2)
alternative label: Luonnonkatastrofit, tulivuorenpurkaukset (55.2)
alternative label: Maa, geologia (55.2)
alternative label: Maalajit, geologia (55.2)
alternative label: Maamagnetismi (55.2)
alternative label: Maan kuori ja sisus, geologia (55.2)
alternative label: Maanjäristykset (55.2)
alternative label: Maannokset, maaperätiede (55.2)
alternative label: Maanvyörymät (55.2)
alternative label: Maapallo, geologia (55.2)
alternative label: Maaperä (55.2)
alternative label: Maaperä, geologia (55.2)
alternative label: Maaperätiede (55.2)
alternative label: Mannerliikunnot (55.2)
alternative label: Moreeni, geologia (55.2)
alternative label: Onnettomuudet, hyökyaallot (55.2)
alternative label: Onnettomuudet, maanjäristykset (55.2)
alternative label: Onnettomuudet, maanvyörymät (55.2)
alternative label: Onnettomuudet, tulivuorenpurkaukset (55.2)
alternative label: Pinnanmuodostus, geologia (55.2)
alternative label: Poimuvuoret, geologia (55.2)
alternative label: Projektio-oppi, kartografia (55.2)
alternative label: Rapautuminen, geologia (55.2)
alternative label: Routa, geologia (55.2)
alternative label: Sedimentaatio, geologia (55.2)
alternative label: Seismologia (55.2)
broader: FYYSINEN MAANTIEDE. GEOLOGIA
in scheme: YKL - Yleisten kirjastojen luokitusjärjestelmä
notation: 55.2
scope note: Allmän, historisk och regional geologi. Jordklotets form, struktur och ytstruktur. Litosfären. Geodynamik. Kontinentalförskjutningen. Bergskedjeveckning. Vulkaner. Jordbävningar. Seismologi. Erosion. Förvittring. Sedimentation. Avlagring. Geologiska perioder. Istider. Glaciologi. Jordmån och våtmarker ur geologisk synvinkel. Geofysik. Geokemi. Jordmagnetism. Geologiska kartor 55.202 @sv
scope note: Yleinen, historiallinen ja alueellinen geologia. Maapallon muoto, rakenne ja pinnanmuodostus. Litosfääri. Geodynamiikka. Mannerliikunnot. Vuorijononmuodostus. Tulivuoret. Maanjäristykset. Seismologia. Eroosio. Rapautuminen. Sedimentaatio. Kerrostuminen. Geologiset aikakaudet. Jääkaudet. Jäätikkötiede. Maaperä ja suot geologian kannalta. Geofysiikka. Geokemia. Maamagnetismi. Geologiset kartat 55.202

Mineralogia. Petrologia. Kristallografia
type: Concept
References: Geologia. Geomorfologia
References: Kaivannaisteollisuus
References: Taidetaonta. Korutaide
type: YKL-luokka
alternative label: Berggrundsundersökning (55.3) @sv
alternative label: Gemmologi (55.3+) @sv
alternative label: Gemmologia (55.3+)
alternative label: Jalokivet (55.3)
alternative label: Jalokivet, mineralogia (55.3)
alternative label: Jalometallit (55.3)
alternative label: Jalometallit, mineralogia (55.3)
alternative label: Kallioperäntutkimus (55.3)
alternative label: Kidetiede, mineralogia (55.3)
alternative label: Kiteet, mineralogia (55.3)
alternative label: Kivet, kivitiede (55.3)
alternative label: Kivilajit (55.3)
alternative label: Kivilajit, petrologia (55.3)
alternative label: Kivitiede (55.3)
alternative label: Kristaller, mineralogi (55.3) @sv
alternative label: Kristallografi, mineralogi (55.3) @sv
alternative label: Kristallografia, mineralogia (55.3)
alternative label: Magmakivilajit (55.3)
alternative label: Magmastenarter (55.3) @sv
alternative label: Metamorfa stenarter (55.3) @sv
alternative label: Metamorfiset kivilajit (55.3)
alternative label: Meteoriitit, mineralogia (55.3)
alternative label: Meteoriter, mineralogi (55.3) @sv
alternative label: Mineraalikemia (55.3)
alternative label: Mineraalit (55.3)
alternative label: Mineral (55.3) @sv
alternative label: Mineralkemi (55.3) @sv
alternative label: Mineralogi (55.3) @sv
alternative label: Mineralogia (55.3)
alternative label: Petrografi (55.3) @sv
alternative label: Petrografia (55.3)
alternative label: Petrologi (55.3) @sv
alternative label: Petrologia (55.3)
alternative label: Sedimentstenarter, mineralogi (55.3) @sv
alternative label: Sedimenttikivilajit, mineralogia (55.3)
alternative label: Stenar, petrologi (55.3) @sv
alternative label: Stenarter (55.3) @sv
alternative label: Stenarter, petrologi (55.3) @sv
alternative label: Ädelmetaller (55.3) @sv
alternative label: Ädelmetaller, mineralogi (55.3) @sv
alternative label: Ädelstenar (55.3) @sv
alternative label: Ädelstenar, mineralogi (55.3) @sv
broader: FYYSINEN MAANTIEDE. GEOLOGIA
in scheme: YKL - Yleisten kirjastojen luokitusjärjestelmä
notation: 55.3
preferred label: Mineralogi. Petrologi. Kristallografi @sv
preferred label: Mineralogy. Petrology. Crystallography @en
scope note: Mineraalien, kivilajien sekä jalokivien tutkimus. Magmakivilajit. Metamorfiset kivilajit. Sedimenttikivilajit. Meteoriitit
scope note: Undersökning av mineral, stenarter samt ädelstenar. Magmastenarter. Metamorfa stenarter. Sedimentstenar. Meteoriter @sv

Paleontologia
type: Concept
References: Geologia. Geomorfologia
References: Kehitysoppi. Evoluutio
References: Biologinen antropologia
type: YKL-luokka
alternative label: Ajanmääritys, paleontologia (55.4)
alternative label: Avlagringar, paleontologi (55.4) @sv
alternative label: Bärnsten, paleontologi (55.4) @sv
alternative label: Dinosaurier (55.4) @sv
alternative label: Dinosaurukset (55.4)
alternative label: Djurhistoria (55.4) @sv
alternative label: Eläinhistoria (55.4)
alternative label: Forntidsdjur (55.4) @sv
alternative label: Forntidsväxter (55.4) @sv
alternative label: Fossiilit (55.4)
alternative label: Fossil (55.4) @sv
alternative label: Hirmuliskot (55.4)
alternative label: Istider, paleontologi (55.4) @sv
alternative label: Jääkaudet, paleontologia (55.4)
alternative label: Kasvifossiilit (55.4)
alternative label: Kasvihistoria (55.4)
alternative label: Kerrostumat, paleontologia (55.4)
alternative label: Kivettymät (55.4)
alternative label: Kronologi, paleontologi (55.4) @sv
alternative label: Kronologia, paleontologia (55.4)
alternative label: Liskot, dinosaurukset (55.4)
alternative label: Meripihka, paleontologia (55.4)
alternative label: Muinaiseläimet (55.4)
alternative label: Muinaiskasvit (55.4)
alternative label: Paleobiologi (55.4) @sv
alternative label: Paleobiologia (55.4)
alternative label: Paleobotaniikka (55.4)
alternative label: Paleobotanik (55.4) @sv
alternative label: Paleoekologi (55.4) @sv
alternative label: Paleoekologia (55.4)
alternative label: Paleontologi (55.4) @sv
alternative label: Paleontologia (55.4)
alternative label: Paleontologiset aikakaudet (55.4)
alternative label: Paleontologiska perioder (55.4) @sv
alternative label: Paleozoologi (55.4) @sv
alternative label: Paleozoologia (55.4)
alternative label: Petrifikat (55.4) @sv
alternative label: Skräcködlor (55.4) @sv
alternative label: Stratigrafi, paleontologi (55.4) @sv
alternative label: Stratigrafia, paleontologia (55.4)
alternative label: Tidsbestämning, paleontologi (55.4) @sv
alternative label: Växtfossiler (55.4) @sv
alternative label: Växthistoria (55.4) @sv
alternative label: Ödlor, dinosaurier (55.4) @sv
broader: FYYSINEN MAANTIEDE. GEOLOGIA
in scheme: YKL - Yleisten kirjastojen luokitusjärjestelmä
notation: 55.4
preferred label: Palaeontology @en
preferred label: Paleontologi @sv
scope note: Fossiilit. Paleontologiset aikakaudet Paleobiologia. Paleoekologia Paleobotaniikka. Muinaiskasvit Paleozoologia. Muinaiseläimet. Dinosaurukset
scope note: Fossiler. Paleontologiska perioder Paleobiologi. Paleoekologi Paleobotanik. Urtidsväxter Paleozoologi. Urtidsdjur. Dinosaurier @sv

Meteorologia. Klimatologia
type: Concept
References: Ilmansuojelu
References: Aurinkokunta
References: BIOLOGIA
alternative label: Aerologi (55.5) @sv
alternative label: Aerologia (55.5)
alternative label: Atmosfären (55.5) @sv
alternative label: Atmosfääri (55.5)
alternative label: Barometrar, meteorologi (55.5) @sv
alternative label: Barometrit, ilmatiede (55.5)
alternative label: Blixtar (55.5) @sv
alternative label: Cykloner (55.5) @sv
alternative label: Dimma (55.5) @sv
alternative label: Faromoment, stormar (55.5) @sv
alternative label: Hirmumyrskyt (55.5)
alternative label: Hurrikaanit (55.5)
alternative label: Hurrikaner (55.5) @sv
alternative label: Ilmakehä (55.5)
alternative label: Ilman lämpötila, ilmatiede (55.5)
alternative label: Ilmankosteus (55.5)
alternative label: Ilmanpaine (55.5)
alternative label: Ilmapuntarit, ilmatiede (55.5)
alternative label: Ilmastonmuutokset, ilmastotiede (55.5)
alternative label: Ilmastot, ilmastotiede (55.5)
alternative label: Ilmastotiede (55.5)
alternative label: Ilmatiede (55.5)
alternative label: Is, meteorologi (55.5) @sv
alternative label: Istider, klimatologi (55.5) @sv
alternative label: Jää, meteorologia (55.5)
alternative label: Jääkaudet, ilmastotiede (55.5)
alternative label: Katastrofer, stormar (55.5) @sv
alternative label: Katastrofit, myrskyt (55.5)
alternative label: Klimat, klimatologi (55.5) @sv
alternative label: Klimatförändringar, klimatologi (55.5) @sv
alternative label: Klimatlära (55.5) @sv
alternative label: Klimatologi (55.5) @sv
alternative label: Klimatologia (55.5)
alternative label: Laviinit (55.5)
alternative label: Lumi (55.5)
alternative label: Lumivyöryt (55.5)
alternative label: Luonnonkatastrofit, myrskyt (55.5)
alternative label: Lämpömittarit, ilmatiede (55.5)
alternative label: Lämpötila, ilmatiede (55.5)
alternative label: Meteorologia (55.5)
alternative label: Monsuunit (55.5)
alternative label: Myrskyt (55.5)
alternative label: Näkyvyys, meteorologia (55.5)
alternative label: Onnettomuudet, myrskyt (55.5)
alternative label: Pasaatituulet (55.5)
alternative label: Pilvet (55.5)
alternative label: Pyörremyrskyt (55.5)
alternative label: Revontulet (55.5)
alternative label: Sade, meteorologia (55.5)
alternative label: Salamat (55.5)
alternative label: Sateenkaaret (55.5)
alternative label: Sateet, meteorologia (55.5)
alternative label: Satelliitit, meteorologia (55.5)
alternative label: Sumu (55.5)
alternative label: Syklonit (55.5)
alternative label: Sää (55.5)
alternative label: Sääennustukset (55.5)
alternative label: Sääilmiöt (55.5)
alternative label: Sääoppi (55.5)
alternative label: Sääpalvelu (55.5)
alternative label: Sääsatelliitit, meteorologia (55.5)
alternative label: Taifuunit (55.5)
alternative label: Tekokuut, meteorologia (55.5)
alternative label: Tornadot (55.5)
alternative label: Trombit (55.5)
alternative label: Tuulet (55.5)
alternative label: Tuulivyöhykkeet (55.5)
alternative label: Ukkonen (55.5)
alternative label: Vaaratilanteet, myrskyt (55.5)
alternative label: Vesi, meteorologia (55.5)
alternative label: Vuodenajat, klimatologia (55.5)
broader: FYYSINEN MAANTIEDE. GEOLOGIA
in scheme: YKL - Yleisten kirjastojen luokitusjärjestelmä
notation: 55.5
scope note: Atmosfären. Meteorologi. Klimatologi Vädret. Väderobservationer. Väderprognoser Meteorologiska mätinstrument. Vädersatelliter Lufttryck. Vindar. Moln. Regn. Dimma Luftfuktighet. Lufttemperatur. Sikt Cykloner. Virvelstormar. Åska. Blixtar Optiska fenomen i atmosfären. Norrsken Klimat. Klimattyper Regional och historisk klimatologi Väderkartor 55.502 @sv
scope note: Ilmakehä. Ilmatiede. Ilmastotiede Säätila. Säähavainnot. Sääennustukset Säätilan mittauslaitteet. Sääsatelliitit Ilmanpaine. Tuulet. Pilvet. Sateet. Sumu Ilman kosteus. Ilman lämpötila. Näkyvyys Syklonit. Pyörremyrskyt. Ukkonen. Salamat Ilmakehän optiset ilmiöt. Revontulet Ilmastot. Ilmastotyypit Alueellinen ja historiallinen ilmastotiede Sääkartat 55.502

Hydrologia
type: Concept
References: Vesiensuojelu
References: BIOLOGIA
References: Ekologia. Eliömaantiede
References: KASVITIEDE. SIENITIEDE
References: ELÄINTIEDE
References: Vesirakennus
References: Vesi- ja jätevesihuolto
References: Kalastus
alternative label: Avdunstning, hydrologi (55.6) @sv
alternative label: Avrinning, hydrologi (55.6) @sv
alternative label: Avrinningsområden, hydrologi (55.6) @sv
alternative label: Bräckt vatten, hydrologi (55.6) @sv
alternative label: Bäckar, hydrologi (55.6) @sv
alternative label: Faromoment, översvämningar (55.6) @sv
alternative label: Floder, hydrologi (55.6) @sv
alternative label: Flöde, hydrologi (55.6) @sv
alternative label: Geohydrologi (55.6) @sv
alternative label: Geohydrologia (55.6)
alternative label: Golf-strömmen (55.6) @sv
alternative label: Golf-virta (55.6)
alternative label: Grundvatten, hydrologi (55.6) @sv
alternative label: Haihdunta, hydrologia (55.6)
alternative label: Hav, oceanologi (55.6) @sv
alternative label: Hydrografia (55.6)
alternative label: Hydrologia (55.6)
alternative label: Hydrologinen kierto (55.6)
alternative label: Hydrosfääri (55.6)
alternative label: Joet, hydrologia (55.6)
alternative label: Järvet, hydrologia (55.6)
alternative label: Jää, hydrologia (55.6)
alternative label: Jääpeite, hydrologia (55.6)
alternative label: Katastrofit, tulvat (55.6)
alternative label: Laguunit, hydrologia (55.6)
alternative label: Limnologia (55.6)
alternative label: Luonnonkatastrofit, tulvat (55.6)
alternative label: Lämpötila, hydrologia (55.6)
alternative label: Merentutkimus (55.6)
alternative label: Meret, oseanologia (55.6)
alternative label: Merivesi, hydrologia (55.6)
alternative label: Merivirrat (55.6)
alternative label: Murtovesi, hydrologia (55.6)
alternative label: Onnettomuudet, tulvat (55.6)
alternative label: Oseanografia (55.6)
alternative label: Oseanologia (55.6)
alternative label: Pintavedet, hydrologia (55.6)
alternative label: Pohjavesi, hydrologia (55.6)
alternative label: Potamologia (55.6)
alternative label: Purot, hydrologia (55.6)
alternative label: Sade, hydrologia (55.6)
alternative label: Sadevesi, hydrologia (55.6)
alternative label: Sateet, hydrologia (55.6)
alternative label: Sisävedet, hydrologia (55.6)
alternative label: Suotautuminen, hydrologia (55.6)
alternative label: Talassologia (55.6)
alternative label: Tulvat (55.6)
alternative label: Vaaratilanteet, tulvat (55.6)
alternative label: Valtameret, oseanografia (55.6)
alternative label: Valuma, hydrologia (55.6)
alternative label: Valuma-alueet, hydrologia (55.6)
alternative label: Veden lämpötila, hydrologia (55.6)
alternative label: Vedet, hydrologia (55.6)
alternative label: Vesi, hydrologia (55.6)
alternative label: Vesianalyysit, vesikemia (55.6)
alternative label: Vesientutkimus (55.6)
alternative label: Vesikehä (55.6)
alternative label: Vesikemia (55.6)
alternative label: Vesistöt, hydrologia (55.6)
alternative label: Vesistötiede (55.6)
alternative label: Vesistötutkimus (55.6)
alternative label: Vesitase, hydrologia (55.6)
alternative label: Vesivarat, hydrologia (55.6)
alternative label: Virtaama, hydrologia (55.6)
alternative label: Virtaavat vedet, hydrologia (55.6)
alternative label: Vuorovesi (55.6)
broader: FYYSINEN MAANTIEDE. GEOLOGIA
in scheme: YKL - Yleisten kirjastojen luokitusjärjestelmä
notation: 55.6
scope note: Hydrosfären. Vattenforskning. Hydrografi Vattnets kretslopp och jordklotets vattenbalans Avdunstning. Avrinning. Vattenföring. Filtrering Regnvatten ur hydrologisk synvinkel Vattentillgångar. Grundvatten. Geohydrologi Forskning av insjöar, strömmande vatten och hav Limnologi. Potamologi. Oceanologi. Oceanografi Havsströmmar. Tidvatten. Vattnets temperatur. Istäcke Vattenkemi @sv
scope note: Vesikehä. Vesientutkimus. Hydrografia Hydrologinen kierto ja maapallon vesitase Haihdunta. Valuma. Virtaama. Suotautuminen Sadevesi hydrologian kannalta Vesivarat. Pohjavedet. Geohydrologia Järvien, virtaavan veden ja meren tutkimus Limnologia. Potamologia. Oseanologia. Oseanografia Merivirrat. Vuorovedet. Veden lämpötila. Jääpeite Vesikemia

BIOLOGIA
type: Concept
References: Ympäristönsuojelu. Luonnonsuojelu
References: KASVITIEDE. SIENITIEDE
References: ELÄINTIEDE
References: Lääketieteellinen biologia
References: MAA- JA METSÄTALOUS. ELINTARVIKETEOLLISUUS. BIOTEKNIIKKA
References: Biotekniikka
alternative label: Aerobiologi, allm. (56+) @sv
alternative label: Aerobiologia, yl. (56+)
alternative label: Allmän biologi (56+) @sv
alternative label: Anatomi, biologi, allm. (56) @sv
alternative label: Anatomia, biologia, yl. (56)
alternative label: Artificiellt liv (56+) @sv
alternative label: Bioinformatiikka, biologia (56 ... 58+)
alternative label: Bioinformatik, biologi (56 ... 58+) @sv
alternative label: Biologi (56+) @sv
alternative label: Biologia (56+)
alternative label: Biologiset tieteet (56+)
alternative label: Biologiska vetenskaper (56+) @sv
alternative label: Biomekaniikka, yl. (56)
alternative label: Biomekanik, allm. (56) @sv
alternative label: Biometri (56+) @sv
alternative label: Biometria (56+)
alternative label: Biorytmiikka, biologia (56+)
alternative label: Biorytmik, biologi (56+) @sv
alternative label: Biostatistiikka, biologia (56+)
alternative label: Biostatistik, biologi (56+) @sv
alternative label: Döden, biologi, allm. (56) @sv
alternative label: Elimet, biologia, yl. (56)
alternative label: Elinoppi, biologia, yl. (56)
alternative label: Eliökunnan järjestelmä, yl. (56)
alternative label: Eliöt, biologia (56+)
alternative label: Elämä, biologia, yl. (56)
alternative label: Elävä luonto (56 ... 58+)
alternative label: Elävä luonto (56+)
alternative label: Formlära, biologi, allm. (56) @sv
alternative label: Fortplantning, biologi, allm. (56) @sv
alternative label: Fotosynteesi, yl. (56)
alternative label: Fotosyntes, allm. (56) @sv
alternative label: Fysiologi, biologi (56+) @sv
alternative label: Fysiologia, biologia (56+)
alternative label: Fysiologiset rytmit, biologia (56+)
alternative label: Fysiologiska rytmer, biologi (56+) @sv
alternative label: Histologi, biologi, allm. (56) @sv
alternative label: Histologia, biologia, yl. (56)
alternative label: Hydrobiologi (56+) @sv
alternative label: Hydrobiologia (56+)
alternative label: Jordmånsbiologin (56+) @sv
alternative label: Kasvaminen, biologia, yl. (56)
alternative label: Kronobiologia, yl. (56)
alternative label: Kudosoppi, biologia, yl. (56)
alternative label: Kuolema, biologia, yl. (56)
alternative label: Lisääntyminen, biologia, yl. (56)
alternative label: Luonnontieteet (50 ... 58+)
alternative label: Luonnontutkimus (50 ... 58+)
alternative label: Luonnontutkimus, biologiset tieteet (56+)
alternative label: Maaperäbiologia (56+)
alternative label: Meribiologia (56+)
alternative label: Morfologia, biologia, yl. (56)
alternative label: Muoto-oppi, biologia, yl. (56)
alternative label: Organologia, biologia, yl. (56)
alternative label: Plankton (56+)
alternative label: Seksuaalisuus, biologia, yl. (56)
alternative label: Sukupuolisuus, biologia, yl. (56)
alternative label: Systematiikka, biologia, yl. (56)
alternative label: Taksonomia, biologia, yl. (56)
alternative label: Tekoelämä (56+)
alternative label: Vesibiologia (56+)
alternative label: Yleisbiologia (56+)
broader: LUONNONTIETEET. MATEMATIIKKA. LÄÄKETIEDE
in scheme: YKL - Yleisten kirjastojen luokitusjärjestelmä
narrower: Sytologia. Solubiologia
narrower: Biokemia. Biofysiikka. Molekyylibiologia
narrower: Yleinen mikrobiologia
narrower: Perinnöllisyystiede
narrower: Luonto-oppaat
narrower: Ekologia. Eliömaantiede
notation: 56
scope note: Hit allmänna verk om biologisk och naturhistorisk forskning och forskning i den levande naturen. Allmän biologi Hit också allmänna verk om flera biovetenskaper Hit och till underklasserna sådana verk inom biologins olika områden som behandlar både djur och växter områden Hit och till underklasserna sådana verk i t.ex. anatomi, fysiologi, taxonomi, aerobiologi, jordmånsbiologi och vattenbiologi som rör både djur och växter Organismernas system i allmänhet Hit också allmänna verk om plankton Allmänna läroböcker i biologi 56.07 @sv
scope note: Tähän biologian, luonnonhistorian ja elävän luonnon tutkimuksen yleisteokset. Yleisbiologia Tähän myös useita biotieteitä koskevat yleisteokset Tähän ja alaluokkiin sellaiset biologian eri alojen teokset, jotka koskevat sekä eläimiä että kasveja Tähän ja alaluokkiin esim. anatomian, fysiologian, taksonomian, aerobiologian, maaperäbiologian ja vesibiologian teokset, jotka koskevat sekä eläimiä että kasveja Eliökunnan järjestelmä yleensä Tähän myös yleisteokset planktonista Yleiset biologian oppikirjat 56.07

Sytologia. Solubiologia
type: Concept
References: Biokemia. Biofysiikka. Molekyylibiologia
References: Yleinen mikrobiologia
References: Perinnöllisyystiede
References: Kasvianatomia. Kasvifysiologia. Kasvimorfologia
References: Eläinanatomia. Eläinfysiologia. Eläinmorfologia
References: Ihmisen anatomia
type: YKL-luokka
alternative label: Cellbiologi (56.1) @sv
alternative label: Celler (56.1) @sv
alternative label: Celler, biologi (56.1) @sv
alternative label: Cellkulturer (56.1) @sv
alternative label: Cellkärnor, cellbiologi (56.1) @sv
alternative label: Cellorgan (56.1) @sv
alternative label: Cytologi, biologi (56.1) @sv
alternative label: Solubiologia (56.1)
alternative label: Soluelimet (56.1)
alternative label: Solut (56.1)
alternative label: Solut, biologia (56.1)
alternative label: Soluviljelmät (56.1)
alternative label: Sytologia, biologia (56.1)
alternative label: Tumat, solubiologia (56.1)
broader: BIOLOGIA
in scheme: YKL - Yleisten kirjastojen luokitusjärjestelmä
notation: 56.1
preferred label: Cytologi. Cellbiologi @sv
preferred label: Cytology. Cell biology @en
scope note: Hit allmänna verk om cytologi och cellbiologi som behandlar både djur och växter Cellens uppbyggnad. Cellens funktion. Cellkultur @sv
scope note: Tähän sytologian ja solubiologian yleisteokset, jotka koskevat sekä eläimiä että kasveja Solun rakenne. Solun toiminta. Soluviljelmät

Biokemia. Biofysiikka. Molekyylibiologia
type: Concept
References: Orgaaninen kemia. Muovien kemia
References: Sytologia. Solubiologia
References: Yleinen mikrobiologia
References: Perinnöllisyystiede
References: Kasvianatomia. Kasvifysiologia. Kasvimorfologia
References: Eläinanatomia. Eläinfysiologia. Eläinmorfologia
References: Lääketieteellinen biologia
References: Ravinto-oppi. Ruokavaliot
References: Biotekniikka
type: YKL-luokka
alternative label: Aineenvaihdunta, biokemia, yl. (56.2)
alternative label: Biofysiikka (56.2)
alternative label: Biofysik (56.2) @sv
alternative label: Biokemi (56.2) @sv
alternative label: Biokemia (56.2)
alternative label: Biosynteettiset prosessit, biokemia (56.2)
alternative label: Biosyntetiska processer, biokemi, allm.. (56.2) @sv
alternative label: Doft, biokemi (56.2) @sv
alternative label: Entsyymit, biokemia (56.2)
alternative label: Enzymer, biokemi (56.2) @sv
alternative label: Fetter, biokemi (56.2) @sv
alternative label: Hajotusprosessit, biokemia (56.2)
alternative label: Hiilihydraatit, biokemia (56.2)
alternative label: Hormoner, biokemi (56.2) @sv
alternative label: Hormonit, biokemia (56.2)
alternative label: Jäsningskemi, biokemi (56.2) @sv
alternative label: Kemi, biokemi (56.2) @sv
alternative label: Kemia, biokemia (56.2)
alternative label: Kolhydrater, biokemi (56.2) @sv
alternative label: Käymiskemia, biokemia (56.2)
alternative label: Molekyler, biokemi (56.2) @sv
alternative label: Molekylärbiologi (56.2) @sv
alternative label: Molekyylibiologia (56.2)
alternative label: Molekyylit, biokemia (56.2)
alternative label: Nedbrytningsprocesser, biokemi (56.2) @sv
alternative label: Proteiinit, biokemia (56.2)
alternative label: Proteiner, biokemi (56.2) @sv
alternative label: Rasvat, biokemia (56.2)
alternative label: Tuoksu, biokemia (56.2)
alternative label: Valkuaisaineet, biokemia (56.2)
alternative label: Vitamiinit, biokemia (56.2)
alternative label: Vitaminer, biokemi (56.2) @sv
alternative label: Äggviteämnen, biokemi (56.2) @sv
alternative label: Ämnesomsättning, biokemi, allm. (56.2) @sv
broader: BIOLOGIA
in scheme: YKL - Yleisten kirjastojen luokitusjärjestelmä
notation: 56.2
preferred label: Biochemistry. Biophysics. Molecular biology @en
preferred label: Biokemi. Biofysik. Molekylbiologi @sv
scope note: Hit allmänna verk om biokemi, biofysik och molekylbiologi som behandlar både djur och växter Ämnesomsättningens biokemi Nedbrytningsprocesser. Biosyntetiska processer Äggvite-, kolhydrat-, fett- och energiämnesomsättning Enzymernas, vitaminernas och hormonernas biokemi @sv
scope note: Tähän biokemian, biofysiikan ja molekyylibiologian yleisteokset, jotka koskevat sekä eläimiä että kasveja Aineenvaihdunnan biokemia Hajotusprosessit. Biosynteettiset prosessit Valkuaisaine-, hiilihydraatti-, rasva- ja energia-aineenvaihdunta Entsyymien, vitamiinien ja hormonien biokemia

Yleinen mikrobiologia
type: Concept
References: Perinnöllisyystiede
References: Lääketieteellinen mikrobiologia. Immunologia
References: Sosiaalilääketiede. Ympäristölääketiede
References: Elintarviketeollisuus
References: Biotekniikka
type: YKL-luokka
alternative label: Aineenvaihdunta, mikrobit (56.3)
alternative label: Alger, blåalger (56.3) @sv
alternative label: Alkueläimet (56.3)
alternative label: Bakteerioppi, biologia (56.3)
alternative label: Bakteerit, biologia (56.3)
alternative label: Bakterier, biologi (56.3) @sv
alternative label: Bakteriologi, biologi (56.3) @sv
alternative label: Bakteriologia, biologia (56.3)
alternative label: Biofysiikka, mikrobit (56.3)
alternative label: Biofysik, mikrober (56.3) @sv
alternative label: Biokemi, mikrober (56.3) @sv
alternative label: Biokemia, mikrobit (56.3)
alternative label: Blåalger (56.3) @sv
alternative label: Celler, mikrober (56.3) @sv
alternative label: Ekologi, mikrober (56.3) @sv
alternative label: Ekologia, mikrobit (56.3)
alternative label: Eliöt, mikrobit (56.3)
alternative label: Formlära, mikrober (56.3) @sv
alternative label: Fysiologi, mikrober (56.3) @sv
alternative label: Fysiologia, mikrobit (56.3)
alternative label: Levät, sinilevät (56.3)
alternative label: Mikro-organismit (56.3)
alternative label: Mikrober (56.3) @sv
alternative label: Mikrobiologi (56.3) @sv
alternative label: Mikrobiologia (56.3)
alternative label: Mikrobit (56.3)
alternative label: Mikroorganismer (56.3) @sv
alternative label: Molekylärbiologi, mikrober (56.3) @sv
alternative label: Molekyylibiologia, mikrobit (56.3)
alternative label: Morfologi, mikrober (56.3) @sv
alternative label: Morfologia, mikrobit (56.3)
alternative label: Muoto-oppi, mikrobit (56.3)
alternative label: Organismer, mikrober (56.3) @sv
alternative label: Sinilevät (56.3)
alternative label: Solut, mikrobit (56.3)
alternative label: Systematiikka, mikrobit (56.3)
alternative label: Systematik, mikrober (56.3) @sv
alternative label: Taksonomia, mikrobit (56.3)
alternative label: Taxonomi, mikrober (56.3) @sv
alternative label: Urdjur (56.3) @sv
alternative label: Virologi, mikrobiologi (56.3) @sv
alternative label: Virologia, mikrobiologia (56.3)
alternative label: Virukset, biologia (56.3)
alternative label: Virus, biologi (56.3) @sv
alternative label: Ämnesomsättning, mikrober (56.3) @sv
broader: BIOLOGIA
in scheme: YKL - Yleisten kirjastojen luokitusjärjestelmä
notation: 56.3
preferred label: Allmän mikrobiologi @sv
preferred label: General microbiology @en
scope note: Hit allmänna verk om mikrobiologi Mikrober. Bakterier. Virus. Blåalger. Urdjur Virologi och bakteriologi ur biologisk synvinkel Mikrobernas systematik, morfologi, biokemi, fysiologi, molekylbiologi, biofysik och ekologi @sv
scope note: Tähän mikrobiologian yleisteokset Mikrobit. Bakteerit. Virukset. Sinilevät. Alkueläimet Virologia ja bakteriologia biologian kannalta Mikrobien systematiikka, morfologia, biokemia, fysiologia, molekyylibiologia, biofysiikka ja ekologia

Perinnöllisyystiede
type: Concept
References: Psyyken rakenne ja toiminnot
References: Elimet. Taudit
References: Maanviljely. Puutarhanhoito. Hyötykasvit
References: Kotieläintalous. Kotieläinten hoito
References: Biotekniikka
type: YKL-luokka
alternative label: Alleelit (56.4)
alternative label: Alleler (56.4) @sv
alternative label: DNA (56.4)
alternative label: DNA-tekniikka, perinnöllisyystiede (56.4)
alternative label: DNA-teknik, genetik (56.4) @sv
alternative label: Förädling, genetik (56.4) @sv
alternative label: Geenit (56.4)
alternative label: Geenitekniikka, perinnöllisyystiede (56.4)
alternative label: Geenitestit, perinnöllisyystiede (56.4)
alternative label: Geenivirheet, perinnöllisyystiede (56.4)
alternative label: Geneettinen koodi (56.4)
alternative label: Gener (56.4) @sv
alternative label: Genetiikka (56.4)
alternative label: Genetik (56.4) @sv
alternative label: Genetisk kod (56.4) @sv
alternative label: Genfel, genetik (56.4) @sv
alternative label: Genteknik, genetik (56.4) @sv
alternative label: Gentest, genetik (56.4) @sv
alternative label: Heteroosi, perinnöllisyystiede (56.4+)
alternative label: Heteros, genetik (56.4+) @sv
alternative label: Ihminen, perinnöllisyys (56.4)
alternative label: Inavel, genetik (56.4+) @sv
alternative label: Jalostus, perinnöllisyystiede (56.4)
alternative label: Kaksostutkimukset, perinnöllisyystiede (56.4)
alternative label: Kloning, genetik (56.4) @sv
alternative label: Kloonaus, perinnöllisyystiede (56.4)
alternative label: Korsning, genetik (56.4) @sv
alternative label: Kromosomer (56.4) @sv
alternative label: Kromosomistot (56.4)
alternative label: Kromosomit (56.4)
alternative label: Kromosomuppsättningar (56.4) @sv
alternative label: Lamarckism (56.4+) @sv
alternative label: Lamarckismi (56.4+)
alternative label: Mendelism (56.4+) @sv
alternative label: Mendelismi (56.4+)
alternative label: Mikrobgenetik (56.4) @sv
alternative label: Mikrobigenetiikka (56.4)
alternative label: Molekylärgenetik (56.4) @sv
alternative label: Molekyyligenetiikka (56.4)
alternative label: Mutaatiot (56.4+)
alternative label: Mutation, genetik (56.4+) @sv
alternative label: Mutationer (56.4+) @sv
alternative label: Muuntelu, perinnöllisyystiede (56.4+)
alternative label: Människan, ärftlighet (56.4) @sv
alternative label: Perinnöllisyys (56.4)
alternative label: Perinnöllisyystiede (56.4)
alternative label: Populaatiogenetiikka (56.4)
alternative label: Populationsgenetik (56.4) @sv
alternative label: RNA (56.4)
alternative label: RNA-tekniikka, perinnöllisyystiede (56.4)
alternative label: RNA-teknik, genetik (56.4) @sv
alternative label: Risteytys, perinnöllisyystiede (56.4)
alternative label: Sukusiitos, perinnöllisyystiede (56.4+)
alternative label: Tvillingforskningar, genetik (56.4) @sv
alternative label: Ärftlighet (56.4) @sv
alternative label: Ärftlighetslära (56.4) @sv
broader: BIOLOGIA
in scheme: YKL - Yleisten kirjastojen luokitusjärjestelmä
narrower: Kehitysoppi. Evoluutio
notation: 56.4
preferred label: Genetics @en
preferred label: Ärftlighetslära @sv
scope note: Molekylgenetik. Cytogenetik. Mikrobgenetik Populationsgenetik. Ärftlighet hos människan Ärftlig variation. Mendelism. Lamarckism Genetisk kod. DNA. RNA. Gener. Kromosomer. Mutationer Korsningar, inavel, förädling, kloning och genteknik ur den genetiska forskningens synvinkel Tillämpningar av genteknik klassificeras enligt område @sv
scope note: Molekyyligenetiikka. Sytogenetiikka. Mikrobigenetiikka Populaatiogenetiikka. Ihmisen perinnöllisyys Perinnöllinen muuntelu. Mendelismi. Lamarckismi Geneettinen koodi. DNA. RNA. Geenit. Kromosomit. Mutaatiot Risteytys, sukusiitos, jalostus, kloonaus ja geenitekniikka perinnöllisyystieteen tutkimuksen kannalta Geenitekniikan sovellutukset luokitetaan alan mukaan

Kehitysoppi. Evoluutio
type: Concept
References: Jumala-käsite. Jumalan toiminta
References: Maailmankaikkeus. Tähdet. Tähtijärjestelmät
References: Paleontologia
type: YKL-luokka
alternative label: Alkusynty, kehitysoppi (56.41)
alternative label: Anpassning, utvecklingslära (56.41+) @sv
alternative label: Artbildning (56.41+) @sv
alternative label: Atavism, utvecklingslära (56.41+) @sv
alternative label: Atavismi, kehitysoppi (56.41+)
alternative label: Darwinism (56.41+) @sv
alternative label: Darwinismi (56.41+)
alternative label: Elämä, kehitysoppi (56.41)
alternative label: Elämän synty, kehitysoppi (56.41)
alternative label: Evolutionen (56.41+) @sv
alternative label: Evoluutio (56.41+)
alternative label: Fylogeni (56.41+) @sv
alternative label: Fylogenia (56.41+)
alternative label: Kampen för tillvaron, utvecklingslära (56.41+) @sv
alternative label: Kehitysoppi (56.41+)
alternative label: Lajinmuodostus (56.41+)
alternative label: Liv, utvecklingslära (56.41) @sv
alternative label: Livets uppkomst, utvecklingslära (56.41) @sv
alternative label: Luonnonvalinta, kehitysoppi (56.41+)
alternative label: Naturligt urval, utvecklingslära (56.41+) @sv
alternative label: Olemassaolon taistelu, kehitysoppi (56.41+)
alternative label: Polveutumisoppi (56.41+)
alternative label: Rudiment, utvecklingslära (56.41+) @sv
alternative label: Sopeutuminen, kehitysoppi (56.41+)
alternative label: Surkastumat, kehitysoppi (56.41+)
alternative label: Uralstring, utvecklingslära (56.41) @sv
alternative label: Utvecklingslära (56.41+) @sv
alternative label: Val, utvecklingslära (56.41+) @sv
alternative label: Valinta, kehitysoppi (56.41+)
broader: Perinnöllisyystiede
in scheme: YKL - Yleisten kirjastojen luokitusjärjestelmä
narrower: Biologinen antropologia
notation: 56.41
preferred label: Theory of evolution. Evolutionary biology @en
preferred label: Utvecklingslära. Evolution @sv
scope note: Elämän synty ja kehitys. Alkusynty- ja kehitysteoriat Darwinismi. Lajinmuodostus. Evoluutioon vaikuttavat tekijät Olemassaolon taistelu, valinta, sopeutuminen ja maantieteellinen isolaatio evoluution kannalta
scope note: Livets uppkomst och utveckling. Uppkomst- och utvecklingsteorier Darwinism. Artbildning. Faktorer som påverkar evolutionen Kampen om tillvaron, urval, anpassning och geografisk isolering ur evolutionens synvinkel @sv

Biologinen antropologia
type: Concept
References: Psyyken rakenne ja toiminnot
References: Jumala-käsite. Jumalan toiminta
References: KANSATIEDE. KULTTUURIANTROPOLOGIA
References: Paleontologia
References: Lääketieteellinen biologia
alternative label: Aggressio, sosiobiologia (56.411)
alternative label: Aggression, sociobiologi (56.411) @sv
alternative label: Alkuihmiset (56.411)
alternative label: Anatomi, människans evolution (56.411) @sv
alternative label: Anatomia, ihmisen evoluutio (56.411)
alternative label: Antropogeni (56.411) @sv
alternative label: Antropogenia (56.411)
alternative label: Antropologi, biologisk (56.411) @sv
alternative label: Antropologi, fysisk (56.411) @sv
alternative label: Antropologia, biologinen (56.411)
alternative label: Antropologia, fyysinen (56.411)
alternative label: Antropometri (56.411) @sv
alternative label: Antropometria (56.411)
alternative label: Artbildning, människan (56.411) @sv
alternative label: Biologinen antropologia (56.411)
alternative label: Biologisk antropologi (56.411) @sv
alternative label: Drifter, människans etologi (56.411) @sv
alternative label: Elimet, ihmisen evoluutio (56.411)
alternative label: Elinoppi, ihmisen evoluutio (56.411)
alternative label: Esi-ihmiset (56.411)
alternative label: Etologi, människan (56.411) @sv
alternative label: Etologia, ihminen (56.411)
alternative label: Evolutionen, människan (56.411) @sv
alternative label: Evoluutio, ihminen (56.411)
alternative label: Forntidens människor, urmänniskor (56.411) @sv
alternative label: Fylogeni, människan (56.411) @sv
alternative label: Fylogenia, ihminen (56.411)
alternative label: Fysiologi, människans evolution (56.411) @sv
alternative label: Fysiologia, ihmisen evoluutio (56.411)
alternative label: Fysisk antropologi (56.411) @sv
alternative label: Fyysinen antropologia (56.411)
alternative label: Förmänniskor (56.411) @sv
alternative label: Ihminen, alkuihminen (56.411)
alternative label: Ihminen, biologinen antropologia (56.411)
alternative label: Ihminen, evoluutio (56.411)
alternative label: Ihminen, lajiominaisuudet (56.411)
alternative label: Instinkter, människans etologi (56.411) @sv
alternative label: Kehitysoppi, ihmisen evoluutio (56.411)
alternative label: Kraniologi (56.411) @sv
alternative label: Kraniologia (56.411)
alternative label: Lajinmuodostus, ihminen (56.411)
alternative label: Morfologi, människans evolution (56.411) @sv
alternative label: Morfologia, ihmisen evoluutio (56.411)
alternative label: Muinaisajan ihmiset, alkuihmiset (56.411)
alternative label: Människan, artegenskaper (56.411) @sv
alternative label: Människan, biologisk antropologi (56.411) @sv
alternative label: Människan, evolution (56.411) @sv
alternative label: Människan, urmänniskan (56.411) @sv
alternative label: Organ, människans evolution (56.411) @sv
alternative label: Organlära, människans evolution (56.411) @sv
alternative label: Organologi, människans evolution (56.411) @sv
alternative label: Organologia, ihmisen evoluutio (56.411)
alternative label: Paleoantropologi, människans evolution (56.411) @sv
alternative label: Paleoantropologia, ihmisen evoluutio (56.411)
alternative label: Paleontologi, människans evolution (56.411) @sv
alternative label: Paleontologia, ihmisen evoluutio (56.411)
alternative label: Polveutumisoppi, ihminen (56.411)
alternative label: Rasforskning, antropologi (56.411) @sv
alternative label: Rotututkimus, antropologia (56.411)
alternative label: Rudiment, människans evolution (56.411) @sv
alternative label: Sociobiologi (56.411) @sv
alternative label: Somatologi, människans evolution (56.411) @sv
alternative label: Somatologia, ihmisen evoluutio (56.411)
alternative label: Sosiobiologia (56.411)
alternative label: Surkastumat, ihmisen evoluutio (56.411)
alternative label: Urmänniskor (56.411) @sv
alternative label: Utvecklingslära, människan (56.411) @sv
alternative label: Vaistot, ihmisen etologia (56.411)
alternative label: Vietit, ihmisen etologia (56.411)
broader: Kehitysoppi. Evoluutio
in scheme: YKL - Yleisten kirjastojen luokitusjärjestelmä
notation: 56.411
scope note: Ihmisen alkuperä ja biologinen kehitys. Antropogenia. Ihmisen evoluutio. Ihmislajin ominaisuudet yleensä. Antropometria. Ihmisen morfologia ja somatologia kehitysopin kannalta. Esi-ihmiset. Alkuihmiset. Ihmistä koskeva paleontologia. Ihmisen etologia. Sosiobiologia. Ihmisen käyttäytymisen ja yhteiskuntaelämän kehitys etologiselta tai sosiobiologiselta kannalta. Jos teoksessa on sekä biologista että kulttuuri- tai sosiaaliantropologiaa, annetaan etusija luokalle 49+
scope note: Människans ursprung och biologiska utveckling. Antropogeni. Människans evolution. Människoartens egenskaper i allmänhet. Antropometri. Människans morfologi och somatologi ur utvecklingslärans synvinkel. Förmänniskor. Urmänniskor. Paleontologi som rör människan. Människans etologi. Sociobiologi. Människans beteende och samhällslivets utveckling ur etologisk eller sociobiologisk synvinkel. Om verket innehåller både biologisk antropologi och kultur- eller socialantropologi, ges företräde åt klass 49+ @sv

Luonto-oppaat
type: Concept
References: KASVITIEDE. SIENITIEDE
References: ELÄINTIEDE
References: Metsästys. Kalastus
References: Retkeily. Ulkoilu
type: YKL-luokka
alternative label: Artbestämningshandböcker (56.8) @sv
alternative label: Harrastukset, elävä luonto (56.8)
alternative label: Hobbyer, levande natur (56.8) @sv
alternative label: Lajinmääritysoppaat (56.8)
alternative label: Luonnonharrastusoppaat, elävä luonto (56.8)
alternative label: Luonto-oppaat, elävä luonto (56.8)
alternative label: Luontokeskukset, luontoretkioppaat (56.8)
alternative label: Luontopolkuoppaat (56.8)
alternative label: Luontoretkioppaat (56.8)
alternative label: Naturhandböcker, levande natur (56.8) @sv
alternative label: Naturstigar, handböcker (56.8) @sv
alternative label: Naturum, naturhandböcker (56.8) @sv
alternative label: Naturutflykter, handböcker (56.8) @sv
broader: BIOLOGIA
in scheme: YKL - Yleisten kirjastojen luokitusjärjestelmä
notation: 56.8
preferred label: Nature handbooks @en
preferred label: Naturhandböcker @sv
scope note: Hit oberoende av land eller ort plats naturhandböcker som behandlar både växter och djur eller den levande naturen i allmänhet Hit också allmänna handböcker om naturexkursioner, naturstigar, naturen som hobby och handböcker för artbestämning som rör både djur och växter eller den levande naturen i allmänhet Naturhandböcker för specialområden klassificeras enligt område Naturhadndböcker oberoende av land eller ort förs till klassen 56.8. @sv
scope note: Tähän maasta tai paikkakunnasta riippumatta luonto-oppaat, jotka koskevat sekä kasveja että eläimiä tai elävää luontoa yleensä Tähän myös yleiset luontoretkioppaat, luontopolkuoppaat, luonnonharrastuskirjat ja lajinmääritysoppaat, jotka koskevat sekä eläimia että kasveja tai elävää luontoa yleensä Erikoisalojen luonto-oppaat ja lajinmääritysoppaat luokitetaan alan mukaan

Ekologia. Eliömaantiede
type: Concept
References: EUROOPPA
References: SUOMI
References: POHJOISMAAT
References: KESKI-EUROOPPA
References: BRITTEINSAARET
References: ETELÄ-EUROOPPA
References: ITÄ-EUROOPPA
References: MUUT MAANOSAT
References: Ympäristönsuojelu. Luonnonsuojelu
References: FYYSINEN MAANTIEDE. GEOLOGIA
References: Hydrologia
References: Luonto-oppaat
References: Kasviekologia. Kasvimaantiede
References: Eläinten elintavat
alternative label: Aavikot, ekologia ja eliömaantiede, yl. (56.9)
alternative label: Arot, ekologia ja eliömaantiede (56.9)
alternative label: Biodiversiteetti, ekologia (56.9)
alternative label: Biogeografia (56.9)
alternative label: Biogeokemialliset kierrot (56.9)
alternative label: Biosfääri, ekologia (56.9)
alternative label: Biotooppi (56.9)
alternative label: Ekologia (56.9)
alternative label: Ekosysteemit, ekologia (56.9)
alternative label: Elinympäristöt, ekologia (56.9)
alternative label: Eliömaantiede (56.9)
alternative label: Eliöyhteisöt (56.9)
alternative label: Energiaekologia (56.9)
alternative label: Habitaatti (56.9)
alternative label: Hajottajat, ravintoketjut (56.9)
alternative label: Joet, ekologia ja eliömaantiede (56.9)
alternative label: Järvet, ekologia ja eliömaantiede (56.9)
alternative label: Koralliriutat, ekologia ja eliömaantiede (56.9)
alternative label: Kosteikot, ekologia ja eliömaantiede (56.9)
alternative label: Kulttuuriympäristöt, ekologia ja eliömaantiede (56.9)
alternative label: Kuluttajat, ravintoketjut (56.9)
alternative label: Laguunit, ekologia ja eliömaantiede (56.9)
alternative label: Loiset, biologia (56.9)
alternative label: Luolat, ekologia (56.9)
alternative label: Luonnon monimuotoisuus, ekologia (56.9)
alternative label: Luonnon tasapaino, ekologia (56.9)
alternative label: Luontotyypit (56.9)
alternative label: Maaekosysteemit (56.9)
alternative label: Maantiede, eliömaantiede (56.9)
alternative label: Maaperäekologia (56.9)
alternative label: Meret, ekologia ja eliömaantiede (56.9)
alternative label: Meriekologia (56.9)
alternative label: Metsäekologia (56.9)
alternative label: Metsäpalot, metsäekologia (56.9)
alternative label: Metsät, ekologia ja eliömaantiede (56.9)
alternative label: Mimikry, ekologia (56.9)
alternative label: Napa-alueet, ekologia ja eliömaantiede (56.9)
alternative label: Parasitismi, ekologia (56.9)
alternative label: Parasitologia, biologia (56.9)
alternative label: Petoeläimet, ravintoketjut (56.9)
alternative label: Planktonekologia (56.9)
alternative label: Populaatioekologia (56.9)
alternative label: Preeriat, ekologia ja eliömaantiede (56.9)
alternative label: Purot, ekologia ja eliömaantiede (56.9)
alternative label: Ravintoketjut, ekologia (56.9)
alternative label: Sademetsät, ekologia ja eliömaantiede (56.9)
alternative label: Savannit, ekologia ja eliömaantiede (56.9)
alternative label: Sisävedet, ekologia ja eliömaantiede (56.9)
alternative label: Soistuminen, ekologia (56.9)
alternative label: Suot, ekologia ja eliömaantiede (56.9)
alternative label: Symbioosi, ekologia (56.9)
alternative label: Taiga, ekologia ja eliömaantiede (56.9)
alternative label: Tulokaslajit, ekologia (56.9)
alternative label: Tundra-alueet, ekologia ja eliömaantiede (56.9)
alternative label: Tuottajat, ravintoketjut (56.9)
alternative label: Valtameret, ekologia ja eliömaantiede (56.9)
alternative label: Vedet, ekologia ja eliömaantiede (56.9)
alternative label: Vesiekologia (56.9)
alternative label: Vesiekosysteemit (56.9)
alternative label: Vesistöt, ekologia ja eliömaantiede (56.9)
broader: BIOLOGIA
in scheme: YKL - Yleisten kirjastojen luokitusjärjestelmä
notation: 56.9
scope note: Allmänna verk om ekologi och biogeografi som behandlar både djur och växter Organismernas förhållande till omgivningen Populationsekologi. Energiekologi Näringskedjor. Biogeokemiska kretslopp Symbios. Parasitism Årstidernas inverkan på naturen Jordekosystem. Jordmånsekologi Vattenekosystem. Vattenekologi. Planktonekologi Hit också allmänna verk som beskriver naturen i olika livsmiljöer eller på biogeografiska områden och som inte är avsedda som naturhandböcker eller handböcker för artbestämning Hit öknarnas, stäppernas, kulturmiljöernas, havens, skogarnas, polar- och tundraområdenas, savannernas, våtmarkernas, vattnens och bergstrakternas ekologi och natur i allmänhet @sv
scope note: Ekologian ja eliömaantieteen yleisteokset, jotka koskevat sekä eläimiä että kasveja Eliöiden suhde ympäristöönsä Populaatioekologia. Energiaekologia Ravintoketjut. Biogeokemialliset kierrot Symbioosi. Parasitismi Vuodenaikojen vaikutus luontoon Maaekosysteemit. Maaperäekologia Vesiekosysteemit Vesiekologia. Planktonekologia Tähän myös yleisteokset, jotka kuvailevat eri elinympäristöjen tai eliömaantieteellisten alueiden luontoa ja joita ei ole tarkoitettu luonto-oppaiksi tai lajinmääritysoppaiksi Tähän aavikoiden, arojen, kulttuuriympäristöjen, merien, metsien, napa- ja tundra-alueiden, savannien, soiden, vesistöjen ja vuoristojen ekologia ja luonto yleensä

KASVITIEDE. SIENITIEDE
type: Concept
modified: 2026-05-06T14:30:18
References: Uhanalaiset lajit. Luonnonsuojelualueet
References: Paleontologia
References: BIOLOGIA
References: Maanviljely. Puutarhanhoito. Hyötykasvit
References: Metsätalous
References: Metsien monikäyttö
type: YKL-luokka
alternative label: Artbestämningshandböcker, växter (57+) @sv
alternative label: Bioinformatiikka, biologia (56 ... 58+)
alternative label: Bioinformatik, biologi (56 ... 58+) @sv
alternative label: Biologi, växter (57+) @sv
alternative label: Biologia, kasvit (57+)
alternative label: Biologiset tieteet, kasvit (57+)
alternative label: Biologiska vetenskaper, växter (57+) @sv
alternative label: Botanik (57+) @sv
alternative label: Botaniska trädgårdar (57+) @sv
alternative label: Eliöt, kasvit (57+)
alternative label: Elävä luonto (56 ... 58+)
alternative label: Elävä luonto, kasvit (57+)
alternative label: Floror (57+) @sv
alternative label: Giftiga växter, botanik (57+) @sv
alternative label: Herbaariot (57+)
alternative label: Herbarier (57+) @sv
alternative label: Kasviharrastus, luonnonkasvit (57+)
alternative label: Kasvikokoelmat (57+)
alternative label: Kasvilajit, kasvitiede (57+)
alternative label: Kasviot (57+)
alternative label: Kasvipatologia (57+)
alternative label: Kasvisystematiikka (57+)
alternative label: Kasvit, kasvitiede (57+)
alternative label: Kasvit, kerääminen (57+)
alternative label: Kasvitaudit, kasvitiede (57+)
alternative label: Kasvitiede (57+)
alternative label: Kasvitieteelliset puutarhat (57+)
alternative label: Keräily, kasvit (57+)
alternative label: Lajinmääritysoppaat, kasvit (57+)
alternative label: Levande natur (56 ... 58+) @sv
alternative label: Levande natur, växter (57+) @sv
alternative label: Luonnontieteet (50 ... 58+)
alternative label: Luonnontutkimus (50 ... 58+)
alternative label: Myrkkykasvit, kasvitiede (57+)
alternative label: Naturforskning (50 ... 58+) @sv
alternative label: Naturvetenskaper (50 ... 58+) @sv
alternative label: Organismer, växter (57+) @sv
alternative label: Samlarverksamhet, växter (57+) @sv
alternative label: Systematiikka, kasvit (57+)
alternative label: Systematik, växter (57+) @sv
alternative label: Taksonomia, kasvit (57+)
alternative label: Taxonomi, växter (57+) @sv
alternative label: Uhanalaiset kasvit, kasvitiede (57+)
alternative label: Utrotningshotade växter, botanik (57+) @sv
alternative label: Vattenväxter (57+) @sv
alternative label: Vesikasvit (57+)
alternative label: Växtarter, botanik (57+) @sv
alternative label: Växter som hobby, vildväxter (57+) @sv
alternative label: Växter, botanik (57+) @sv
alternative label: Växter, samlande (57+) @sv
alternative label: Växtpatologi (57+) @sv
alternative label: Växtsamlingar (57+) @sv
alternative label: Växtsjukdomar, botanik (57+) @sv
alternative label: Växtsystematik (57+) @sv
broader: LUONNONTIETEET. MATEMATIIKKA. LÄÄKETIEDE
in scheme: YKL - Yleisten kirjastojen luokitusjärjestelmä
narrower: Putkilokasvit
narrower: Levät. Jäkälät. Sienet. Sammalet
narrower: Kasvianatomia. Kasvifysiologia. Kasvimorfologia
narrower: Kasviekologia. Kasvimaantiede
notation: 57
preferred label: BOTANIK. MYKOLOGI @sv
preferred label: BOTANY. MYCOLOGY @en
scope note: Hit allmänna verk om botanik. Hit och till underklasserna systematisk botanik, floror och handböcker för artbestämning, samlande av vilda växter samt växter som hobby. Hit och till underklasserna också sjukdomar hos vilda växter. Om verket innehåller såväl handledning i artbestämning som t.ex. trädgårdsskötsel eller samlande av vilda nyttoväxter, ges företräde åt klassen för bruk av växten i fråga. Om verket behandlar sjukdomar eller skadeinsekter hos både vilda och odlade växter, ges företräde åt klass 67.39. Botaniska museer och trädgårdar 57.062 @sv
scope note: Tähän kasvitieteen yleisteokset. Tähän ja alaluokkiin systemaattinen kasvitiede, kasviot ja lajinmääritysoppaat sekä luonnonvaraisten kasvien keräily ja kasviharrastus. Tähän ja alaluokkiin myös luonnonvaraisten kasvien taudit. Jos teoksessa on sekä lajinmääritysohjeita että kasvien hyötykäyttöä, kuten puutarhanhoitoa tai luonnonvaraisten hyötykasvien keräilyä, annetaan etusija ko. kasvien hyötykäytön luokalle. Jos teoksessa on sekä luonnonvaraisten että viljeltyjen kasvien tauteja tai tuholaisia, annetaan etusija luokalle 67.39. Kasvitieteelliset museot ja puutarhat 57.062

Putkilokasvit
type: Concept
References: Maanviljely. Puutarhanhoito. Hyötykasvit
References: Marjastus. Luonnonmarjat
type: YKL-luokka
alternative label: Blombiologi (57.1+) @sv
alternative label: Blomväxter, botanik (57.1+) @sv
alternative label: Bär, botanik (57.1+) @sv
alternative label: Fruktväxter, botanik (57.1+) @sv
alternative label: Fröbanker, botanik (57.1+) @sv
alternative label: Fröväxter, botanik (57.1+) @sv
alternative label: Gräsväxter, botanik (57.1) @sv
alternative label: Hedelmäkasvit, kasvitiede (57.1+)
alternative label: Heinäkasvit, kasvitiede (57.1)
alternative label: Hernekasvit, kasvitiede (57.1+)
alternative label: Itiökasvit, sanikkaiset (57.1+)
alternative label: Kukkabiologia (57.1+)
alternative label: Kukkakasvit, kasvitiede (57.1+)
alternative label: Kärlkryptogramer (57.1+) @sv
alternative label: Kärlväxter (57.1+) @sv
alternative label: Luonnonmarjat, kasvitiede (57.1+)
alternative label: Marjat, kasvitiede (57.1+)
alternative label: Orkideat, kasvitiede (57.1)
alternative label: Orkidéer, botanik (57.1) @sv
alternative label: Ormbunksväxter, botanik (57.1+) @sv
alternative label: Pollenbiologi (57.1+) @sv
alternative label: Pollinationsbiologi, botanik (57.1+) @sv
alternative label: Putkilokasvit (57.1+)
alternative label: Pölytysbiologia, kasvitiede (57.1+)
alternative label: Saniaiset, kasvitiede (57.1+)
alternative label: Sanikkaiset (57.1+)
alternative label: Siemenpankit, kasvitiede (57.1+)
alternative label: Siitepölybiologia (57.1+)
alternative label: Sporväxter, kärlkryptogamer (57.1+) @sv
alternative label: Vilda bär, botanik (57.1+) @sv
alternative label: Ärtväxter, botanik (57.1+) @sv
broader: KASVITIEDE. SIENITIEDE
in scheme: YKL - Yleisten kirjastojen luokitusjärjestelmä
narrower: Puut. Pensaat
notation: 57.1
preferred label: Kärlväxter @sv
preferred label: Vascular plants @en
scope note: Frö- eller blomväxter. Kärlkryptogamer Hit systematisk botanik för kärlväxter, deras anatomi, fysiologi, morfologi, ekologi och växtgeografi Hit också floror och artbestämningshandböcker som behandlar kärlväxter Blom-, frö- och pollenbiologi @sv
scope note: Siemen- eli kukkakasvit. Sanikkaiset Tähän putkilokasveja koskeva systemaattinen kasvitiede, anatomia, fysiologia, morfologia, ekologia ja kasvimaantiede Tähän myös putkilokasveja koskevat kasviot ja lajinmääritysoppaat Kukka-, siemen- ja siitepölybiologia

Puut. Pensaat
type: Concept
References: Ympäristönsuojelu. Luonnonsuojelu
References: Ekologia. Eliömaantiede
References: Kasviekologia. Kasvimaantiede
References: Puunjalostusteollisuus
References: Hedelmä- ja marjakasvit
References: Koristekasvit
References: Metsätalous
type: YKL-luokka
alternative label: Arboretum (57.11+) @sv
alternative label: Arboretumit (57.11+)
alternative label: Barrträd, botanik (57.11) @sv
alternative label: Buskar, botanik (57.11) @sv
alternative label: Dendrologi (57.11) @sv
alternative label: Dendrologia (57.11)
alternative label: Havupuut, kasvitiede (57.11)
alternative label: Kåda, botanik (57.11) @sv
alternative label: Lehtipuut, kasvitiede (57.11)
alternative label: Lövträd, botanik (57.11) @sv
alternative label: Metsäpuut, kasvitiede (57.11)
alternative label: Pensaat, kasvitiede (57.11)
alternative label: Pihka, kasvitiede (57.11)
alternative label: Puulajit, kasvitiede (57.11)
alternative label: Puut, kasvitiede (57.11)
alternative label: Rosor, botanik (57.11) @sv
alternative label: Ruusut, kasvitiede (57.11)
alternative label: Skogsträd, botanik (57.11) @sv
alternative label: Träd, botanik (57.11) @sv
alternative label: Trädarter, botanik (57.11) @sv
broader: Putkilokasvit
in scheme: YKL - Yleisten kirjastojen luokitusjärjestelmä
notation: 57.11
preferred label: Trees. Bushes @en
preferred label: Träd. Buskar @sv
scope note: Hit systematisk botanik för träd och buskar, deras anatomi, fysiologi, morfologi, ekologi och växtgeografi. Hit också floror och artbestämningshandböcker som behandlar träd och buskar Arboretum 57.11062 @sv
scope note: Tähän puita ja pensaita koskeva systemaattinen kasvitiede, anatomia, fysiologia, morfologia, ekologia ja kasvimaantiede. Tähän myös puita ja pensaita koskevat kasviot ja lajinmääritysoppaat Arboretumit 57.11062

Levät. Jäkälät. Sienet. Sammalet
type: Concept
References: Yleinen mikrobiologia
References: Putkilokasvit
References: Muut hyötykasvit
References: Sienestys
type: YKL-luokka
alternative label: Alger (57.3) @sv
alternative label: Bålväxter (57.3) @sv
alternative label: Homesienet, biologia (57.3)
alternative label: Itiökasvit (57.3)
alternative label: Jäkälät (57.3)
alternative label: Kasviplankton (57.3)
alternative label: Käävät, sienitiede (57.3)
alternative label: Lavar (57.3) @sv
alternative label: Levät (57.3)
alternative label: Mossor (57.3) @sv
alternative label: Mykologi (57.3) @sv
alternative label: Mykologia (57.3)
alternative label: Mögelsvampar, biologi (57.3) @sv
alternative label: Pakuri, sienet (57.3)
alternative label: Planktonkasvit (57.3)
alternative label: Planktonväxter (57.3) @sv
alternative label: Sammalet (57.3)
alternative label: Sekovartiset kasvit (57.3)
alternative label: Sienet, sienitiede (57.3)
alternative label: Sienitiede (57.3)
alternative label: Sporväxter (57.3) @sv
alternative label: Sprängticka, svampar (57.3) @sv
alternative label: Svampar, mykologi (57.3) @sv
alternative label: Symbioosi, jäkälät (57.3)
alternative label: Symbios, lavar (57.3) @sv
alternative label: Tickor, mykologi (57.3) @sv
alternative label: Växtplankton (57.3) @sv
broader: KASVITIEDE. SIENITIEDE
in scheme: YKL - Yleisten kirjastojen luokitusjärjestelmä
notation: 57.3
preferred label: Algae. Lichen. Fungi. Bryophytes @en
preferred label: Alger. Lavar. Svampar. Mossor @sv
scope note: Bålväxter. Sporväxter i allmänhet Svampar ur mykologisk synvinkel Hit också planktonväxter i allmänhet Hit systematisk botanik som behandlar bålväxter, deras anatomi, fysiologi, morfologi, ekologi och växtgeografi Hit också floror och artbestämningshandböcker som behandlar bålväxter @sv
scope note: Sekovartiset kasvit. Itiökasvit yleensä Sienet sienitieteen kannalta Tähän myös planktonkasvit yleensä Tähän sekovartisia kasveja koskeva systemaattinen kasvitiede, anatomia, fysiologia, morfologia, ekologia ja kasvimaantiede Tähän myös sekovartisia kasveja koskevat kasviot ja lajinmääritysoppaat

Kasvianatomia. Kasvifysiologia. Kasvimorfologia
type: Concept
References: BIOLOGIA
type: YKL-luokka
alternative label: Aineenvaihdunta, kasvit, yl. (57.8)
alternative label: Alkaloider, växtfysiologi (57.8) @sv
alternative label: Alkaloidit, kasvifysiologia (57.8)
alternative label: Anatomi, växter (57.8) @sv
alternative label: Anatomia, kasvit (57.8)
alternative label: Assimilering, växtfysiologi (57.8) @sv
alternative label: Avdunstning, växtfysiologi (57.8) @sv
alternative label: Biofysiikka, kasvit (57.8)
alternative label: Biofysik, växter (57.8) @sv
alternative label: Biokemi, växtfysiologi (57.8) @sv
alternative label: Biokemia, kasvifysiologia (57.8)
alternative label: Biomekaniikka, kasvit (57.8)
alternative label: Biomekanik, växter (57.8) @sv
alternative label: Biorytmiikka, kasvit (57.8)
alternative label: Biorytmik, växter (57.8) @sv
alternative label: Celler, växter (57.8) @sv
alternative label: Cytologi, växter (57.8) @sv
alternative label: Elimet, kasvit (57.8)
alternative label: Elinoppi, kasvit (57.8)
alternative label: Embryologi, växter (57.8) @sv
alternative label: Embryologia, kasvit (57.8)
alternative label: Formlära, växter (57.8) @sv
alternative label: Fortplantning, växter (57.8) @sv
alternative label: Fotosynteesi, kasvifysiologia (57.8)
alternative label: Fotosyntes, växtfysiologi (57.8) @sv
alternative label: Fysiologi, växter (57.8) @sv
alternative label: Fysiologia, kasvit (57.8)
alternative label: Fysiologiset rytmit, kasvit (57.8)
alternative label: Fysiologiska rytmer, växter (57.8) @sv
alternative label: Groning, växtfysiologi (57.8) @sv
alternative label: Haihduttaminen, kasvifysiologia (57.8)
alternative label: Histologi, växter (57.8) @sv
alternative label: Histologia, kasvit (57.8)
alternative label: Hormoner, växter (57.8) @sv
alternative label: Hormonit, kasvit (57.8)
alternative label: Individutveckling, växter (57.8) @sv
alternative label: Itäminen, kasvifysiologia (57.8)
alternative label: Kasvaminen, kasvit (57.8)
alternative label: Kasvianatomia (57.8)
alternative label: Kasvifysiologia (57.8)
alternative label: Kasvimorfologia (57.8)
alternative label: Kasviorganologia (57.8)
alternative label: Kronobiologi, växter (57.8) @sv
alternative label: Kronobiologia, kasvit (57.8)
alternative label: Lisääntyminen, kasvit (57.8)
alternative label: Morfologi, växter (57.8) @sv
alternative label: Morfologia, kasvit (57.8)
alternative label: Muoto-oppi, kasvit (57.8)
alternative label: Näringsupptagning, växtfysiologi (57.8) @sv
alternative label: Ontogeni, växter (57.8) @sv
alternative label: Ontogenia, kasvit (57.8)
alternative label: Organ, växter (57.8) @sv
alternative label: Organlära, växter (57.8) @sv
alternative label: Organologi, växter (57.8) @sv
alternative label: Organologia, kasvit (57.8)
alternative label: Ravinnonotto, kasvifysiologia (57.8)
alternative label: Seksuaalisuus, kasvit (57.8)
alternative label: Sexualitet, växter (57.8) @sv
alternative label: Solut, kasvit (57.8)
alternative label: Sukupuolisuus, kasvit (57.8)
alternative label: Sytologia, kasvit (57.8)
alternative label: Växande, växter (57.8) @sv
alternative label: Växtanatomi (57.8) @sv
alternative label: Växtfysiologi (57.8) @sv
alternative label: Växtmorfologi (57.8) @sv
alternative label: Växtorganologi (57.8) @sv
alternative label: Yhteyttäminen, kasvifysiologia (57.8)
alternative label: Yksilönkehitys, kasvit (57.8)
alternative label: Ämnesomsättning, växter, allm. (57.8) @sv
broader: KASVITIEDE. SIENITIEDE
in scheme: YKL - Yleisten kirjastojen luokitusjärjestelmä
notation: 57.8
preferred label: Plant anatomy. Plant physiology. Plant morphology @en
preferred label: Växtanatomi. Växtfysiologi. Växtmorfologi @sv
scope note: Hit allmänna verk om växtanatomi, växtfysiologi och växtmorfologi Hit också allmänna verk om växternas cytologi, histologi, organologi, embryologi och ontogeni Anatomi, fysiologi och morfologi för enskilda grupper av växter klassificeras enligt växtgruppens område @sv
scope note: Tähän kasvianatomian, kasvifysiologian ja kasvimorfologian yleisteokset Tähän myös kasvien sytologian, histologian, organologian, embryologian ja ontogenian yleisteokset Tietyn kasviryhmän anatomia, fysiologia ja morfologia luokitetaan ko. kasviryhmän luokkaan

Kasviekologia. Kasvimaantiede
type: Concept
References: Ympäristönsuojelu. Luonnonsuojelu
References: Ekologia. Eliömaantiede
References: Eläinten elintavat
References: MAA- JA METSÄTALOUS. ELINTARVIKETEOLLISUUS. BIOTEKNIIKKA
type: YKL-luokka
alternative label: Biogeografi, växter (57.9) @sv
alternative label: Ekologi, växter (57.9) @sv
alternative label: Ekologia, kasvit (57.9)
alternative label: Eliömaantiede, kasvit (57.9)
alternative label: Energiaekologia, kasvit (57.9)
alternative label: Energiekologi, växter (57.9) @sv
alternative label: Främmande arter, växtekologi (57.9) @sv
alternative label: Geografi, växtgeografi (57.9) @sv
alternative label: Kasviekologia (57.9)
alternative label: Kasvillisuudentutkimus (57.9)
alternative label: Kasvillisuustyypit (57.9)
alternative label: Kasvimaantiede (57.9)
alternative label: Kasvisosiologia (57.9)
alternative label: Kasvit, levinneisyys (57.9)
alternative label: Kasviyhdyskunnat (57.9)
alternative label: Kasvupaikat (57.9)
alternative label: Loiset, kasvitiede (57.9)
alternative label: Maantiede, kasvimaantiede (57.9)
alternative label: Metsät, kasviekologia (57.9)
alternative label: Metsätyypit, kasviekologia (57.9)
alternative label: Metsävyöhykkeet, kasvimaantiede (57.9)
alternative label: Myrtyper, växtekologi (57.9) @sv
alternative label: Nya arter, växtekologi (57.9) @sv
alternative label: Parasiter, botanik (57.9) @sv
alternative label: Parasitism, växtekologi (57.9) @sv
alternative label: Parasitismi, kasviekologia (57.9)
alternative label: Parasitologi, botanik (57.9) @sv
alternative label: Parasitologia, kasvitiede (57.9)
alternative label: Populaatioekologia, kasvit (57.9)
alternative label: Populationsekologi, växter (57.9) @sv
alternative label: Skogar, växtekologi (57.9) @sv
alternative label: Skogstyper, växtekologi (57.9) @sv
alternative label: Skogszoner, växtgeografi (57.9) @sv
alternative label: Ståndorter (57.9) @sv
alternative label: Suotyypit, kasviekologia (57.9)
alternative label: Symbioosi, kasviekologia (57.9)
alternative label: Symbios, växtekologi (57.9) @sv
alternative label: Tulokaslajit, kasviekologia (57.9)
alternative label: Vieraslajit, kasviekologia (57.9)
alternative label: Vuodenajat, kasviekologia (57.9)
alternative label: Växtekologi (57.9) @sv
alternative label: Växter, utbredning (57.9) @sv
alternative label: Växtgeografi (57.9) @sv
alternative label: Växtlighetsforskning (57.9) @sv
alternative label: Växtlighetstyper (57.9) @sv
alternative label: Växtsamhällen (57.9) @sv
alternative label: Växtsociologi (57.9) @sv
alternative label: Årstider, växtekologi (57.9) @sv
broader: KASVITIEDE. SIENITIEDE
in scheme: YKL - Yleisten kirjastojen luokitusjärjestelmä
notation: 57.9
preferred label: Plant ecology. Plant geography @en
preferred label: Växtekologi. Växtgeografi @sv
scope note: Hit allmänna verk om växtekologi och växtgeografi Växternas förhållande till omgivningen Växternas populations- och energiekologi Symbios och parasitism ur växtekologins synvinkel Vegetationstyper. Växtsamhällen Vegetationszoner. Växtgeografiska områden Växternas utbredning Årstidernas inverkan på vegetationen Hit också allmänna verk som beskriver olika vegetationstyper eller växtgeografiska områden och som inte är avsedda som floror eller handböcker för artbestämning En viss växtgrupps ekologi och växtgeografi klassificeras enligt den ifrågavarande växtgruppens klass @sv
scope note: Tähän kasviekologian ja kasvimaantieteen yleisteokset Kasvien suhde ympäristöönsä Kasvien populaatio- ja energiaekologia Symbioosi ja parasitismi kasviekologian kannalta Kasvillisuustyypit. Kasviyhdyskunnat Kasvillisuusvyöhykkeet. Kasvimaantieteelliset alueet Kasvien levinneisyys Vuodenaikojen vaikutus kasvipeitteeseen Tähän myös eri kasvillisuustyyppejä tai kasvimaantieteellisten alueiden kasvillisuutta kuvailevat yleisteokset, joita ei ole tarkoitettu kasvioiksi tai lajinmääritysoppaiksi Tietyn kasviryhmän ekologia ja kasvimaantiede luokitetaan ko. kasviryhmän luokkaan

ELÄINTIEDE
type: Concept
References: Uhanalaiset lajit. Luonnonsuojelualueet
References: Eläinsuojelu
References: Paleontologia
References: Sosiaalilääketiede. Ympäristölääketiede
References: Kasvinsuojelu
References: Kotieläintalous. Kotieläinten hoito
References: Akvaariot
References: Eläinlääketiede
References: Metsänhoito
References: Metsästys. Kalastus
alternative label: Akvaariot, eläintarhat (58+)
alternative label: Akvarier, djurparker (58+) @sv
alternative label: Artbestämningshandböcker, djur (58+) @sv
alternative label: Bioinformatiikka, biologia (56 ... 58+)
alternative label: Bioinformatik, biologi (56 ... 58+) @sv
alternative label: Biologi, djur (58+) @sv
alternative label: Biologia, eläimet (58+)
alternative label: Biologiset tieteet, eläimet (58+)
alternative label: Biologiska vetenskaper, djur (58+) @sv
alternative label: Djur, sjukdomar , zoologi (58+) @sv
alternative label: Djur, uppstoppning (58+) @sv
alternative label: Djur, zoologi (58+) @sv
alternative label: Djurarter, zoologi (58+) @sv
alternative label: Djurparker allm. (58+) @sv
alternative label: Djursjukdomar, zoologi (58+) @sv
alternative label: Djursystematik (58+) @sv
alternative label: Eliöt, eläimet (58+)
alternative label: Eläimet, eläintiede (58+)
alternative label: Eläimet, sairaudet, eläintiede (58+)
alternative label: Eläimet, täyttäminen (58+)
alternative label: Eläinlajit, eläintiede (58+)
alternative label: Eläinsystematiikka (58+)
alternative label: Eläintarhat yl. (58+)
alternative label: Eläintaudit, eläintiede (58+)
alternative label: Eläintiede (58+)
alternative label: Eläintieteelliset museot (58+)
alternative label: Elävä luonto (56 ... 58+)
alternative label: Elävä luonto, eläimet (58+)
alternative label: Havsdjur, zoologi (58+) @sv
alternative label: Jordmånsdjur (58+) @sv
alternative label: Konservering, zoologi (58+) @sv
alternative label: Konservointi, eläintiede (58+)
alternative label: Lajinmääritysoppaat, eläimet (58+)
alternative label: Levande natur (56 ... 58+) @sv
alternative label: Levande natur, djur (58+) @sv
alternative label: Luonnontieteet (50 ... 58+)
alternative label: Luonnontutkimus (50 ... 58+)
alternative label: Läten, djurens ljud (58+) @sv
alternative label: Maaperäeläimet (58+)
alternative label: Merieläimet, eläintiede (58+)
alternative label: Naturforskning (50 ... 58+) @sv
alternative label: Naturvetenskaper (50 ... 58+) @sv
alternative label: Organismer, djur (58+) @sv
alternative label: Petoeläimet, eläintiede (58+)
alternative label: Rovdjur, zoologi (58+) @sv
alternative label: Systematiikka, eläimet (58+)
alternative label: Systematik, djur (58+) @sv
alternative label: Taksonomia, eläimet (58+)
alternative label: Taxonomi, djur (58+) @sv
alternative label: Terraariot, eläintarhat (58+)
alternative label: Terrarier, djurparker (58+) @sv
alternative label: Uhanalaiset eläimet, eläintiede (58+)
alternative label: Utrotningshotade djur, zoologi (58+) @sv
alternative label: Vattendjur (58+) @sv
alternative label: Vesieläimet (58+)
alternative label: Vilda djur, zoologi (58+) @sv
alternative label: Villieläimet, eläintiede (58+)
alternative label: Zoologi (58+) @sv
alternative label: Zoologiska museer (58+) @sv
alternative label: Äänet, eläinten äänet (58+)
broader: LUONNONTIETEET. MATEMATIIKKA. LÄÄKETIEDE
in scheme: YKL - Yleisten kirjastojen luokitusjärjestelmä
narrower: Selkärankaiset
narrower: Selkärangattomat
narrower: Eläinanatomia. Eläinfysiologia. Eläinmorfologia
narrower: Eläinten elintavat
notation: 58
scope note: Hit allmänna verk om zoologi. Hit och till underklasserna också systematisk zoologi samt handböcker för artbestämning av djur. Hit och till underklasserna uppstoppning och preparering av djur. Hit och till underklasserna också parasitologi och sjukdomar hos vilda djur ur zoologisk synvinkel. Om verket behandlar såväl anvisningar för artbestämning som skötsel av djur, bruk av djur eller skadedjursbekämpning, förs verket till den ifrågavarande klassen för skötsel, bruk eller bekämpning. Zoologiska museer och djurparker samt offentliga akvarier, delfinarier och terrarier 58.062 @sv
scope note: Tähän eläintieteen yleisteokset. Tähän ja alaluokkiin myös systemaattinen eläintiede sekä eläimiä koskevat lajinmääritysoppaat. Tähän ja alaluokkiin myös eläinten täyttäminen ja preparointi. Tähän ja alaluokkiin myös parasitologia ja luonnonvaraisten eläinten taudit eläintieteen kannalta. Jos teoksessa on sekä lajinmääritysohjeita että eläinten hoitoa, hyötykäyttöä tai tuholaistorjuntaa, annetaan etusija hoidon, hyötykäytön tai torjunnan mukaiselle luokalle. Eläintieteelliset museot ja eläintarhat sekä julkiset akvaariot, delfinaariot ja terraariot 58.062

Selkärankaiset
type: Concept
type: YKL-luokka
alternative label: Lansettfiskar (58.1) @sv
alternative label: Rundmunnar (58.1) @sv
alternative label: Ryggradsdjur (58.1+) @sv
alternative label: Selkärankaiset (58.1+)
alternative label: Suikulaiset (58.1)
alternative label: Ympyräsuiset (58.1)
broader: ELÄINTIEDE
in scheme: YKL - Yleisten kirjastojen luokitusjärjestelmä
narrower: Nisäkkäät
narrower: Linnut
narrower: Matelijat. Sammakkoeläimet
narrower: Kalat
notation: 58.1
preferred label: Ryggradsdjur @sv
preferred label: Vertebrates @en
scope note: Hit och till underklasserna systematisk zoologi för ryggradsdjur och deras anatomi, fysiologi, morfologi, ekologi, etologi och djurgeografi Hit och till underklasserna också handböcker för artbestämning som behandlar ryggradsdjur Hit rundmunnar och lancettfiskar @sv
scope note: Tähän ja alaluokkiin selkärankaisia koskeva systemaattinen eläintiede, anatomia, fysiologia, morfologia, ekologia, etologia ja eläinmaantiede Tähän ja alaluokkiin myös selkärankaisia koskevat lajinmääritysoppaat Tähän ympyräsuiset ja suikulaiset

Nisäkkäät
type: Concept
References: Biologinen antropologia
References: Lääketieteellinen biologia
References: Kotieläintalous. Kotieläinten hoito
alternative label: Aasit, eläintiede (58.11)
alternative label: Aavikkorotat, eläintiede (58.11)
alternative label: Bon, däggdjur (58.11) @sv
alternative label: Bufflar, zoologi (58.11) @sv
alternative label: Chinchilla, zoologi (58.11) @sv
alternative label: Chinchillat, eläintiede (58.11)
alternative label: Däggdjur, zoologi (58.11) @sv
alternative label: Fretit, eläintiede (58.11)
alternative label: Fretter, zoologi (58.11) @sv
alternative label: Får, zoologi (58.11) @sv
alternative label: Gerbiilit, eläintiede (58.11)
alternative label: Gerbiler, zoologi (58.11) @sv
alternative label: Getdjur, zoologi (58.11) @sv
alternative label: Gnagare, zoologi (58.11) @sv
alternative label: Hamsterit, eläintiede (58.11)
alternative label: Hamstrar, zoologi (58.11) @sv
alternative label: Harar, zoologi (58.11) @sv
alternative label: Harmöss, zoologi (58.11) @sv
alternative label: Hevoset, eläintiede (58.11)
alternative label: Hiiret, eläintiede (58.11)
alternative label: Hirvieläimet, eläintiede (58.11)
alternative label: Hjortdjur, zoologi (58.11) @sv
alternative label: Hovdjur, zoologi (58.11) @sv
alternative label: Hunddjur, zoologi (58.11) @sv
alternative label: Hylkeet, eläintiede (58.11)
alternative label: Hästar, zoologi (58.11) @sv
alternative label: Idisslare, zoologi (58.11) @sv
alternative label: Imettäväiset, eläintiede (58.11)
alternative label: Jyrsijät, eläintiede (58.11)
alternative label: Jänikset, eläintiede (58.11)
alternative label: Kameldjur, zoologi (58.11) @sv
alternative label: Kamelieläimet, eläintiede (58.11)
alternative label: Kaniner, zoologi (58.11) @sv
alternative label: Kanit, eläintiede (58.11)
alternative label: Kattdjur, zoologi (58.11) @sv
alternative label: Kavioeläimet, eläintiede (58.11)
alternative label: Ketut, eläintiede (58.11)
alternative label: Kissaeläimet, eläintiede (58.11)
alternative label: Koiraeläimet, eläintiede (58.11)
alternative label: Laamat, eläintiede (58.11)
alternative label: Lamor, zoologi (58.11) @sv
alternative label: Lampaat, eläintiede (58.11)
alternative label: Marsut, eläintiede (58.11)
alternative label: Marsvin, zoologi (58.11) @sv
alternative label: Minkar, zoologi (58.11) @sv
alternative label: Minkit, eläintiede (58.11)
alternative label: Märehtijät, eläintiede (58.11)
alternative label: Mårddjur, zoologi (58.11) @sv
alternative label: Möss, zoologi (58.11) @sv
alternative label: Naudat, eläintiede (58.11)
alternative label: Nautaeläimet, eläintiede (58.11)
alternative label: Nisäkkäät, eläintiede (58.11)
alternative label: Näätäeläimet, eläintiede (58.11)
alternative label: Nöt, zoologi (58.11) @sv
alternative label: Nötdjur, zoologi (58.11) @sv
alternative label: Pesät, nisäkkäät (58.11)
alternative label: Pikkujyrsijät, eläintiede (58.11)
alternative label: Pikkunisäkkäät, eläintiede (58.11)
alternative label: Poikaset, nisäkkäät (58.11)
alternative label: Porot, eläintiede (58.11)
alternative label: Puhvelit, eläintiede (58.11)
alternative label: Renar, zoologi (58.11) @sv
alternative label: Rotat, eläintiede (58.11)
alternative label: Rävar, zoologi (58.11) @sv
alternative label: Råttor, zoologi (58.11) @sv
alternative label: Siat, eläintiede (58.11)
alternative label: Sikaeläimet, eläintiede (58.11)
alternative label: Sinsillat, eläintiede (58.11)
alternative label: Sorkkaeläimet, eläintiede (58.11)
alternative label: Valaat, eläintiede (58.11)
alternative label: Vuohieläimet, eläintiede (58.11)
broader: Selkärankaiset
in scheme: YKL - Yleisten kirjastojen luokitusjärjestelmä
notation: 58.11
scope note: Hit systematisk zoologi för däggdjur, deras anatomi, fysiologi, morfologi, ekologi, etologi och djurgeografi Hit också handböcker för artbestämning som behandlar däggdjur @sv
scope note: Tähän nisäkkäitä koskeva systemaattinen eläintiede, anatomia, fysiologia, morfologia, ekologia, etologia ja eläinmaantiede Tähän myös nisäkkäitä koskevat lajinmääritysoppaat

Linnut
type: Concept
References: Siipikarjan hoito
References: Häkkilinnut
type: YKL-luokka
alternative label: Andfåglar, ornitologi (58.12) @sv
alternative label: Ankat, lintutiede (58.12)
alternative label: Ankor, ornitologi (58.12) @sv
alternative label: Bon, fåglar (58.12) @sv
alternative label: Duvfåglar, ornitologi (58.12) @sv
alternative label: Flyttfåglar (58.12) @sv
alternative label: Fågelbon (58.12) @sv
alternative label: Fågelfauna, ornitologi (58.12) @sv
alternative label: Fågelholkar (58.12) @sv
alternative label: Fågelstationer (58.12) @sv
alternative label: Fågelägg (58.12) @sv
alternative label: Fåglar, ornitologi (58.12) @sv
alternative label: Fåglar, som hobby (58.12) @sv
alternative label: Gäss, ornitologi (58.12) @sv
alternative label: Hanhet, lintutiede (58.12)
alternative label: Hönsfåglar, ornitologi (58.12) @sv
alternative label: Kalkkunat, lintutiede (58.12)
alternative label: Kalkoner, ornitologi (58.12) @sv
alternative label: Kanalinnut, lintutiede (58.12)
alternative label: Kyyhkylinnut, lintutiede (58.12)
alternative label: Linnunmunat (58.12)
alternative label: Linnunpesät (58.12)
alternative label: Linnunpöntöt (58.12)
alternative label: Linnusto, lintutiede (58.12)
alternative label: Linnut, lintutiede (58.12)
alternative label: Lintuasemat (58.12)
alternative label: Lintuharrastus (58.12)
alternative label: Lintutiede (58.12)
alternative label: Läten, fåglarnas ljud (58.12) @sv
alternative label: Muuttolinnut (58.12)
alternative label: Ornitologi (58.12) @sv
alternative label: Ornitologia (58.12)
alternative label: Papegojor, ornitologi (58.12) @sv
alternative label: Papukaijat, lintutiede (58.12)
alternative label: Pesät, linnut (58.12)
alternative label: Poikaset, linnut (58.12)
alternative label: Siivet, linnut (58.12)
alternative label: Sorsalinnut, lintutiede (58.12)
alternative label: Ungar, fåglar (58.12) @sv
alternative label: Vaktlar, ornitologi (58.12) @sv
alternative label: Viiriäiset, lintutiede (58.12)
alternative label: Vingar, fåglar (58.12) @sv
alternative label: Äänet, lintujen äänet (58.12)
broader: Selkärankaiset
in scheme: YKL - Yleisten kirjastojen luokitusjärjestelmä
notation: 58.12
preferred label: Birds @en
preferred label: Fåglar @sv
scope note: Hit systematisk zoologi för fåglar, deras anatomi, fysiologi, morfologi, ekologi, etologi samt djurgeografi Hit också handböcker för artbestämning som behandlar fåglar Hit också fågelholkar och hur man bygger dem @sv
scope note: Tähän lintuja koskeva systemaattinen eläintiede, anatomia, fysiologia, morfologia, ekologia, etologia ja eläinmaantiede Tähän myös lintuja koskevat lajinmääritysoppaat Tähän myös linnunpöntöt ja niiden rakentaminen

Matelijat. Sammakkoeläimet
type: Concept
References: Paleontologia
References: Matelijat. Sammakkoeläimet
type: YKL-luokka
alternative label: Groddjur, zoologi (58.13) @sv
alternative label: Grodor, zoologi (58.13) @sv
alternative label: Herpetologi (58.13) @sv
alternative label: Herpetologia (58.13)
alternative label: Kilpikonnat, eläintiede (58.13)
alternative label: Krokodiler, zoologi (58.13) @sv
alternative label: Krokotiilit, eläintiede (58.13)
alternative label: Käärmeet, eläintiede (58.13)
alternative label: Liskot, eläintiede (58.13)
alternative label: Matelijat, eläintiede (58.13)
alternative label: Ormar, zoologi (58.13) @sv
alternative label: Reptiler, zoologi (58.13) @sv
alternative label: Salamandrar, zoologi (58.13) @sv
alternative label: Salamanterit, eläintiede (58.13)
alternative label: Sammakkoeläimet, eläintiede (58.13)
alternative label: Sammakot, eläintiede (58.13)
alternative label: Sisiliskot (58.13)
alternative label: Skogsödlor (58.13) @sv
alternative label: Sköldpaddor, zoologi (58.13) @sv
alternative label: Ödlor, zoologi (58.13) @sv
broader: Selkärankaiset
in scheme: YKL - Yleisten kirjastojen luokitusjärjestelmä
notation: 58.13
preferred label: Kräldjur. Groddjur @sv
preferred label: Reptiles. Amphibians @en
scope note: Kilpikonnat. Liskot. Käärmeet. Krokotiilit Sammakot. Salamanterit Tähän matelijoita ja sammakkoeläimiä koskeva systemaattinen eläintiede, anatomia, fysiologia, morfologia, ekologia, etologia ja eläinmaantiede Tähän myös matelijoita ja sammakkoeläimiä koskevat lajinmääritysoppaat
scope note: Sköldpaddor. Ödlor. Ormar. Krokodiler Grodor. Salamandrar Hit systematisk zoologi för kräldjur och groddjur, deras anatomi, fysiologi, morfologi, ekologi, etologi och djurgeografi Hit också handböcker för artbestämning som behandlar kräldjur och groddjur @sv

Kalat
type: Concept
References: URN:NBN:fi:au:ykl:58.062
References: Akvaariot
References: Kalastus
type: YKL-luokka
alternative label: Fiskar, zoologi (58.14) @sv
alternative label: Iktyologi (58.14) @sv
alternative label: Iktyologia (58.14)
alternative label: Kalat, eläintiede (58.14)
alternative label: Kalatiede (58.14)
broader: Selkärankaiset
in scheme: YKL - Yleisten kirjastojen luokitusjärjestelmä
notation: 58.14
preferred label: Fishes @en
preferred label: Fiskar @sv
scope note: Hit systematisk zoologi för fiskar, deras anatomi, fysiologi, morfologi, ekologi, etologi och djurgeografi Hit också handböcker för artbestämning som behandlar fiskar @sv
scope note: Tähän kaloja koskeva systemaattinen eläintiede, anatomia, fysiologia, morfologia, ekologia, etologia ja eläinmaantiede Tähän myös kaloja koskevat lajinmääritysoppaat

Selkärangattomat
type: Concept
References: Yleinen mikrobiologia
type: YKL-luokka
alternative label: Bläckfiskar (58.2) @sv
alternative label: Djurplankton (58.2) @sv
alternative label: Eläinplankton (58.2)
alternative label: Hämähäkit (58.2)
alternative label: Katkaravut, eläintiede (58.2)
alternative label: Kavitetsdjur (58.2) @sv
alternative label: Koralldjur (58.2) @sv
alternative label: Korallieläimet (58.2)
alternative label: Kotilot (58.2)
alternative label: Kräftdjur (58.2) @sv
alternative label: Kräftor, zoologi (58.2) @sv
alternative label: Kvalster, zoologi (58.2) @sv
alternative label: Leddjur (58.2+) @sv
alternative label: Madot (58.2)
alternative label: Manteldjur (58.2) @sv
alternative label: Maskar (58.2) @sv
alternative label: Medusor (58.2) @sv
alternative label: Meduusat (58.2)
alternative label: Mollusker (58.2) @sv
alternative label: Musslor, zoologi (58.2) @sv
alternative label: Mustekalat (58.2)
alternative label: Nilviäiset (58.2)
alternative label: Niveljalkaiset (58.2+)
alternative label: Onteloeläimet (58.2)
alternative label: Osterit, eläintiede (58.2)
alternative label: Ostron, zoologi (58.2) @sv
alternative label: Piikkinahkaiset (58.2)
alternative label: Planktondjur (58.2) @sv
alternative label: Planktoneläimet (58.2)
alternative label: Punkit, eläintiede (58.2)
alternative label: Ravut, eläintiede (58.2)
alternative label: Ryggradslösa djur (58.2+) @sv
alternative label: Räkor, zoologi (58.2) @sv
alternative label: Selkärangattomat (58.2+)
alternative label: Sienieläimet (58.2)
alternative label: Simpukat, eläintiede (58.2)
alternative label: Skorpioner (58.2) @sv
alternative label: Skorpionit (58.2)
alternative label: Snäckor (58.2) @sv
alternative label: Spindlar (58.2) @sv
alternative label: Svampdjur (58.2) @sv
alternative label: Tagghudingar (58.2) @sv
alternative label: Vaippaeläimet (58.2)
alternative label: Äyriäiset (58.2)
broader: ELÄINTIEDE
in scheme: YKL - Yleisten kirjastojen luokitusjärjestelmä
narrower: Hyönteiset
notation: 58.2
preferred label: Invertebrates @en
preferred label: Ryggradslösa djur @sv
scope note: Sienieläimet. Onteloeläimet. Madot. Piikkinahkaiset Nilviäiset. Niveljalkaiset. Hämähäkkieläimet Tähän selkärangattomia koskeva systemaattinen eläintiede, anatomia, fysiologia, morfologia, ekologia, etologia ja eläinmaantiede Tähän myös selkärangattomia koskevat lajinmääritysoppaat Hyönteiset 58.21
scope note: Svampdjur. Kavitetsdjur. Maskar. Tagghudingar Blötdjur. Ledfotingar. Spindeldjur Hit systematisk zoologi för ryggradslösa djur, deras anatomi, fysiologi, morfologi, ekologi, etologi och djurgeografi Hit också handböcker för artbestämning som behandlar ryggradslösa djur Insekter 58.21 @sv

Hyönteiset
type: Concept
References: Selkärangattomat
References: Sosiaalilääketiede. Ympäristölääketiede
References: Kasvinsuojelu
References: Mehiläisten hoito. Hyönteisten kasvatus
References: Metsänhoito
type: YKL-luokka
alternative label: Bin, entomologi (58.21) @sv
alternative label: Binas språk (58.21) @sv
alternative label: Entomologi (58.21) @sv
alternative label: Entomologia (58.21)
alternative label: Fjärilar (58.21) @sv
alternative label: Fjärilar, samlande (58.21) @sv
alternative label: Hyönteiset (58.21)
alternative label: Hyönteiset, keräily (58.21)
alternative label: Hyönteishotellit (58.21)
alternative label: Hyönteistiede (58.21)
alternative label: Insekter (58.21) @sv
alternative label: Insekter, samlande (58.21) @sv
alternative label: Insektshotell (58.21) @sv
alternative label: Kackerlackor, entomologi (58.21) @sv
alternative label: Kirput, hyönteistiede (58.21)
alternative label: Koit, hyönteistiede (58.21)
alternative label: Lepidopterologi (58.21) @sv
alternative label: Lepidopterologia (58.21)
alternative label: Loppor, entomologi (58.21) @sv
alternative label: Luteet, hyönteistiede (58.21)
alternative label: Löss, entomologi (58.21) @sv
alternative label: Malar, entomologi (58.21) @sv
alternative label: Mehiläiset, hyönteistiede (58.21)
alternative label: Mehiläisten kieli (58.21)
alternative label: Perhoset (58.21)
alternative label: Perhoset, keräily (58.21)
alternative label: Skinnbaggar, entomologi (58.21) @sv
alternative label: Torakat, hyönteistiede (58.21)
alternative label: Täit, hyönteistiede (58.21)
broader: Selkärangattomat
in scheme: YKL - Yleisten kirjastojen luokitusjärjestelmä
notation: 58.21
preferred label: Insects @en
preferred label: Insekter @sv
scope note: Hit systematisk zoologi för insekter, deras anatomi, fysiologi, morfologi, ekologi, etologi och djurgeografi Hit också handböcker för artbestämning som behandlar insekter @sv
scope note: Tähän hyönteisiä koskeva systemaattinen eläintiede, anatomia, fysiologia, morfologia, ekologia, etologia ja eläinmaantiede Tähän myös hyönteisiä koskevat lajinmääritysoppaat

Eläinanatomia. Eläinfysiologia. Eläinmorfologia
type: Concept
References: BIOLOGIA
References: Lääketieteellinen biologia
alternative label: Aineenvaihdunta, eläimet, yl. (58.8)
alternative label: Aistinfysiologia, eläimet, yl. (58.8)
alternative label: Aistit, eläimet, yl. (58.8)
alternative label: Aivot, eläimet, yl. (58.8)
alternative label: Anatomi, djur (58.8) @sv
alternative label: Anatomia, eläimet (58.8)
alternative label: Andningsorgan, djur (58.8) @sv
alternative label: Biofysiikka, eläimet (58.8)
alternative label: Biokemia, eläinfysiologia (58.8)
alternative label: Biomekaniikka, eläimet (58.8)
alternative label: Biorytmiikka, eläimet (58.8)
alternative label: Elimet, eläimet (58.8)
alternative label: Elinoppi, eläimet (58.8)
alternative label: Eläinanatomia (58.8)
alternative label: Eläinfysiologia (58.8)
alternative label: Eläinhistologia (58.8)
alternative label: Eläinmorfologia (58.8)
alternative label: Eläinorganologia (58.8)
alternative label: Eläinsytologia (58.8)
alternative label: Embryologia, eläimet (58.8)
alternative label: Fysiologia, eläimet (58.8)
alternative label: Fysiologiset rytmit, eläimet (58.8)
alternative label: Hajuaisti, eläimet (58.8)
alternative label: Hampaat, eläimet (58.8)
alternative label: Hengityselimet, eläimet (58.8)
alternative label: Hermosto, eläimet (58.8)
alternative label: Histologia, eläimet (58.8)
alternative label: Hormonit, eläimet (58.8)
alternative label: Imusuonisto, eläimet (58.8)
alternative label: Kasvaminen, eläimet (58.8)
alternative label: Keskushermosto, eläimet (58.8)
alternative label: Keuhkot, eläimet (58.8)
alternative label: Korva, eläimet (58.8)
alternative label: Kronobiologia, eläimet (58.8)
alternative label: Kudosoppi, eläimet (58.8)
alternative label: Kuonaneritys, eläimet (58.8)
alternative label: Kuuloaisti, eläimet (58.8)
alternative label: Liikuntaelimet, eläimet (58.8)
alternative label: Lisääntyminen, eläimet (58.8)
alternative label: Luusto, eläimet (58.8)
alternative label: Lämmönsäätely, eläimet (58.8)
alternative label: Mahalaukku, eläimet (58.8)
alternative label: Maksa, eläimet (58.8)
alternative label: Morfologia, eläimet (58.8)
alternative label: Munuaiset, eläimet (58.8)
alternative label: Muoto-oppi, eläimet (58.8)
alternative label: Neurofysiologia, eläimet (58.8)
alternative label: Näköaisti, eläimet (58.8)
alternative label: Ontogenia, eläimet (58.8)
alternative label: Organologia, eläimet (58.8)
alternative label: Ravintofysiologia, eläimet (58.8)
alternative label: Ruoansulatus, eläimet (58.8)
alternative label: Ruoansulatuselimet, eläimet (58.8)
alternative label: Seksuaalisuus, eläimet (58.8)
alternative label: Sikiönkehitys, eläimet (58.8)
alternative label: Silmä, eläimet (58.8)
alternative label: Sisäelimet, eläimet (58.8)
alternative label: Sisäeritys, eläimet (58.8)
alternative label: Solut, eläimet (58.8)
alternative label: Somatologia, eläimet (58.8)
alternative label: Sukupuolielimet, eläimet (58.8)
alternative label: Sukupuolisuus, eläimet (58.8)
alternative label: Suolisto, eläimet (58.8)
alternative label: Sydän, eläimet (58.8)
alternative label: Sytologia, eläimet (58.8)
alternative label: Tasapainoelin, eläimet (58.8)
alternative label: Vanheneminen, eläimet (58.8)
alternative label: Verenkierto, eläimet (58.8)
alternative label: Veri, eläimet (58.8)
alternative label: Virtsa, eläimet (58.8)
alternative label: Virtsaelimet, eläimet (58.8)
alternative label: Yksilönkehitys, eläimet (58.8)
broader: ELÄINTIEDE
in scheme: YKL - Yleisten kirjastojen luokitusjärjestelmä
notation: 58.8
scope note: Hit allmänna verk om djuranatomi, djurfysiologi och djurmorfologi Hit också allmänna verk om djurens cytologi, histologi, organologi, embryologi och ontogeni En enskild djurgrupps anatomi, fysiologi och morfologi förs till den ifrågavarande djurgruppens klass @sv
scope note: Tähän eläinanatomian, eläinfysiologian ja eläinmorfologian yleisteokset Tähän myös eläinten sytologian, histologian, organologian, embryologian ja ontogenian yleisteokset Tietyn eläinryhmän anatomia, fysiologia ja morfologia luokitetaan ko. eläinryhmän luokkaan

Eläinten elintavat
type: Concept
References: Ympäristönsuojelu. Luonnonsuojelu
References: Biologinen antropologia
References: Ekologia. Eliömaantiede
References: Kasviekologia. Kasvimaantiede
alternative label: Aggressio, etologia, yl. (58.9)
alternative label: Aggression, etologi, allm. (58.9) @sv
alternative label: Atrapit, etologia (58.9)
alternative label: Attrapper, etologi (58.9) @sv
alternative label: Betingade reflexer, etologi (58.9) @sv
alternative label: Betingning, etologi (58.9) @sv
alternative label: Biogeografi, djur (58.9) @sv
alternative label: Bon, djur (58.9) @sv
alternative label: Djur, beteende (58.9) @sv
alternative label: Djur, bon och ungar (58.9) @sv
alternative label: Djur, ekologi (58.9) @sv
alternative label: Djur, levnadsvanor (58.9) @sv
alternative label: Djur, utbredning (58.9) @sv
alternative label: Djurekologi (58.9) @sv
alternative label: Djurgeografi (58.9) @sv
alternative label: Djurpsykologi (58.9) @sv
alternative label: Djursociologi (58.9) @sv
alternative label: Doft, etologi (58.9) @sv
alternative label: Drifter, djur (58.9) @sv
alternative label: Ehdolliset refleksit, etologia (58.9)
alternative label: Ehdollistaminen, etologia (58.9)
alternative label: Ekologi, djur (58.9) @sv
alternative label: Ekologia, eläimet (58.9)
alternative label: Eliömaantiede, eläimet (58.9)
alternative label: Eläimet, ekologia (58.9)
alternative label: Eläimet, elintavat (58.9)
alternative label: Eläimet, käyttäytyminen (58.9)
alternative label: Eläimet, levinneisyys (58.9)
alternative label: Eläimet, pesät ja poikaset (58.9)
alternative label: Eläimistöt (58.9)
alternative label: Eläinekologia (58.9)
alternative label: Eläinmaantiede (58.9)
alternative label: Eläinpsykologia (58.9)
alternative label: Eläinsosiologia (58.9)
alternative label: Energiaekologia, eläimet (58.9)
alternative label: Energiekologi, djur (58.9) @sv
alternative label: Etologi, djurens beteende (58.9) @sv
alternative label: Etologia, eläinten käyttäytyminen (58.9)
alternative label: Faunor (58.9) @sv
alternative label: Främmande arter, djurekologi (58.9) @sv
alternative label: Försvarsmetoder, djur (58.9) @sv
alternative label: Geografi, djurgeografi (58.9) @sv
alternative label: Inlärning, djurs beteende (58.9) @sv
alternative label: Instinkter, djur (58.9) @sv
alternative label: Loiset, eläintiede (58.9)
alternative label: Maantiede, eläinmaantiede (58.9)
alternative label: Nya arter, djurekologi (58.9) @sv
alternative label: Oppiminen, eläinten käyttäytyminen (58.9)
alternative label: Parasiter, zoologi (58.9) @sv
alternative label: Parasitism, djurekologi (58.9) @sv
alternative label: Parasitismi, eläinekologia (58.9)
alternative label: Parasitologi, zoologi (58.9) @sv
alternative label: Parasitologia, eläintiede (58.9)
alternative label: Parbildning, djurens beteende (58.9) @sv
alternative label: Parinmuodostus, eläinten käyttäytyminen (58.9)
alternative label: Pesät, eläimet (58.9)
alternative label: Poikaset, eläimet (58.9)
alternative label: Populaatioekologia, eläimet (58.9)
alternative label: Puolustautumiskeinot, eläimet (58.9)
alternative label: Reviirit, eläimet (58.9)
alternative label: Signaalit, etologia (58.9)
alternative label: Suojautumiskeinot, eläimet (58.9)
alternative label: Suojavärit, eläimet (58.9)
alternative label: Symbioosi, eläinekologia (58.9)
alternative label: Tulokaslajit, eläinekologia (58.9)
alternative label: Tuoksu, etologia (58.9)
alternative label: Vaistot, eläimet (58.9)
alternative label: Vieraslajit, eläinekologia (58.9)
alternative label: Vietit, eläimet (58.9)
alternative label: Vuodenajat, eläinekologia (58.9)
broader: ELÄINTIEDE
in scheme: YKL - Yleisten kirjastojen luokitusjärjestelmä
notation: 58.9
scope note: Hit allmänna verk om djurens beteende Hit också allmänna verk om djurekologi, djursociologi, djurens beteende och djurgeografi Djurens förhållande till omgivningen Djurens populations- och energiekologi Årstidernas inverkan på faunan Etologi. Djurpsykologi. Instinkter. Inlärt beteende Skyddsmetoder. Försvarsmetoder Parbildning. Bobygge. Vård av avkomman Djurens utbredning. Djurgeografiska områden Hit också allmänna verk som beskriver faunan i olika livsmiljöer eller inom olika djurgeografiska områden och som inte är avsedda som handböcker för artbestämning En viss djurgrupps beteende, ekologi, etologi eller djurgeografi klassificeras enligt djurgrupp @sv
scope note: Tähän eläinten elintapoja koskevat yleisteokset Tähän myös eläinekologian, eläinsosiologian, eläinten käyttäytymisen ja eläinmaantieteen yleisteokset Eläinten suhde ympäristöönsä Eläinten populaatio- ja energiaekologia Vuodenaikojen vaikutukset eläimistöön Etologia. Eläinpsykologia Vaistotoiminnat. Opittu käyttäytyminen Suojautumiskeinot. Puolustuskeinot Parinmuodostus. Pesänrakennus. Jälkeläisten hoito Eläinten levinneisyys. Eläinmaantieteelliset alueet Tähän myös eri elinympäristöjen tai eläinmaantieteellisten alueiden eläimistöä kuvailevat yleisteokset, joita ei ole tarkoitettu lajinmääritysoppaiksi Tietyn eläinryhmän elintavat, ekologia, etologia tai eläinmaantiede luokitetaan ko. eläinryhmän luokkaan

LÄÄKETIEDE. TERVEYDENHOITO
type: Concept
References: URN:NBN:fi:au:ykl:59.2101
References: Eläinlääketiede
type: YKL-luokka
alternative label: Assisterat död (59+)
alternative label: Avustettu kuolema (59+)
alternative label: Biologiset tieteet, lääketiede (59+)
alternative label: Biologiska vetenskaper, medicin (59+) @sv
alternative label: Döden, eutanasi (59+) @sv
alternative label: Dödshjälp (59+) @sv
alternative label: Eutanasi (59+) @sv
alternative label: Eutanasia (59+)
alternative label: Fysiikka, lääketieteellinen (59+)
alternative label: Fysik, medicinsk (59+) @sv
alternative label: Kemi, medicinsk (59+) @sv
alternative label: Kemia, lääketieteellinen (59+)
alternative label: Kuolema, eutanasia (59+)
alternative label: Kuolinapu (59+)
alternative label: Läkarböcker, allm. (59) @sv
alternative label: Lääketiede (59+)
alternative label: Lääketieteellinen fysiikka (59+)
alternative label: Lääketieteellinen kemia (59+)
alternative label: Lääkärikirjat, yl. (59)
alternative label: Medicin (59+) @sv
alternative label: Medicinsk fysik (59+) @sv
alternative label: Medicinsk kemi (59+) @sv
alternative label: Medikalisaatio (59+)
alternative label: Medikalisering (59+) @sv
alternative label: Salassapitovelvollisuus, lääketieteen etiikka (59+)
alternative label: Sekretess, medicinens etik (59+) @sv
alternative label: Telelääketiede (59+)
alternative label: Telemedicin (59+) @sv
alternative label: Tystnadsplikt, medicinens etik (59+) @sv
alternative label: Vaitiolovelvollisuus, lääketieteen etiikka (59+)
alternative label: WHO (59+)
broader: LUONNONTIETEET. MATEMATIIKKA. LÄÄKETIEDE
in scheme: YKL - Yleisten kirjastojen luokitusjärjestelmä
narrower: Lääketieteellinen biologia
narrower: Yleinen terveydenhoito
narrower: Henkilökohtainen terveydenhoito
narrower: Hoitomenetelmät
narrower: Elimet. Taudit
narrower: Lasten terveydenhoito. Lastentaudit
narrower: Vanhusten terveydenhoito. Vanhusten taudit
narrower: Hammaslääketiede
notation: 59
preferred label: MEDICIN. HÄLSOVÅRD @sv
preferred label: MEDICINE. HEALTH CARE @en
scope note: Hit allmänna verk om medicin och allmänna läkarböcker. Memoarer och biografier, där det väsentliga innehållet utgörs av en enskild behandlingsmetod, sjukdom eller livet som patient, förs till klasserna för medicin och hälsovård. Medicinens filosofi och etik samt eutanasi 59.01 @sv
scope note: Tähän lääketieteen yleisteokset ja yleiset lääkärikirjat. Lääketieteen ja terveydenhoidon luokkiin sijoitetaan myös muistelmat ja elämäkerrat, joissa potilaana olo, tietty hoitomuoto tai sairaus on teoksen keskeinen sisältö. Lääketieteen yleinen filosofia ja etiikka sekä eutanasia 59.01

Lääketieteellinen biologia
type: Concept
References: Eläinsuojelu
References: BIOLOGIA
References: Elimet. Taudit
References: Raskaus. Sikiönkehitys. Synnytys
References: Lasten terveydenhoito. Lastentaudit
References: Vanhusten terveydenhoito. Vanhusten taudit
type: YKL-luokka
alternative label: Allmän biologi, människan (59.1+) @sv
alternative label: Biofysiikka, ihminen (59.1+)
alternative label: Biofysik, människan (59.1+) @sv
alternative label: Bioinformatiikka, lääketeide (59.1+)
alternative label: Bioinformatik, medicin (59.1+) @sv
alternative label: Biologi, medicinsk (59.1+) @sv
alternative label: Biologi, människan (59.1+) @sv
alternative label: Biologia, ihminen (59.1+)
alternative label: Biologia, lääketieteellinen (59.1+)
alternative label: Biomekaniikka, ihminen (59.1+)
alternative label: Biomekanik, människan (59.1+) @sv
alternative label: Biostatistiikka, lääketiede (59.1+)
alternative label: Biostatistik, medicin (59.1+) @sv
alternative label: Djurförsök, medicin (59.1+) @sv
alternative label: Eläinkokeet, lääketiede (59.1+)
alternative label: Försöksdjur, medicin (59.1+) @sv
alternative label: Individutveckling, människan (59.1+) @sv
alternative label: Koe-eläimet, lääketiede (59.1+)
alternative label: Lääketieteellinen biologia (59.1+)
alternative label: Medicinsk biologi (59.1+) @sv
alternative label: Molekylärmedicin (59.1+) @sv
alternative label: Molekyylilääketiede (59.1+)
alternative label: Ontogeni, människan (59.1+) @sv
alternative label: Ontogenia, ihminen (59.1+)
alternative label: Yksilönkehitys, ihminen (59.1+)
alternative label: Yleisbiologia, ihminen (59.1+)
alternative label: biolääketiede (59.1+)
alternative label: biomedicin (59.1+) @sv
broader: LÄÄKETIEDE. TERVEYDENHOITO
in scheme: YKL - Yleisten kirjastojen luokitusjärjestelmä
narrower: Ihmisen anatomia
narrower: Ihmisen fysiologia
narrower: Lääketieteellinen mikrobiologia. Immunologia
notation: 59.1
preferred label: Medical biology @en
preferred label: Medicinsk biologi @sv
scope note: Hit allmänna verk om biologisk grundforskning inom medicinen. Hit och till underklasserna människans allmänna biologi samt allmänna verk om människans individutveckling. Medicinsk grundforskning inom specialområden klassificeras enligt område. Användning av försöksdjur inom medicinsk forskning i allmänhet 59.101 @sv
scope note: Tähän lääketieteen biologista perustutkimusta koskevat yleisteokset. Tähän ja alaluokkiin ihmisen yleisbiologia sekä ihmisen yksilönkehitystä koskevat yleisteokset. Erikoisalojen lääketieteellinen perustutkimus luokitetaan alan mukaan. Koe-eläinten käyttö lääketieteellisessä tutkimuksessa yleensä 59.101

Ihmisen anatomia
type: Concept
References: Eläinanatomia. Eläinfysiologia. Eläinmorfologia
type: YKL-luokka
alternative label: Anatomi, medicinsk (59.11) @sv
alternative label: Anatomi, människan (59.11) @sv
alternative label: Anatomia, ihminen (59.11)
alternative label: Anatomia, lääketieteellinen (59.11)
alternative label: Celler, människan (59.11) @sv
alternative label: Cytologi, människan (59.11) @sv
alternative label: Elimet, ihminen (59.11)
alternative label: Elinoppi, ihminen (59.11)
alternative label: Formlära, människan (59.11) @sv
alternative label: Histologi, människan (59.11) @sv
alternative label: Histologia, ihminen (59.11)
alternative label: Ihminen, anatomia (59.11)
alternative label: Kudosoppi, ihminen (59.11)
alternative label: Lääketieteellinen anatomia (59.11)
alternative label: Medicinsk anatomi (59.11) @sv
alternative label: Morfologi, människan (59.11) @sv
alternative label: Morfologia, ihminen (59.11)
alternative label: Muoto-oppi, ihminen (59.11)
alternative label: Människan, anatomi (59.11) @sv
alternative label: Obduktion, anatomisk forskning (59.11) @sv
alternative label: Organ, människan (59.11) @sv
alternative label: Organlära, människan (59.11) @sv
alternative label: Organologi, människan (59.11) @sv
alternative label: Organologia, ihminen (59.11)
alternative label: Ruumiinavaus, anatomian tutkimus (59.11)
alternative label: Solut, ihminen (59.11)
alternative label: Somatologi, människan (59.11) @sv
alternative label: Somatologia, ihminen (59.11)
alternative label: Sytologia, ihminen (59.11)
broader: Lääketieteellinen biologia
in scheme: YKL - Yleisten kirjastojen luokitusjärjestelmä
notation: 59.11
preferred label: Human anatomy @en
preferred label: Människans anatomi @sv
scope note: Hit allmänna verk om människans anatomi, cytologi och histologi Ett enskilt organs anatomi, cytologi, histologi och organologi förs till ifrågavarande organs eller organgrupps klass 59.5+ @sv
scope note: Tähän yleisteokset ihmisen anatomiasta, sytologiasta, ja histologiasta Tiettyyn elimeen liittyvä anatomia, sytologia, histologia ja organologia luokitetaan ko. elimen tai elinryhmän luokkaan 59.5+

Ihmisen fysiologia
type: Concept
References: Eläinanatomia. Eläinfysiologia. Eläinmorfologia
References: Lääketieteellinen mikrobiologia. Immunologia
References: Ravinto-oppi. Ruokavaliot
References: Sisäeritysrauhaset. Aineenvaihduntataudit
type: YKL-luokka
alternative label: Aineenvaihdunta, ihminen, yl. (59.12)
alternative label: Biokemi, medicinsk (59.12) @sv
alternative label: Biokemi, människans fysiologi (59.12) @sv
alternative label: Biokemia, ihmisen fysiologia (59.12)
alternative label: Biokemia, lääketieteellinen (59.12)
alternative label: Biorytmiikka, ihmisen fysiologia (59.12)
alternative label: Biorytmik, människans fysiologi (59.12) @sv
alternative label: Döden, människans fysiologi (59.12) @sv
alternative label: Entsyymit, ihmisen fysiologia (59.12)
alternative label: Enzymer, människans fysiologi (59.12) @sv
alternative label: Fysiologi, medicin (59.12) @sv
alternative label: Fysiologi, människan (59.12) @sv
alternative label: Fysiologia, ihminen (59.12)
alternative label: Fysiologia, lääketiede (59.12)
alternative label: Fysiologiset rytmit, ihminen (59.12)
alternative label: Fysiologiska rytmer, människan (59.12) @sv
alternative label: Homeostas, människans fysiologi (59.12) @sv
alternative label: Homeostasia, ihmisen fysiologia (59.12)
alternative label: Ihminen, fysiologia (59.12)
alternative label: Kronobiologi, människan (59.12) @sv
alternative label: Kronobiologia, ihminen (59.12)
alternative label: Kuolema, ihmisen fysiologia (59.12)
alternative label: Kuonaneritys, ihminen (59.12)
alternative label: Lämmönsäätely, ihmisen fysiologia (59.12)
alternative label: Lääketieteellinen biokemia (59.12)
alternative label: Lääketieteellinen fysiologia (59.12)
alternative label: Medicinsk biokemi (59.12) @sv
alternative label: Medicinsk fysiologi (59.12) @sv
alternative label: Människan, fysiologi (59.12) @sv
alternative label: Slaggutsöndring, människan (59.12) @sv
alternative label: Temperaturreglering, människans fysiologi (59.12) @sv
alternative label: Ämnesomsättning, människan, allm. (59.12) @sv
broader: Lääketieteellinen biologia
in scheme: YKL - Yleisten kirjastojen luokitusjärjestelmä
notation: 59.12
preferred label: Human physiology @en
preferred label: Människans fysiologi @sv
scope note: Hit allmänna verk om människans fysiologi och ämnesomsättning allmänna verk om medicinsk fysiologi och biokemi Hit också människans biorytmer och kronobiologi Ett enskilt organs fysiologi och ämnesomsättning förs till ifrågavarande organs eller organgrupps klass 59.5+ @sv
scope note: Tähän yleisteokset ihmisen fysiologiasta ja aineenvaihdunnasta sekä lääketieteellisestä fysiologiasta ja biokemiasta Tähän myös ihmisen biorytmit ja kronobiologia Tiettyyn elimeen liittyvä fysiologia ja aineenvaihdunta luokitetaan ko. elimen tai elinryhmän luokkaan 59.5+

Lääketieteellinen mikrobiologia. Immunologia
type: Concept
modified: 2026-05-08T07:56:08
References: Yleinen mikrobiologia
References: ELÄINTIEDE
References: Sosiaalilääketiede. Ympäristölääketiede
References: Hoitomenetelmät
References: Tartuntataudit
References: Veri. Veritaudit. Verenkiertoelimet. Verenkiertoelinten taudit
References: Elintarviketeollisuus
References: Biotekniikka
type: YKL-luokka
alternative label: Antikroppar, immunologi (59.13) @sv
alternative label: Autoimmuna sjukdomar, immunologi (59.13) @sv
alternative label: Autoimmuunisairaudet, immunologia (59.13)
alternative label: Autoimmuunitaudit, immunologia (59.13)
alternative label: Bakteerioppi, lääketiede (59.13)
alternative label: Bakteerit, lääketiede (59.13)
alternative label: Bakterier, medicin (59.13) @sv
alternative label: Bakteriologi, medicin (59.13) @sv
alternative label: Bakteriologia, lääketiede (59.13)
alternative label: Immunologi (59.13) @sv
alternative label: Immunologia (59.13)
alternative label: Immunoterapi (59.13) @sv
alternative label: Immunoterapia (59.13)
alternative label: Immunsystem (59.13) @sv
alternative label: Immuunijärjestelmä (59.13)
alternative label: Immuunipuolustus (59.13)
alternative label: Loiset, lääketiede (59.13)
alternative label: Lääketieteellinen bakteriologia (59.13)
alternative label: Lääketieteellinen mikrobiologia (59.13)
alternative label: Lääketieteellinen parasitologia (59.13)
alternative label: Lääketieteellinen virologia (59.13)
alternative label: Medicinsk bakteriologi (59.13) @sv
alternative label: Medicinsk mikrobiologi (59.13) @sv
alternative label: Medicinsk parasitologi (59.13) @sv
alternative label: Medicinsk virologi (59.13) @sv
alternative label: Mikro-organismit, lääketiede (59.13)
alternative label: Mikrober, medicin (59.13) @sv
alternative label: Mikrobiologi, medicin (59.13) @sv
alternative label: Mikrobiologia, lääketiede (59.13)
alternative label: Mikrobit, lääketiede (59.13)
alternative label: Mikroorganismer, medicin (59.13) @sv
alternative label: Motståndskraft (59.13) @sv
alternative label: Parasiter, medicin (59.13) @sv
alternative label: Parasitologi, medicin (59.13) @sv
alternative label: Parasitologia, lääketiede (59.13)
alternative label: Rokotteet (59.13)
alternative label: Rokotukset (59.13)
alternative label: Rokotus (59.13)
alternative label: Seerumihoito (59.13)
alternative label: Seerumioppi (59.13)
alternative label: Serologi (59.13) @sv
alternative label: Serologia (59.13)
alternative label: Serumbehandling (59.13) @sv
alternative label: Vaccin (59.13) @sv
alternative label: Vaccinering (59.13) @sv
alternative label: Vaccineringar (59.13) @sv
alternative label: Vasta-aineet (59.13)
alternative label: Vastustuskyky (59.13)
alternative label: Virologi, medicin (59.13) @sv
alternative label: Virologia, lääketiede (59.13)
alternative label: Virukset, lääketiede (59.13)
alternative label: Virus, medicin (59.13) @sv
broader: Lääketieteellinen biologia
in scheme: YKL - Yleisten kirjastojen luokitusjärjestelmä
notation: 59.13
preferred label: Medical microbiology. Immunology @en
preferred label: Medicinsk mikrobiologi. Immunologi @sv
scope note: Hit allmänna verk om medicinsk bakteriologi, virologi och parasitologi Hit också allmänna verk om immunologi och serologi Motståndskraft. Antikroppar Immunterapi. Vaccineringar. Serumbehandling Sjukdomsalstrare, motståndskraft och immunterapi som ansluter sig till någon bestämd sjukdom, förs till den ifrågavarande sjukdomens klass 59.5+ @sv
scope note: Tähän lääketieteellisen bakteriologian, virologian ja parasitologian yleisteokset Tähän myös immunologian ja serologian yleisteokset Vastustuskyky. Vasta-aineet Immunoterapia. Rokotukset. Seerumihoito Tiettyyn sairauteen liittyvät taudinaiheuttajat, vastustuskyky ja immunoterapia luokitetaan ko. sairauden luokkaan 59.5+

Yleinen terveydenhoito
type: Concept
References: Sosiaalioikeus
References: SOSIAALIPOLITIIKKA
References: Tartuntataudit
type: YKL-luokka
alternative label: Avohoito, sairaanhoito (59.2+)
alternative label: Avosairaanhoito (59.2+)
alternative label: Ekonomisk kunskap i hälsovård (59.2+) @sv
alternative label: Epidemiologi (59.2) @sv
alternative label: Epidemiologia (59.2)
alternative label: Erikoissairaanhoito, sairaanhoitopalvelut (59.2)
alternative label: Folkhälsa (59.2+) @sv
alternative label: Folkhälsovetenskap (59.2+) @sv
alternative label: Folkhälsovetenskap, hälsopolitik (59.2+) @sv
alternative label: Fältmedicin (59.3) @sv
alternative label: Försäkringsmedicin (59.2) @sv
alternative label: Hemvård, sjukvård (59.2+) @sv
alternative label: Hälsa, folkhälsa (59.2) @sv
alternative label: Hälso- och sjukvård (59.2+) @sv
alternative label: Hälsofrämjande (59.2+) @sv
alternative label: Hälsopolitik (59.2+) @sv
alternative label: Hälsopsykologi (59.2) @sv
alternative label: Hälsovård (59.2+) @sv
alternative label: Hälsovårdstjänster (59.2+) @sv
alternative label: Incidens (59.2+) @sv
alternative label: Institutionsvård, sjukvård (59.2+) @sv
alternative label: Kansanterveys (59.2+)
alternative label: Kansanterveystiede (59.2+)
alternative label: Kansanterveystyö, terveyspolitiikka (59.2+)
alternative label: Kenttälääkintä (59.2)
alternative label: Kommunal hälsovård (59.2+) @sv
alternative label: Kotihoito, sairaanhoito (59.2+)
alternative label: Kunnallinen terveydenhuolto (59.2+)
alternative label: Laitoshoito, sairaanhoito (59.2+)
alternative label: Lääkintäjoukot (59.2)
alternative label: Militärmedicin (59.2+) @sv
alternative label: Närståendevård av sjuka (59.2+) @sv
alternative label: Omaishoito, sairaiden (59.2+)
alternative label: Palvelut, terveyspalvelut (59.2+)
alternative label: Saavutettavuus, terveyspalvelut (59.2+)
alternative label: Sairaanhoitopalvelut (59.2+)
alternative label: Sairastavuus (59.2+)
alternative label: Service, hälsovårdstjänster (59.2+) @sv
alternative label: Sjukvårdstjänster (59.2+) @sv
alternative label: Sjukvårdstrupper (59.2) @sv
alternative label: Sotalääketiede (59.2+)
alternative label: Sotilaslääketiede (59.2+)
alternative label: Specialsjukvård, hälsovårdstjänster (59.2) @sv
alternative label: Terveyden edistäminen (59.2+)
alternative label: Terveydenhoito (59.2+)
alternative label: Terveydenhuolto (59.2+)
alternative label: Terveys, kansanterveys (59.2)
alternative label: Terveyspalvelut (59.2+)
alternative label: Terveyspolitiikka (59.2+)
alternative label: Terveyspsykologia (59.2)
alternative label: Terveystaloustieto (59.2+)
alternative label: Vakuutuslääketiede (59.2)
alternative label: Åtkomlighet, hälsovårdstjänster (59.2+) @sv
alternative label: Öppen sjukvård (59.2+) @sv
alternative label: Öppenvård, sjukvård (59.2+) @sv
broader: LÄÄKETIEDE. TERVEYDENHOITO
in scheme: YKL - Yleisten kirjastojen luokitusjärjestelmä
narrower: Hoitotiede. Hoitotyö. Hoitohenkilökunta
narrower: Hoitolaitokset
narrower: Tapaturmantorjunta. Ensiapu
narrower: Sosiaalilääketiede. Ympäristölääketiede
narrower: Oikeuslääketiede
narrower: Urheilulääketiede
notation: 59.2
preferred label: Allmän hälsovård @sv
preferred label: General health care @en
scope note: Hit och till underklasserna hälsopolitik, hälsoekonomi, administration och organisation av hälso- och sjukvård, offentliga och privata hälso- och sjukvårdstjänster och användningen av dem samt sjukdomar hos befolkningen i allmänhet Hit och till underklasserna också allmänna verk om öppen vård, hem- och institutionsvård Hit och till underklasserna också allmänt folkhälsoarbete och folkhälsovetenskap Hit och till underklasserna också militärmedicin i allmänhet Hit och till underklasserna också försäkringsmedicin Om verket innehåller både hälso- och socialpolitik, ges företräde åt klass 37+ Hälso- och sjukvård inom specialområden klassificeras enligt område Hälsovårdtjänsternas åtkomlighet @sv
scope note: Tähän ja alaluokkiin terveyspolitiikka ja terveystaloustiede sekä terveydenhuollon ja sairaanhoidon hallinto ja organisaatio yleensä Tähän ja alaluokkiin julkiset ja yksityiset terveyden- ja sairaanhoitopalvelut sekä niiden käyttö Tähän ja alaluokkiin epidemiologian yleisteokset sekä väestön sairastavuus ja terveydentila yleensä Tähän ja alaluokkiin yleinen kansanterveystyö ja kansanterveystiede Tähän ja alaluokkiin yleisteokset sairaiden avo-, koti- ja laitoshoidosta Tähän ja alaluokkiin myös sotilaslääketiede ja vakuutuslääketiede yleensä Jos teoksessa on sekä terveys- että sosiaalipolitiikkaa, annetaan etusija luokalle 37+ Erikoisalojen terveyden- ja sairaanhoito luokitetaan alan mukaan Terveyspalvelujen saavutettavuus

Hoitotiede. Hoitotyö. Hoitohenkilökunta
type: Concept
References: URN:NBN:fi:au:ykl:59.01
References: Hoitolaitokset
References: Hoitomenetelmät
References: Elimet. Taudit
References: Lasten terveydenhoito. Lastentaudit
References: Vanhusten terveydenhoito. Vanhusten taudit
type: YKL-luokka
alternative label: Erikoissairaanhoito, hoitotyö (59.21)
alternative label: Febelbehandling, vårdvetenskap (59.21) @sv
alternative label: Hoitohenkilökunta (59.21)
alternative label: Hoitosuhde, terveydenhuolto (59.21)
alternative label: Hoitotiede (59.21)
alternative label: Hoitotyö (59.21)
alternative label: Hoitotyön psykologia (59.21)
alternative label: Hoitovirheet, hoitotiede (59.21)
alternative label: Hoitoyhteisö, sairaalasosiologia (59.21)
alternative label: Hoivatyö, hoitotyö (59.21)
alternative label: Hälsovårdarens arbete (59.21) @sv
alternative label: Hälsovårdspersonal (59.21) @sv
alternative label: Lähihoitajan työ (59.21)
alternative label: Läkarens arbete (59.21) @sv
alternative label: Lääkärin työ (59.21)
alternative label: Närvårdarens arbete (59.21) @sv
alternative label: Omvårdnadsarbete, vårdarbete (59.21) @sv
alternative label: Patientens ställning, sjukvård (59.21) @sv
alternative label: Patientinformation (59.21) @sv
alternative label: Patientrådgivning (59.21) @sv
alternative label: Patientskador, vårdvetenskap (59.21) @sv
alternative label: Patientsäkerhet (59.21) @sv
alternative label: Perushoitajan työ (59.21)
alternative label: Potilaan asema, sairaanhoito (59.21)
alternative label: Potilaanohjaus (59.21)
alternative label: Potilasneuvonta (59.21)
alternative label: Potilasohjaus (59.21)
alternative label: Potilasturvallisuus (59.21)
alternative label: Potilasvahingot, hoitotiede (59.21)
alternative label: Primärskötarens arbete (59.21) @sv
alternative label: Sairaalapsykologia (59.21)
alternative label: Sairaalasosiologia (59.21)
alternative label: Sairaanhoitajan työ (59.21)
alternative label: Sairaanhoito (59.21)
alternative label: Sairaanhoitohenkilökunta (59.21)
alternative label: Sjukhuspsykologi (59.21) @sv
alternative label: Sjukhussociologi (59.21) @sv
alternative label: Sjukskötarens arbete (59.21) @sv
alternative label: Sjukvård (59.21) @sv
alternative label: Sjukvårdspersonal (59.21) @sv
alternative label: Specialsjukvård, vårdarbete (59.21) @sv
alternative label: Terveydenhoitajan työ (59.21)
alternative label: Terveydenhuoltohenkilöstö (59.21)
alternative label: Vårdarbete (59.21) @sv
alternative label: Vårdarbetets psykologi (59.21) @sv
alternative label: Vårdgemenskap, sjukhussociologi (59.21) @sv
alternative label: Vårdpersonal (59.21) @sv
alternative label: Vårdrelation, hälso- och sjukvård (59.21) @sv
alternative label: Vårdvetenskap (59.21) @sv
broader: Yleinen terveydenhoito
in scheme: YKL - Yleisten kirjastojen luokitusjärjestelmä
notation: 59.21
preferred label: Nursing science. Nursing work. Nursing staff @en
preferred label: Vårdvetenskap. Vårdarbete. Vårdpersonal @sv
scope note: Hit allmänna verk om läkarens, sjukskötarens, närvårdarens, primärskötarens eller hälsovårdarens arbete Hit också allmänna verk om vårdarbetets psykologi, sjukhuspsykologi och sjukhussociologi Hit också allmänna verk om patientens ställning i vårdgemenskapen Verk om värdvetenskap, vårdarbete och vårdpersonal inom specialområden klassificeras enligt område Läkarens och vårdarbetets etik i allmänhet 59.2101 @sv
scope note: Tähän lääkärin, sairaanhoitajan, lähihoitajan, perushoitajan tai terveydenhoitajan työtä koskevat yleisteokset Tähän myös hoitotyön psykologian sekä sairaalapsykologian ja sairaalasosiologian yleisteokset. Hoitoyhteisö yleensä Tähän myös yleisteokset potilaan asemasta hoitoyhteisössä Tähän ja alaluokkiin myös muistelmat ja elämäkerrat, joissa potilaana olo tai hoitoyhteisö on teoksen keskeinen sisältö Erikoisalojen hoitotiedettä, hoitotyötä ja hoito- henkilökuntaa koskevat teokset luokitetaan alan mukaan Lääkärin etiikka, hoitotyön etiikka 59.2101

Hoitolaitokset
type: Concept
References: Hoitotiede. Hoitotyö. Hoitohenkilökunta
References: Rakennukset. Rakennustyypit
type: YKL-luokka
alternative label: Fältsjukhus (59.22+) @sv
alternative label: Hoitolaitokset (59.22+)
alternative label: Hygien, sjukhus (59.22+) @sv
alternative label: Hygienia, sairaalat (59.22+)
alternative label: Hälsovårdscentraler (59.22+) @sv
alternative label: Kenttäsairaalat (59.22+)
alternative label: Klinikat (59.22+)
alternative label: Kliniker (59.22+) @sv
alternative label: Krigssjukhus (59.22+) @sv
alternative label: Kuntoutuslaitokset (59.22+)
alternative label: Läkarstationer (59.22+) @sv
alternative label: Lääkäriasemat (59.22+)
alternative label: Militärsjukhus (59.22+) @sv
alternative label: Parantolat (59.22+)
alternative label: Rehabiliteringsanstalter (59.22+) @sv
alternative label: Sairaalademokratia (59.22)
alternative label: Sairaalahallinto (59.22)
alternative label: Sairaalahygienia (59.22+)
alternative label: Sairaalalaitos (59.22+)
alternative label: Sairaalaorganisaatio (59.22)
alternative label: Sairaalat (59.22+)
alternative label: Sanatorier (59.22+) @sv
alternative label: Sjukhus (59.22+) @sv
alternative label: Sjukhusdemokrati (59.22) @sv
alternative label: Sjukhusförvaltning (59.22) @sv
alternative label: Sjukhushygien (59.22+) @sv
alternative label: Sjukhusorganisation (59.22) @sv
alternative label: Sjukhusväsen (59.22+) @sv
alternative label: Sotasairaalat (59.22+)
alternative label: Sotilassairaalat (59.22+)
alternative label: Terveyskeskukset (59.22+)
alternative label: Vårdinrättningar (59.22+) @sv
broader: Yleinen terveydenhoito
in scheme: YKL - Yleisten kirjastojen luokitusjärjestelmä
narrower: Sairaalatekniikka
notation: 59.22
preferred label: Care institutions @en
preferred label: Vårdanstalter @sv
scope note: Hit allmänna verk om vårdanstalter samt deras administration, organisation och verksamhet Hit sjukhus, kliniker, hälsocentraler, vårdanstalter, sanatorier, rehabiliteringsanstalter och läkarstationer i allmänhet Vårdanstalter för specialområden klassificeras enligt område @sv
scope note: Tähän yleisteokset hoitolaitoksista sekä niiden hallinnosta, organisaatiosta ja toiminnasta Tähän sairaalat, klinikat, terveyskeskukset, hoitolat, parantolat, kuntoutuslaitokset ja lääkäriasemat yleensä Erikoisalojen hoitolaitokset luokitetaan alan mukaan

Sairaalatekniikka
type: Concept
References: Hoitomenetelmät
References: Elimet. Taudit
References: Optiset ja lääketieteelliset laitteet
type: YKL-luokka
alternative label: Balsamering (59.221) @sv
alternative label: Bårhus (59.221) @sv
alternative label: Förvaring av döda, teknik (59.221) @sv
alternative label: Lääketieteelliset laitteet, sairaalatekniikka (59.221)
alternative label: Lääkintälaitteet (59.221)
alternative label: Medicinsk apparatur, sjukhusteknik (59.221) @sv
alternative label: Palsamointi (59.221)
alternative label: Ruumiin säilytystekniikka (59.221)
alternative label: Ruumishuoneet (59.221)
alternative label: Sairaalatekniikka (59.221)
alternative label: Sairaankuljetus, sairaalatekniikka (59.221)
alternative label: Sjukhusteknik (59.221) @sv
alternative label: Sjuktransport, sjukhusteknik (59.221) @sv
alternative label: Sjukvårdsapparatur (59.221) @sv
broader: Hoitolaitokset
in scheme: YKL - Yleisten kirjastojen luokitusjärjestelmä
notation: 59.221
preferred label: Hospital technology @en
preferred label: Sjukhusteknik @sv
scope note: Hit allmänna verk om teknisk utrustning på sjukhus och i övriga vårdanstalter Hit också bårhus och teknik för förvaring av avlidna, såsom balsamering Sjukhusteknik för specialområden klassificeras enligt område @sv
scope note: Tähän sairaaloiden ja muiden hoitolaitosten teknistä laitteistoa koskevat yleisteokset Tähän myös ruumishuoneet sekä ruumiin säilytystekniikat, kuten palsamointi Erikoisalojen sairaalatekniikka luokitetaan alan mukaan

Tapaturmantorjunta. Ensiapu
type: Concept
References: Palo- ja pelastustoimi
References: Työsuojelu. Ergonomia
References: Sosiaalilääketiede. Ympäristölääketiede
References: Työterveyshuolto. Opiskeluterveydenhuolto Kouluterveydenhoitajan työ
References: Kriisipsykologia. Katastrofipsykologia. Surutyö
alternative label: Akutvård, första hjälpen (59.23) @sv
alternative label: Akuuttihoito, ensiapu (59.23)
alternative label: Ambulanssitoiminta (59.23)
alternative label: Ambulansverksamhet (59.23) @sv
alternative label: Auto-onnettomuudet, ensiapu (59.23)
alternative label: Bilolyckor, första hjälpen (59.23) @sv
alternative label: Brandskador, första hjälpen (59.23) @sv
alternative label: Chocker, första hjälpen (59.23) @sv
alternative label: Drunkning, första hjälpen (59.23) @sv
alternative label: Elvytys, ensiapu (59.23)
alternative label: Ensiapu (59.23)
alternative label: Ensiapuasemat (59.23)
alternative label: Ensiapuoppaat (59.23)
alternative label: Ensiapuvälineet (59.23)
alternative label: Ensihoito (59.23)
alternative label: Faromoment, första hjälpen (59.23) @sv
alternative label: Faromoment, olycksförebyggande åtgärder (59.23) @sv
alternative label: Förgiftningar, första hjälpen (59.23) @sv
alternative label: Förgiftningscentraler (59.23) @sv
alternative label: Första hjälpen (59.23) @sv
alternative label: Första hjälpen utrustning (59.23) @sv
alternative label: Förstahjälpen, handböcker (59.23) @sv
alternative label: Förstahjälpstationer (59.23) @sv
alternative label: Haavat, hoito (59.23)
alternative label: Hemmets trygghet, olycksförebyggande åtgärder (59.23) @sv
alternative label: Hengenpelastus (59.23)
alternative label: Henkiinjäämisoppaat, ensiapu (59.23)
alternative label: Hukkuminen, ensiapu (59.23)
alternative label: Katastrofilääketiede, ensiapu (59.23)
alternative label: Katastrofmedicin, första hjälpen (59.23) @sv
alternative label: Kodin turvallisuus, tapaturmantorjuntaoppaat (59.23)
alternative label: Konstgjord andning (59.23) @sv
alternative label: Kvävning, första hjälpen (59.23) @sv
alternative label: Kärnkraftsolyckor, första hjälpen (59.23) @sv
alternative label: Kärnkraftsolyckor, strålskador (59.23) @sv
alternative label: Liikenneonnettomuudet, ensiapu (59.23)
alternative label: Livräddning (59.23) @sv
alternative label: Läkarambulansverksamhet (59.23) @sv
alternative label: Lääkäriambulanssitoiminta (59.23)
alternative label: Medvetslöshet, första hjälpen (59.23) @sv
alternative label: Myrkytykset, ensiapu (59.23)
alternative label: Myrkytyskeskukset (59.23)
alternative label: Olyckor (59.23) @sv
alternative label: Olyckor, första hjälpen (59.23) @sv
alternative label: Olyckor, olycksförebyggande åtgärder (59.23) @sv
alternative label: Onnettomuudet (59.23)
alternative label: Onnettomuudet, ensiapu (59.23)
alternative label: Onnettomuudet, tapaturmantorjunta (59.23)
alternative label: Palovammat, ensiapu (59.23)
alternative label: Räjähdysonnettomuudet, ensiapu (59.23)
alternative label: Sairaankuljetus, ambulanssitoiminta (59.23)
alternative label: Selviytymisoppaat, ensiapu (59.23)
alternative label: Shokit, ensiapu (59.23)
alternative label: Sokit, ensiapu (59.23)
alternative label: Suojautuminen, tapaturmien torjunta (59.23)
alternative label: Säteily, ensiapu (59.23)
alternative label: Säteilyvammat, ensiapu (59.23)
alternative label: Tajuttomuus, ensiapu (59.23)
alternative label: Tapaturma-asemat (59.23)
alternative label: Tapaturmantorjunta (59.23)
alternative label: Tapaturmat (59.23)
alternative label: Tapaturmat, ensiapu (59.23)
alternative label: Tekohengitys (59.23)
alternative label: Traumatologia, ensihoito (59.23)
alternative label: Tukehtuminen, ensiapu (59.23)
alternative label: Vaaratilanteet, ensiapu (59.23)
alternative label: Vaaratilanteet, tapaturmantorjunta (59.23)
alternative label: Ydinonnettomuudet, ensiapu (59.23)
alternative label: Ydinonnettomuudet, säteilyvammat (59.23)
broader: Yleinen terveydenhoito
in scheme: YKL - Yleisten kirjastojen luokitusjärjestelmä
notation: 59.23
scope note: Olycksfall i allmänhet. Prehospital akutsjukvård. Livräddning. Återupplivning Förstahjälpsmedel. Skydd mot olyckor och skyddsutrustning i allmänhet Ambulanser, olycksfallsstationer och akutmottagningar samt giftinformationscentraler och deras personal Sår och sårbehandling Drunkningar, förgiftningar, brand- och strålningsskador samt spräng- och bilolyckor ur första hjälpens synvinkel @sv
scope note: Tapaturmat yleensä. Ensihoito. Hengenpelastus. Elvytys Ensiapuvälineet. Suojautuminen ja suojavarusteet yleensä Ambulanssitoiminta, ensiapu-ja tapaturma-asemat sekä myrkytyskeskukset ja niiden henkilökunta Haavat ja haavojen hoito Hukkuminen, myrkytykset, palo- ja säteilyvammat sekä räjähdys- ja liikenneonnettomuudet ensiavun kannalta

Sosiaalilääketiede. Ympäristölääketiede
type: Concept
References: Talousoikeus
References: Elinkeino-oikeus
References: Palo- ja pelastustoimi
References: Ympäristönsuojelu. Luonnonsuojelu
References: Ravinto-oppi. Ruokavaliot
References: Vesi- ja jätevesihuolto
References: Jätehuolto. Kierrätys
References: Elintarviketeollisuus
alternative label: Anstaltshygien (59.24+) @sv
alternative label: Asbest, miljöhygien (59.24+) @sv
alternative label: Asbesti, ympäristöterveys (59.24+)
alternative label: Asuntohygienia (59.24)
alternative label: Elintarvikehygienia (59.24)
alternative label: Elintarvikekemia, elintarvikevalvonta (59.24)
alternative label: Elintarvikemikrobiologia, elintarvikevalvonta (59.24)
alternative label: Elintarvikevalvonta (59.24)
alternative label: Home, sisäilma, terveysvaikutukset (59.24+)
alternative label: Hygienia, sosiaalilääketiede (59.24+)
alternative label: Hyönteismyrkyt, asunto- ja laitoshygienia (59.24+)
alternative label: Ilmanlaatu, sisäilma (59.24+)
alternative label: Ilmansuojelu, sosiaalilääketiede (59.24+)
alternative label: Jaksaminen, työlääketiede (59.24+)
alternative label: Karanteeni, lääketiede (59.24)
alternative label: Kirput, asunto- ja laitoshygienia (59.24+)
alternative label: Kodin tuholaiset (59.24+)
alternative label: Koit, asunto- ja laitoshygienia (59.24+)
alternative label: Laitoshygienia (59.24+)
alternative label: Lihantarkastus (59.24)
alternative label: Liikennemelu, ympäristöterveys (59.24+)
alternative label: Lisäaineet, elintarvikevalvonta (59.24)
alternative label: Luteet, asunto- ja laitoshygienia (59.24+)
alternative label: Meluntorjunta (59.24+)
alternative label: Mikrobiologia, elintarvikehygienia (59.24+)
alternative label: Muuntogeeniset elintarvikkeet, elintarvikevalvonta (59.24)
alternative label: Nanohiukkaset, ympäristölääketiede (59.24+)
alternative label: Pienhiukkaset, ympäristölääketiede (59.24+)
alternative label: Puhtaanapito, terveyspolitiikka (59.24+)
alternative label: Pölyntorjunta (59.24+)
alternative label: Radioaktiivisuus, ympäristöterveys (59.24+)
alternative label: Ravintoaineet, valvonta (59.24)
alternative label: Ravintohygienia (59.24)
alternative label: Saasteet, ympäristöterveys (59.24+)
alternative label: Sisäilman laatu (59.24+)
alternative label: Sosiaaliepidemiologia (59.24+)
alternative label: Sosiaalilääketiede (59.24+)
alternative label: Syöpäläiset (59.24+)
alternative label: Säilöntäaineet, elintarvikevalvonta (59.24)
alternative label: Säteilyturvallisuus, ympäristöterveys (59.24+)
alternative label: Talousvesi, ympäristöterveys (59.24+)
alternative label: Teollisuusjätteet, ympäristöterveys (59.24+)
alternative label: Terveydenhoito, sosiaalinen (59.24+)
alternative label: Torakat, asunto- ja laitoshygienia (59.24+)
alternative label: Tuholaistorjunta, asunto- ja laitoshygienia (59.24+)
alternative label: Työssä jaksaminen, työlääketiede (59.24+)
alternative label: Työssä jatkaminen, työlääketiede (59.24+)
alternative label: Työssäjatkaminen, työlääketiede (59.24+)
alternative label: Täit, asunto- ja laitoshygienia (59.24+)
alternative label: Vaaratilanteet, ympäristöterveys (59.24+)
alternative label: Valosaaste, ympäristöterveys (59.24+)
alternative label: Veden laatu, ympäristöterveys (59.24+)
alternative label: Ydinjätteet, ympäristöterveys (59.24+)
alternative label: Ydinonnettomuudet, ympäristöterveys (59.24+)
alternative label: Ydinturvallisuus, ympäristöterveys (59.24)
alternative label: Ympäristöhygienia (59.24+)
alternative label: Ympäristölääketiede (59.24+)
alternative label: Ympäristömelu, meluntorjunta (59.24+)
alternative label: Ympäristömyrkyt, ympäristöterveys (59.24+)
alternative label: Ympäristöterveys (59.24+)
alternative label: Zoonoosit, ympäristöterveys (59.24+)
alternative label: Äänimaisema, meluntorjunta (59.24+)
alternative label: Äänisaaste, ympäristöterveys (59.24+)
alternative label: Ääniympäristö, meluntorjunta (59.24+)
alternative label: Ääniympäristö, ympäristömelu meluntorjunta (59.24+)
broader: Yleinen terveydenhoito
in scheme: YKL - Yleisten kirjastojen luokitusjärjestelmä
narrower: Työterveyshuolto. Opiskeluterveydenhuolto Kouluterveydenhoitajan työ
notation: 59.24
scope note: Elintarvikehygienia. Elintarvikevalvonta Elintarvikekemia ja elintarvikemikrobiologia elintarvikehygienian ja elintarvikevalvonnan kannalta Laitos- ja asuntohygienia Syöpäläiset ja kodin tuholaiset sekä niiden torjunta Ympäristöterveys. Ympäristöhygienia Meluntorjunta yleensä. Pölyntorjunta yleensä Sisäilman laatu Ympäristön saastumisen, ympäristömyrkkyjen ja ydinonnettomuuksien terveydelliset vaikutukset yleensä
scope note: Livsmedelshygien. Livsmedelsövervakning Livsmedelskemi och livsmedelsmikrobiologi ur livsmedelshygienens och livsmedelsövervakningens synvinkel Anstalts- och bostadshygien Ohyra och skadedjur i hemmet samt bekämpning av dem Miljö och hälsa. Miljöhygien. Miljömedicin Bullerbekämpning i allmänhet Bekämpning av damm i allmänhet Inomhusluftens kvalitet Hur nedsmutsningen av miljön, miljögifter och kärnolyckor inverkar på hälsan i allmänhet @sv

Työterveyshuolto. Opiskeluterveydenhuolto Kouluterveydenhoitajan työ
type: Concept
References: Työ. Työelämä
References: Työsuojelu. Ergonomia
References: Eri alojen työsuojelu, ergonomia ja työturvallisuus
References: Tapaturmantorjunta. Ensiapu
References: Mielenterveys. Tunne-elämän häiriöt
type: YKL-luokka
alternative label: Agens, arbetshälsa (59.241) @sv
alternative label: Altisteet, työterveys (59.241)
alternative label: Altistuminen, työterveys (59.241)
alternative label: Ammatillinen kuntoutus (59.241)
alternative label: Ammattitaudit (59.241)
alternative label: Arbetarskydd, olycksfall i arbete (59.241) @sv
alternative label: Arbetarskydd, yrkessjukdomar (59.241) @sv
alternative label: Arbetsförmåga (59.241) @sv
alternative label: Arbetshygien (59.241) @sv
alternative label: Arbetshälsa, arbetsmedicin (59.241) @sv
alternative label: Arbetsmedicin (59.241) @sv
alternative label: Arbetsolycksfall (59.241) @sv
alternative label: Arbetstrivsel, arbetshälsa (59.241) @sv
alternative label: Exposition, arbetshälsa (59.241) @sv
alternative label: Faromoment, arbetsolycksfall (59.241) @sv
alternative label: Fysisk kondition, arbetshälsa (59.241) @sv
alternative label: Fyysinen kunto, työterveys (59.241)
alternative label: Företagshälsovård (59.241) @sv
alternative label: Home, sisäilma, työterveys (59.241)
alternative label: Industrihygien (59.241) @sv
alternative label: Industrimedicin (59.241) @sv
alternative label: Institutet för arbetshygien (59.241) @sv
alternative label: Kouluterveydenhoitajan työ (59.241)
alternative label: Kouluterveydenhuolto (59.241)
alternative label: Kuntoutus, ammatillinen (59.241)
alternative label: Kuntoutus, sosiaalinen (59.241)
alternative label: Mögel, inneluft, arbetshygien (59.241) @sv
alternative label: Olyckor, arbetsolycksfall (59.241) @sv
alternative label: Olyckor, förebyggande av arbetsolycksfall (59.241) @sv
alternative label: Olycksfall, arbetsmedicin (59.241) @sv
alternative label: Olycksfallsförebyggande, arbetsmedicin (59.241) @sv
alternative label: Onnettomuudet, työtapatumantorjunta (59.241)
alternative label: Onnettomuudet, työtapaturmat (59.241)
alternative label: Opiskelijaterveydenhuolto (59.241)
alternative label: Opiskeluterveydenhuolto (59.241)
alternative label: Rehabilitering, social (59.241) @sv
alternative label: Rehabilitering, yrkesmässig (59.241) @sv
alternative label: Skolhälsovård (59.241) @sv
alternative label: Skolhälsovårdarens arbete (59.241) @sv
alternative label: Skyddsutrustning, förebyggande av arbetsolyckor (59.241) @sv
alternative label: Skyddsåtgärder, förebyggande av arbetsolyckor (59.241) @sv
alternative label: Social rehabilitering (59.241) @sv
alternative label: Sosiaalinen kuntoutus (59.241)
alternative label: Studenthälsovård (59.241) @sv
alternative label: Suojautuminen, työtapaturmien torjunta (59.241)
alternative label: Suojavarusteet, työtapaturmien torjunta (59.241)
alternative label: Tapaturmantorjunta, työlääketiede (59.241)
alternative label: Tapaturmat, työlääketiede (59.241)
alternative label: Teollisuushygienia (59.241)
alternative label: Teollisuuslääketiede (59.241)
alternative label: Tyky-toiminta (59.241)
alternative label: Työhygienia (59.241)
alternative label: Työhyvinvointi, työlääketiede (59.241)
alternative label: Työkyky (59.241)
alternative label: Työlääketiede (59.241)
alternative label: Työperäiset sairaudet (59.241)
alternative label: Työsuojelu, ammattitaudit (59.241)
alternative label: Työsuojelu, työtapaturmat (59.241)
alternative label: Työtapaturmat (59.241)
alternative label: Työterveyshuolto (59.241)
alternative label: Työterveyslaitos (59.241)
alternative label: Työviihtyvyys, työterveys (59.241)
alternative label: UUA-verksamheten (59.241) @sv
alternative label: Vaaratilanteet, työtapaturmat (59.241)
alternative label: Yrkesmässig rehabilitering (59.241) @sv
alternative label: Yrkessjukdomar (59.241) @sv
broader: Sosiaalilääketiede. Ympäristölääketiede
in scheme: YKL - Yleisten kirjastojen luokitusjärjestelmä
notation: 59.241
preferred label: Occupational health. Student health. The work of a school nurse @en
preferred label: Personalhälsovård. Studenthälsovård. Skolhälsovård @sv
scope note: Hit personalhälsovård i allmänhet och på olika områden, arbetshygien, yrkessjukdomar och arbetsplatsolyckor Hit också allmän student- och skolhälsovård Buller- och dammbekämpning på arbetsplatserna Inomhusluftens kvalitet på arbetsplatserna Social- och miljömedicinska aspekter på arbetsmedicin Verk om en enskild sjukdom förs till sjukdomens klass. Arbetstrivsel och välbefinnande i arbetet ur arbetshälsoperspektiv @sv
scope note: Tähän yleinen ja eri alojen työterveyshuolto, työlääketiede, ammattitaudit ja työtapaturmat Tähän myös yleinen opiskelu- ja kouluterveydenhuolto Melun- ja pölyntorjunta työpaikoilla Sisäilman laatu työpaikoilla Työlääketieteeseen liittyvät sosiaalilääketieteelliset ja ympäristöterveydelliset kysymykset Sosiaalinen ja ammatillinen kuntoutus Tiettyä tautia koskevat teokset luokitetaan ko. taudin luokkaan. Työviihtyvyys ja työhyvinvointi työterveyden näkökulmasta.

Oikeuslääketiede
type: Concept
References: OIKEUSTIEDE
References: Psykiatria
type: YKL-luokka
alternative label: Dödsorsaksutredning (59.27) @sv
alternative label: Kuolemansyyntutkimus (59.27)
alternative label: Obduktion, rättsmedicin (59.27) @sv
alternative label: Oikeusantropologia, lääketiede (59.27)
alternative label: Oikeuslääketiede (59.27)
alternative label: Oikeuslääketieteellinen antropologia (59.27)
alternative label: Ruumiinavaus, oikeuslääketiede (59.27)
alternative label: Rättsantropologi, medicin (59.27) @sv
alternative label: Rättsmedicin (59.27) @sv
alternative label: Rättsmedicinsk antropolog i(59.27) @sv
broader: Yleinen terveydenhoito
in scheme: YKL - Yleisten kirjastojen luokitusjärjestelmä
notation: 59.27
preferred label: Forensic medicine @en
preferred label: Rättsmedicin @sv
scope note: Oikeuslääketieteellinen ruumiinavaus ja kuolemansyyntutkimus
scope note: Rättsmedicinsk obduktion och undersökning av dödsorsaken @sv

Urheilulääketiede
type: Concept
References: Liikunta. Urheilu
References: Voimistelu
References: Palloilu
References: Retkeily. Ulkoilu
References: Lentourheilu. Moottoriurheilu
References: Kuntoliikunta. Kuntourheilu
References: Muut urheilu- ja liikuntamuodot
type: YKL-luokka
alternative label: Antidoping (59.28)
alternative label: Antidopning (59.28) @sv
alternative label: Doping, urheilulääketiede (59.28)
alternative label: Dopning, idrottsmedicin (59.28) @sv
alternative label: Fysisk kondition, idrottsmedicin (59.28) @sv
alternative label: Fyysinen kunto, urheilulääketiede (59.28)
alternative label: Hormoner, doping (59.28) @sv
alternative label: Hormonit, doping (59.28)
alternative label: Idrottsmedicin (59.28) @sv
alternative label: Idrottsskador (59.28) @sv
alternative label: Jänteet, urheilulääketiede (59.28)
alternative label: Leder, idrottsmedicin (59.28) @sv
alternative label: Lihaksisto, urheilulääketiede (59.28)
alternative label: Liikuntaelimet, urheilulääketiede (59.28)
alternative label: Liikuntavammat, urheilulääketiede (59.28)
alternative label: Luusto, urheilulääketiede (59.28)
alternative label: Muskulatur, idrottsmedicin (59.28) @sv
alternative label: Nivelet, urheilulääketiede (59.28)
alternative label: Piristeet, urheilulääketiede (59.28)
alternative label: Rörelsehandikapp, idrottsmedicin (59.28) @sv
alternative label: Rörelseorgan, idrottsmedicin (59.28) @sv
alternative label: Senor, idrottsmedicin (59.28) @sv
alternative label: Skelettet, idrottsmedicin (59.28) @sv
alternative label: Stimulantier, idrottsmedicin (59.28) @sv
alternative label: Urheilulääketiede (59.28)
alternative label: Urheiluvammat (59.28)
broader: Yleinen terveydenhoito
in scheme: YKL - Yleisten kirjastojen luokitusjärjestelmä
notation: 59.28
preferred label: Idrottsmedicin @sv
preferred label: Sports medicine @en
scope note: Förebyggande av idrottsskador. Vård av idrottsskador Förbättrande av idrottsprestationer på medicinsk väg Dopning. Antidopning. Dopningtest @sv
scope note: Urheilu- ja liikuntavammojen hoito ja ennaltaehkäisy Urheilusuoritusten parantaminen lääketieteellisin keinoin Doping. Antidoping. Dopingtestaus

Henkilökohtainen terveydenhoito
type: Concept
References: Elämänfilosofia. Elämäntaito
References: Yleinen terveydenhoito
References: Hoitomenetelmät
References: Mielenterveys. Tunne-elämän häiriöt
References: Kuntoliikunta. Kuntourheilu
type: YKL-luokka
alternative label: Biorytmiikka, henkilökohtainen terveydenhoito (59.3+)
alternative label: Biorytmik, personlig hälsovård (59.3+) @sv
alternative label: Chaga, personlig hälsovård (59.3) @sv
alternative label: Elämänohjeet, henkilökohtainen terveydenhoito (59.3+)
alternative label: Fysiologiset rytmit, henkilökohtainen terveydenhoito (59.3+)
alternative label: Fysiologiska rytmer, personlig hälsovård (59.3+) @sv
alternative label: Fysisk kondition, personlig hälsovård (59.3) @sv
alternative label: Fyysinen kunto, henkilökohtainen terveydenhoito (59.3)
alternative label: Henkilökohtainen terveydenhoito (59.3+)
alternative label: Hygien, personlig (59.3+) @sv
alternative label: Hygienia, henkilökohtainen (59.3+)
alternative label: Hälsa, personlig hälsovård (59.3+) @sv
alternative label: Hälsofostran (59.3+) @sv
alternative label: Hälsokompetens (59.3) @sv
alternative label: Hälsokunskap (59.3+) @sv
alternative label: Hälsolära (59.3+) @sv
alternative label: Hälsoupplysning (59.3+) @sv
alternative label: Hälsovård, personlig (59.3+) @sv
alternative label: Jaksaminen, henkilökohtainen terveydenhoito (59.3+)
alternative label: Levnadsregler, personlig hälsovård (59.3+) @sv
alternative label: Makrobiotiikka (59.3+)
alternative label: Makrobiotik (59.3+) @sv
alternative label: Metsäkylpy (59.3+)
alternative label: Ork, personlig hälsovård (59.3+) @sv
alternative label: Pakuri, henkilökohtainen terveydenhoito (59.3)
alternative label: Personlig hälsovård (59.3+) @sv
alternative label: Saippua, henkilökohtainen hygienia (59.3+)
alternative label: Skogsbad (59.3+) @sv
alternative label: Sprängticka, personlig hälsovård (59.3) @sv
alternative label: Terveydenhoito, henkilökohtainen (59.3+)
alternative label: Terveys, henkilökohtainen terveydenhoito (59.3+)
alternative label: Terveyskasvatus (59.3+)
alternative label: Terveyslukutaito (59.3)
alternative label: Terveysoppi (59.3+)
alternative label: Terveystieto (59.3+)
alternative label: Terveysvalistus (59.3+)
alternative label: Tvål, personlig hygien (59.3+) @sv
broader: LÄÄKETIEDE. TERVEYDENHOITO
in scheme: YKL - Yleisten kirjastojen luokitusjärjestelmä
narrower: Kauneudenhoito. Ulkonäkö
narrower: Kylvyt. Sauna
narrower: Rentoutus. Uni. Unettomuus
narrower: Ravinto-oppi. Ruokavaliot
narrower: Seksologia
notation: 59.3
preferred label: Personal health care @en
preferred label: Personlig hälsovård. Friskvård @sv
scope note: Hit allmänna verk om personlig hälsovård och friskvård Hit och till underklasserna också hälsofostran, hälsoupplysning, hälsokunskap och hälsolära Råd om hur man förebygger enskilda sjukdomar förs till den berörda sjukdomens klass 59.5+ @sv
scope note: Tähän henkilökohtaisen terveydenhoidon yleisteokset Tähän ja alaluokkiin myös terveyskasvatus, terveysvalistus, terveystieto ja terveysoppi Tietyn taudin ennaltaehkäisyyn liittyvät terveyden- hoidolliset ohjeet luokitetaan ko. taudin luokkaan 59.5+

Kauneudenhoito. Ulkonäkö
type: Concept
References: Käytös- ja tapatieto
References: Fysioterapia. Fysiologiset hoitomuodot
References: Muoti ja muodin historia
alternative label: Ansiktsbehandling (59.31) @sv
alternative label: Auringonotto, kauneudenhoito (59.31)
alternative label: Damfriseringar (59.31) @sv
alternative label: Doft, skönhetsvård (59.31) @sv
alternative label: Ehostus, kauneudenhoito (59.31)
alternative label: Fotvård (59.31) @sv
alternative label: Frisersalonger (59.31) @sv
alternative label: Frisyrer, skönhetsvård (59.31) @sv
alternative label: Frisörens arbete (59.31) @sv
alternative label: Färganalys, skönhetsvård (59.31) @sv
alternative label: Hajuvedet, kauneudenhoito (59.31)
alternative label: Handvård (59.31) @sv
alternative label: Herrfrisörens arbete (59.31) @sv
alternative label: Hiustenhoito (59.31)
alternative label: Hudvård, skönhetsvård (59.31) @sv
alternative label: Hårvård (59.31) @sv
alternative label: Ihonhoito, kauneudenhoito (59.31)
alternative label: Jalkahoito (59.31)
alternative label: Jalkojenhoito (59.31)
alternative label: Kampaajan työ (59.31)
alternative label: Kampaamot (59.31)
alternative label: Kampaukset, kauneudenhoito (59.31)
alternative label: Kasvojenhoito (59.31)
alternative label: Kauneudenhoito (59.31)
alternative label: Kauneudenhoitoaineet, käyttö (59.31)
alternative label: Kauneudenhoitokasvit, käyttö (59.31)
alternative label: Kauneushoitolat (59.31)
alternative label: Kläder, skönhetsvård (59.31) @sv
alternative label: Klädguider, skönhetsvård (59.31) @sv
alternative label: Klädsel, skönhetsvård, utseende (59.31) @sv
alternative label: Kosmeettiset aineet, kauneudenhoito (59.31)
alternative label: Kosmetikväxter, användning (59.31) @sv
alternative label: Kosmetiska medel, skönhetsvård (59.31) @sv
alternative label: Kosmetologens arbete (59.31) @sv
alternative label: Kosmetologi (59.31) @sv
alternative label: Kosmetologia (59.31)
alternative label: Kosmetologin työ (59.31)
alternative label: Käsienhoito (59.31)
alternative label: Luktvatten, skönhetsvård (59.31) @sv
alternative label: Lävistys, kauneudenhoito (59.31)
alternative label: Make up, kauneudenhoito (59.31)
alternative label: Make up, skönhetsvård (59.31) @sv
alternative label: Makeup, skönhetsvård (59.31) @sv
alternative label: Makeuper, skönhetsvård (59.31) @sv
alternative label: Manikyr (59.31) @sv
alternative label: Manikyyri (59.31)
alternative label: Meikit, kauneudenhoito (59.31)
alternative label: Meikkaus, kauneudenhoito (59.31)
alternative label: Mode, skönhetsvård (59.31) @sv
alternative label: Muoti, kauneudenhoito (59.31)
alternative label: Parfymer, skönhetsvård (59.31) @sv
alternative label: Parfyymit, kauneudenhoito (59.31)
alternative label: Parturiliikkeet (59.31)
alternative label: Parturin työ (59.31)
alternative label: Pedikyr (59.31) @sv
alternative label: Pedikyyri (59.31)
alternative label: Piercing, skönhetsvård (59.31) @sv
alternative label: Pukeutuminen, kauneudenhoito, ulkonäkö (59.31)
alternative label: Pukeutumisoppaat, kauneudenhoito (59.31)
alternative label: Päivetys, kauneudenhoito (59.31)
alternative label: Skönhetsmedel, användning (59.31) @sv
alternative label: Skönhetssalonger (59.31) @sv
alternative label: Skönhetsvård (59.31) @sv
alternative label: Solariumit, kauneudenhoito (59.31)
alternative label: Tuoksu, kauneudenhoito (59.31)
alternative label: Tyylit, kauneudenhoito (59.31)
alternative label: Tyylit, pukeutumisoppaat (59.31)
alternative label: Ulkonäkö (59.31)
alternative label: Vaatteet, kauneudenhoito (59.31)
alternative label: Värianalyysi, kauneudenhoito (59.31)
alternative label: Yrtit, kauneudenhoito (59.31)
broader: Henkilökohtainen terveydenhoito
in scheme: YKL - Yleisten kirjastojen luokitusjärjestelmä
notation: 59.31
scope note: Ansikts-, hand-, fot-, hud- och hårvård Make-up. Kosmetologi. Kosmetologens arbete. Skönhetssalonger Frisörskans arbete. Herrfrisering. Damfrisering Solbad. Solarier Färganalys och klädråd ur skönhetsvårdens synvinkel Orter i skönhetsvården @sv
scope note: Kasvojen-, käsien-, jalkojen-, ihon- ja hiustenhoito Meikkaus. Kosmetologia. Kosmetologin työ. Kauneushoitolat Kampaajan työ. Parturit. Kampaamot Auringonotto. Solariumit Värianalyysi ja pukeutumisohjeet kauneudenhoidon kannalta Yrttien käyttö kauneudenhoidossa

Kylvyt. Sauna
type: Concept
References: Suomen ja suomalais-ugrilaisten kansojen kansatiede, Rakennukset
References: Fysioterapia. Fysiologiset hoitomuodot
References: Rakennusten erillistilat
References: Rakennukset. Rakennustyypit
type: YKL-luokka
alternative label: Bad, hälsovård (59.32) @sv
alternative label: Badanläggningar, hälsovård (59.32) @sv
alternative label: Bastubadande (59.32) @sv
alternative label: Bastur, hälsovård (59.32) @sv
alternative label: Hälsobad (59.32) @sv
alternative label: Hälsokällor (59.32) @sv
alternative label: Kylpylät, terveydenhoito (59.32)
alternative label: Kylvyt, terveydenhoito (59.32)
alternative label: Saunat, terveydenhoito (59.32)
alternative label: Saunominen (59.32)
alternative label: Terveyskylvyt (59.32)
alternative label: Terveyslähteet (59.32)
broader: Henkilökohtainen terveydenhoito
in scheme: YKL - Yleisten kirjastojen luokitusjärjestelmä
notation: 59.32
preferred label: Bad. Bastu @sv
preferred label: Baths. Sauna @en
scope note: Hit badinrättningar, bad, bastu och bastubad ur hälsovårdens synvinkel Bastu- och badkultur ur historisk och kulturhistorisk synvinkel 59.3209 @sv
scope note: Tähän kylpylät, kylvyt, saunat ja saunominen terveydenhoidon kannalta Sauna- ja kylpyläkulttuuri historialliselta ja kulttuurihistorialliselta kannalta 59.3209

Rentoutus. Uni. Unettomuus
type: Concept
References: Uni
References: Rukous. Hartaudenharjoitus
References: Intian uskonnot ja mytologiat
References: Mielenterveys. Tunne-elämän häiriöt
type: YKL-luokka
alternative label: Asahi (59.33)
alternative label: Asahi Health (59.33)
alternative label: Asahi, avslappning (59.33) @sv
alternative label: Asahi, rentoutus (59.33)
alternative label: Avkoppling (59.33+) @sv
alternative label: Avslappning (59.33+) @sv
alternative label: Chi kung (59.33)
alternative label: Meditaatio, terveydenhoito (59.33+)
alternative label: Meditation, hälsovård (59.33+) @sv
alternative label: Mietiskely, terveydenhoito (59.33+)
alternative label: Qi gong (59.33)
alternative label: Qigong (59.33)
alternative label: Rentoutuminen (59.33+)
alternative label: Rentoutus (59.33+)
alternative label: Sömn, hälsovård (59.33) @sv
alternative label: Sömnlöshet (59.33) @sv
alternative label: Sömnstörningar (59.33) @sv
alternative label: Unettomuus (59.33)
alternative label: Uni, terveydenhoito (59.33)
alternative label: Unihäiriöt (59.33)
broader: Henkilökohtainen terveydenhoito
in scheme: YKL - Yleisten kirjastojen luokitusjärjestelmä
narrower: Jooga
notation: 59.33
preferred label: Avslappning. Sömn. Sömnlöshet @sv
preferred label: Relaxation. Sleep. Insomnia @en
scope note: Hit också meditation med avseende på avslappning och hälsovård Tillämpning av avslappning och meditation inom olika områden eller vård av olika sjukdomar klassificeras efter område @sv
scope note: Tähän myös meditaatio rentoutuksen ja terveydenhoidon kannalta Rentoutuksen ja meditaation sovellukset eri aloille tai eri sairauksien hoitoon luokitetaan alan mukaan

Jooga
type: Concept
References: Intian uskonnot ja mytologiat
type: YKL-luokka
alternative label: Chakrat, jooga (59.331)
alternative label: Chakror, yoga (59.331) @sv
alternative label: Jooga, terveydenhoito (59.331)
alternative label: Kontemplation, yoga, hälsovård (59.331) @sv
alternative label: Meditaatio, jooga, terveydenhoito (59.331)
alternative label: Meditation, yoga, hälsovård (59.331) @sv
alternative label: Mietiskely, jooga, terveydenhoito (59.331)
alternative label: Naurujooga (59.331)
alternative label: Skrattyoga (59.331) @sv
alternative label: Yoga, hälsovård (59.331) @sv
broader: Rentoutus. Uni. Unettomuus
in scheme: YKL - Yleisten kirjastojen luokitusjärjestelmä
notation: 59.331
preferred label: Yoga @en
scope note: Jooga rentoutuksen, liikunnan ja terveydenhoidon kannalta
scope note: Yoga med avseende på avslappning, motion och hälsovård @sv

Ravinto-oppi. Ruokavaliot
type: Concept
References: Ihmisen fysiologia
References: Sosiaalilääketiede. Ympäristölääketiede
References: Elimet. Taudit
References: Sisäeritysrauhaset. Aineenvaihduntataudit
References: Ruoansulatuselimet. Ruoansulatuselinten taudit
References: Syömishäiriöt
References: Elintarviketeollisuus
References: Ruoanvalmistus. Ruokakulttuuri
alternative label: Aliravitsemus, lääketiede (59.34)
alternative label: Biokemia, ravintokemia (59.34)
alternative label: Dieetit (59.34)
alternative label: Dieettikeittokirjat (59.34)
alternative label: Elintarvikekemia, ravinto-oppi (59.34)
alternative label: Elintarvikerasvat, ravinto-oppi (59.34)
alternative label: Elintarvikkeet, ravinto-oppi (59.34)
alternative label: Elävä ravinto (59.34)
alternative label: Grillaus, ravinto-oppi (59.34)
alternative label: Hedelmät, ravinto-oppi (59.34)
alternative label: Hiilihydraatit, ravinto-oppi (59.34)
alternative label: Hivenaineet, ravinto-oppi (59.34)
alternative label: Hunaja, ravinto-oppi (59.34)
alternative label: Idut, elävä ravinto (59.34)
alternative label: Idätys, elävä ravinto (59.34)
alternative label: Kalaruoat, ravinto-oppi (59.34)
alternative label: Kalat, ravinto-oppi (59.34)
alternative label: Kasvikset, ravinto-oppi (59.34)
alternative label: Kasvisruoat, ravinto-oppi (59.34)
alternative label: Kasvissyönti, ravinto-oppi (59.34)
alternative label: Kasvistuotteet, ravinto-oppi (59.34)
alternative label: Kasviöljyt, ravinto-oppi (59.34)
alternative label: Keittokirjat, ravinto-opilliset (59.34)
alternative label: Keittokirjat, terveydenhoidolliset (59.34)
alternative label: Keittäminen, ravinto-oppi (59.34)
alternative label: Kivennäisaineet, ravinto-oppi (59.34)
alternative label: Laihdutus (59.34)
alternative label: Lakto-ovo-vegetarismi, ravinto-oppi (59.34)
alternative label: Laktovegetarismi, ravinto-oppi (59.34)
alternative label: Lastenruoat, ravinto-oppi (59.34)
alternative label: Liharuoat, ravinto-oppi (59.34)
alternative label: Lihavuus (59.34)
alternative label: Liikuntaravitsemus (59.34)
alternative label: Luomu-tuotteet, ravinto-oppi (59.34)
alternative label: Luontaisravinto, ravinto-oppi (59.34)
alternative label: Maito, ravinto-oppi (59.34)
alternative label: Makrobiotiikka, ravinto-oppi (59.34)
alternative label: Mikrobiologia, ravinto-oppi (59.34)
alternative label: Ovovegetarismi, ravinto-oppi (59.34)
alternative label: Paasto, terveydenhoito (59.34)
alternative label: Painonhallinta (59.34)
alternative label: Paistaminen, ravinto-oppi (59.34)
alternative label: Proteiinit, ravinto-oppi (59.34)
alternative label: Raakaravinto, ravinto-oppi (59.34)
alternative label: Rasvat, ravinto-oppi (59.34)
alternative label: Ravinto-oppi (59.34)
alternative label: Ravintoaineet, ravinto-oppi (59.34)
alternative label: Ravintofysiologia, ravinto-oppi (59.34)
alternative label: Ravintokasvatus (59.34)
alternative label: Ravintokemia (59.34)
alternative label: Ravitsemusfysiologia, ravinto-oppi (59.34)
alternative label: Ravitsemushoito (59.34)
alternative label: Ravitsemuskasvatus (59.34)
alternative label: Ravitsemusterapia (59.34)
alternative label: Ruoanvalmistusohjeet, lääketieteelliset (59.34)
alternative label: Ruoanvalmistusohjeet, terveydenhoidolliset (59.34)
alternative label: Ruoka, ravinto-oppi (59.34)
alternative label: Ruoka-aineet, ravinto-oppi (59.34)
alternative label: Ruokaohjeet, lääketieteelliset (59.34)
alternative label: Ruokaohjeet, terveydenhoidolliset (59.34)
alternative label: Ruokavaliohoito (59.34)
alternative label: Ruokavaliot, lääketieteelliset (59.34)
alternative label: Ruokavaliot, terveydenhoidolliset (59.34)
alternative label: Savustus, ravinto-oppi (59.34)
alternative label: Smoothiet, terveydenhoidolliset (59.34)
alternative label: Sokeri, ravinto-oppi (59.34)
broader: Henkilökohtainen terveydenhoito
in scheme: YKL - Yleisten kirjastojen luokitusjärjestelmä
notation: 59.34
scope note: Näringsämnen, vitaminer, spår- och mineralämnen samt närings- och livsmedelskemi ur hälsovårdssynvinkel. Näringsfostran. Hit dieter, kokböcker och recept i allmänhet ur hälsovårdssynvinkel synvinkel. Fetma. Bantning. Fasta ur hälsovårdssynvinkel. Viktkontroll. Makrobiotisk näring. Levande föda. Vegetarianism. Undernäring ur näringslärans synvinkel. Dieter och recept för att vårda eller förebygga en enskild sjukdom förs till den ifrågavarande sjukdomens klass. Kaloritabeller, Födoämnestabeller 59.3408. @sv
scope note: Ravintoaineet, vitamiinit, hiven- ja kivennäisaineet sekä ravinto- ja elintarvikekemia terveydenhoidon kannalta. Ravintokasvatus. Tähän terveydenhoidolliset ruokavaliot, ruokaohjeet ja keittokirjat yleensä. Lihavuus. Laihdutus. Paasto terveydenhoidon kannalta. Painonhallinta. Makrobioottinen ravinto. Elävä ravinto. Kasvissyönti. Aliravitsemus ravinto-opin kannalta. Tietyn taudin hoitoon tai ennaltaehkäisyyn tarkoitetut ruokavaliot ja ruokaohjeet luokitetaan ko. taudin luokkaan. Kaloritaulukot, ruoka-ainetaulukot 59.3408.

Seksologia
type: Concept
modified: 2026-05-06T13:28:41
References: Persoonallisuuden psykologia
References: Elämäntapojen sosiologia. Kulttuurisosiologia
References: Ihmisoikeudet. Kansalaisen asema yhteiskunnassa
References: Sukupuolitaudit
References: Erotiikan historia
alternative label: Addiktioner, sex (59.35) @sv
alternative label: Addiktiot, seksi (59.35)
alternative label: Aseksuaalisuus (59.35)
alternative label: Asennot, sukupuolioppaat (59.35)
alternative label: Asexualitet (59.35) @sv
alternative label: Avioliitto, sukupuolielämä (59.35)
alternative label: Avoliitto, sukupuolielämä (59.35)
alternative label: Beroende, sex (59.35) @sv
alternative label: E-pillerit (59.35)
alternative label: Ehkäisymenetelmät (59.35)
alternative label: Ehkäisyneuvonta (59.35)
alternative label: Erotiikka, seksologia (59.35)
alternative label: Erotik, sexologi (59.35) @sv
alternative label: Familjeplanering, preventivmetoder (59.35) @sv
alternative label: Fetischism, sexologi (59.35) @sv
alternative label: Fetisismi, seksologia (59.35)
alternative label: Frigiditeetti, seksologia (59.35)
alternative label: Frigiditet, sexologi (59.35) @sv
alternative label: Födelsekontroll, preventivmetoder (59.35) @sv
alternative label: Homoseksuaalisuus, seksologia (59.35)
alternative label: Homosexualitet, sexologi (59.35) @sv
alternative label: Impotens, sexologi (59.35) @sv
alternative label: Impotenssi, seksologia (59.35)
alternative label: Incest, sexologi (59.35) @sv
alternative label: Insesti, seksologia (59.35)
alternative label: Itsetyydytys (59.35)
alternative label: Kondomer (59.35) @sv
alternative label: Kondomit (59.35)
alternative label: Könskorrigering, medicin (59.35) @sv
alternative label: Könsliv (59.35) @sv
alternative label: Könsliv, störningar (59.35) @sv
alternative label: Lesbous, seksologia (59.35)
alternative label: Lisääntymisterveys, seksologia (59.35)
alternative label: Masturbaatio (59.35)
alternative label: Onania (59.35)
alternative label: Orgasmi (59.35)
alternative label: Parisuhde, sukupuolielämä (59.35)
alternative label: Pedofilia, seksologia (59.35)
alternative label: Perhesuunnittelu, ehkäisymenetelmät (59.35)
alternative label: Riippuvuus, seksi (59.35)
alternative label: Seksi (59.35)
alternative label: Seksi, riippuvuus (59.35)
alternative label: Seksiala, sukupuolinen käyttäytyminen (59.35)
alternative label: Seksioppaat (59.35)
alternative label: Seksologia (59.35)
alternative label: Seksuaalielämä (59.35)
alternative label: Seksuaalielämä, häiriöt (59.35)
alternative label: Seksuaalikasvatus (59.35)
alternative label: Seksuaalinen identiteetti, seksologia (59.35)
alternative label: Seksuaalioppaat (59.35)
alternative label: Seksuaalisuus, ihminen (59.35)
alternative label: Seksuaaliterveys (59.35)
alternative label: Seksuaaliterveys, seksologia (59.35)
alternative label: Seksuaalivähemmistöt, seksologia (59.35)
alternative label: Sterilointi, ehkäisymenetelmät (59.35)
alternative label: Sukupuolenkorjaus, lääketiede (59.35)
alternative label: Sukupuolielimet, seksuaalioppaat (59.35)
alternative label: Sukupuolielämä (59.35)
alternative label: Sukupuolielämä, ehkäisyvälineet (59.35)
alternative label: Sukupuolielämä, häiriöt (59.35)
alternative label: Sukupuolielämä, oppaat (59.35)
alternative label: Sukupuolielämä, seksuaalikasvatus (59.35)
alternative label: Sukupuoliset vähemmistöt, seksologia (59.35)
alternative label: Sukupuolisuus, ihminen (59.35)
alternative label: Sukupuolivähemmistöt, seksologia (59.35)
alternative label: Syntyvyyden säännöstely, ehkäisymenetelmät (59.35)
alternative label: Tantra, seksologia (59.35)
alternative label: Transsukupuolisuus, seksologia (59.35)
broader: Henkilökohtainen terveydenhoito
in scheme: YKL - Yleisten kirjastojen luokitusjärjestelmä
notation: 59.35
scope note: Ihmisen sukupuolinen käyttäytyminen Sukupuolielämän sosiologia Seksuaalikasvatus Sukupuolioppaat. Ehkäisyneuvonta. Ehkäisymenetelmät Seksuaalivähemmistöt seksologian kannalta Sukupuolielämän häiriöt
scope note: Människans sexuella beteende Sexuallivets sociologi Sexualfostran Sexualhandböcker. Preventivrådgivning. Preventivmedel Sexuella minoriteter ur sexologisk synvinkel Störningar i sexuallivet @sv

Hoitomenetelmät
type: Concept
modified: 2026-05-06T13:19:02
References: Okkultismi. Spiritismi. Spiritualismi. Henkimaailma
References: Jumala-käsite. Jumalan toiminta
References: Lääketieteellinen mikrobiologia. Immunologia
References: Hoitotiede. Hoitotyö. Hoitohenkilökunta
References: Sairaalatekniikka
References: Henkilökohtainen terveydenhoito
References: Syöpätaudit
References: Kuntoliikunta. Kuntourheilu
alternative label: Alternativ medicin (59.4+) @sv
alternative label: Alternativ vård (59.4+) @sv
alternative label: Aromaterapi (59.4) @sv
alternative label: Aromaterapia (59.4)
alternative label: Ayurveda (59.4)
alternative label: Blomsterterapi (59.4) @sv
alternative label: Chakrat, vaihtoehtolääkintä (59.4)
alternative label: Chakror, alternativ medicin (59.4) @sv
alternative label: Egenvård (59.4+) @sv
alternative label: Energiahoidot (59.4)
alternative label: Energibehandlingar (59.4) @sv
alternative label: Folklig läkekonst (59.4+) @sv
alternative label: Fytoterapi, behandlingsmetoder (59.4) @sv
alternative label: Fytoterapia, hoitomenetelmät (59.4)
alternative label: Färgterapi (59.4) @sv
alternative label: Green care, behandlingsmetoder (59.4) @sv
alternative label: Green care, hoitomenetelmät (59.4)
alternative label: Happihoito (59.4)
alternative label: Healing (59.4+)
alternative label: Herbalism (59.4+) @sv
alternative label: Hoitomenetelmät (59.4+)
alternative label: Itsehoito (59.4+)
alternative label: Itämainen lääketiede (59.4+)
alternative label: Jalokiviterapia (59.4)
alternative label: Kansanparannustaito (59.4+)
alternative label: Kasvilääkintä, hoitomenetelmät (59.4)
alternative label: Kasvisparantaminen (59.4+)
alternative label: Kiinalainen lääketiede (59.4+)
alternative label: Kinesisk läkekonst (59.4+) @sv
alternative label: Kipu, lievitys (59.4+)
alternative label: Kivun lievitys (59.4+)
alternative label: Kostterapi, alternativ medicin (59.4) @sv
alternative label: Kukkaisterapia (59.4)
alternative label: Kuntoutus (59.4+)
alternative label: Luonnonparannus (59.4+)
alternative label: Lääketieteelliset laitteet, hoitomenetelmät (59.4+)
alternative label: Medicinsk apparatur, vårdmetoder (59.4+) @sv
alternative label: Naturläkekonst (59.4+) @sv
alternative label: Pyramiditerapia (59.4)
alternative label: Pyramidterapi (59.4) @sv
alternative label: Ravintoterapia, vaihtoehtolääkintä (59.4)
alternative label: Rehabilitering (59.4+) @sv
alternative label: Reiki (59.4)
alternative label: Smärta, lindring (59.4+) @sv
alternative label: Smärtlindring (59.4+) @sv
alternative label: Syrgasbehandling (59.4) @sv
alternative label: Terapi, behandlingsmetoder (59.4+) @sv
alternative label: Terapia, hoitomuodot (59.4+)
alternative label: Tibetansk läkekonst (59.4+) @sv
alternative label: Tiibetiläinen lääketiede (59.4+)
alternative label: Uskomuslääkintä (59.4+)
alternative label: Vaihtoehtoinen lääketiede (59.4+)
alternative label: Vaihtoehtolääketiede (59.4+)
alternative label: Vaihtoehtolääkintä (59.4+)
alternative label: Väriterapia (59.4)
alternative label: Vårdmetoder (59.4+) @sv
alternative label: Yrttilääkintä, hoitomenetelmät (59.4)
alternative label: biomateriaalit, lääketiede (59.4+)
alternative label: biomaterial, medicin (59.4+) @sv
alternative label: Ädelstensterapi (59.4) @sv
broader: LÄÄKETIEDE. TERVEYDENHOITO
in scheme: YKL - Yleisten kirjastojen luokitusjärjestelmä
narrower: Fysioterapia. Fysiologiset hoitomuodot
narrower: Sairaiden ja vammaisten apuvälineet
narrower: Lääkehoito. Lääkeaineoppi
narrower: Kirurgia. Leikkaushoito
narrower: Saattohoito
notation: 59.4
scope note: Hit och till underklasserna allmänna verk om olika behandlingsmetoder, folkliga botemedel, naturläkekonst, alternativ medicin, medicinsk rehabilitering eller egenvård Hit och till underklasserna också österländsk läkekonst i allmänhet Hit och till underklasserna också smärt- och värklindring i allmänhet Hit också t.ex. blomster-, ädelstens-, färg- och aromterapi samt healing i allmänhet Behandling och behandlingsmetoder vid enskilda sjukdomar förs till den ifrågavarande sjukdomens klass 59.5+ @sv
scope note: Tähän ja alaluokkiin eri hoitomenetelmiä, kansanomaisia parannuskeinoja, luonnonparannusta, vaihtoehtolääkinnän menetelmiä, lääketieteellistä kuntoutusta tai itsehoitoa koskevat yleisteokset Tähän ja alaluokkiin myös itämainen lääketiede yleensä Tähän ja alaluokkiin myös kipu ja kivun lievitys yleensä Tähän myös esim. kukkais-, jalokivi-, väri- ja aromaterapia sekä healing yleensä Tähän ja alaluokkiin myös muistelmat ja elämäkerrat, joissa tietty hoitomenetelmä on teoksen keskeinen sisältö Tietyn taudin hoito ja hoitomenetelmät luokitetaan ko. taudin luokkaan 59.5+

Fysioterapia. Fysiologiset hoitomuodot
type: Concept
modified: 2026-05-06T14:38:07
References: Henkilökohtainen terveydenhoito
References: Liikuntaelimet. Liikuntaelinten taudit
type: YKL-luokka
alternative label: Aleksanteri-tekniikka (59.41)
alternative label: Aleksanteritekniikka (59.41)
alternative label: Alexander-tekniikka (59.41)
alternative label: Alexanderteknik (59.41) @sv
alternative label: Auringonkylvyt, valohoito (59.41)
alternative label: Bad, fysioterapeutiska behandlingar (59.41) @sv
alternative label: Elektroterapi (59.41) @sv
alternative label: Feldenkrais-menetelmä (59.41)
alternative label: Feldenkraismetoden (59.41) @sv
alternative label: Fysiatri (59.41) @sv
alternative label: Fysiatria (59.41)
alternative label: Fysikaalinen hoito (59.41)
alternative label: Fysikalisk vård (59.41) @sv
alternative label: Fysiologiset hoitomuodot (59.41)
alternative label: Fysiologiska behandlingmetoder (59.41) @sv
alternative label: Fysioterapeutens arbete (59.41) @sv
alternative label: Fysioterapi (59.41) @sv
alternative label: Fysioterapia (59.41)
alternative label: Hieronta (59.41)
alternative label: Hydroterapi (59.41) @sv
alternative label: Hydroterapia (59.41)
alternative label: Infrapunahoito (59.41)
alternative label: Infrarödbehandling (59.41) @sv
alternative label: Kiropraktiikka (59.41)
alternative label: Kiropraktik (59.41) @sv
alternative label: Kylmyyshoito (59.41)
alternative label: Kylvyt, fysioterapeuttiset hoidot (59.41)
alternative label: Köldbehandling (59.41) @sv
alternative label: Liikuntaterapia, fysioterapia (59.41)
alternative label: Ljudterapi (59.41) @sv
alternative label: Ljusbehandling (59.41) @sv
alternative label: Lymfaterapi (59.41) @sv
alternative label: Lymfaterapia (59.41)
alternative label: Lämpöhoito (59.41)
alternative label: Lääkintävoimistelijan työ (59.41)
alternative label: Lääkintävoimistelu (59.41)
alternative label: Massage (59.41) @sv
alternative label: Osteopati (59.41) @sv
alternative label: Osteopatia (59.41)
alternative label: Rosen-tekniikka (59.41)
alternative label: Rosen-teknik (59.41) @sv
alternative label: Rörelseterapi, fysioterapi (59.41) @sv
alternative label: Sairasvoimistelu (59.41)
alternative label: Sjukgymnastik (59.41) @sv
alternative label: Solbad, ljusbehandling (59.41) @sv
alternative label: Sähköhoito (59.41)
alternative label: Ultraviolettbehandling (59.41) @sv
alternative label: Ultraviolettihoito (59.41)
alternative label: Valohoito (59.41)
alternative label: Vattenterapi (59.41) @sv
alternative label: Vesihoito (59.41)
alternative label: Värmeterapi (59.41) @sv
alternative label: Äänihoito (59.41)
broader: Hoitomenetelmät
in scheme: YKL - Yleisten kirjastojen luokitusjärjestelmä
narrower: Akupunktio. Akupainanta. Vyöhyketerapia
notation: 59.41
preferred label: Fysioterapi. Fysiologiska behandlingsmetoder @sv
preferred label: Physiotherapy. Physiological treatments @en
scope note: Fysiatri. Fysikalisk vård Sjukgymnastik. Massage Kiropraktik. Osteopati. Lymfterapi. Alexander- och Rosenteknik Värme-, köld-, el-, ljus-, vätske- och ljudbehandling Infraröd- och ultraviolettbehandling @sv
scope note: Fysiatria. Fysikaalinen hoito Lääkintävoimistelu. Hieronta Kiropraktiikka. Osteopatia. Lymfaterapia Aleksanteri- ja Rosen-tekniikka Lämpö-, kylmyys-, sähkö-, valo-, neste-, vesi- ja äänihoito. Infrapuna- ja ultraviolettihoito

Akupunktio. Akupainanta. Vyöhyketerapia
type: Concept
type: YKL-luokka
alternative label: Akupainanta (59.411)
alternative label: Akupressur (59.411) @sv
alternative label: Akupunktio (59.411)
alternative label: Akupunktur (59.411) @sv
alternative label: Shiatsu (59.411)
alternative label: Vyöhyketerapia (59.411)
alternative label: Zonterapi (59.411) @sv
broader: Fysioterapia. Fysiologiset hoitomuodot
in scheme: YKL - Yleisten kirjastojen luokitusjärjestelmä
notation: 59.411
preferred label: Acupuncture. Acupressure. Zone therapy @en
preferred label: Akupunktur. Akupressur. Zonterapi @sv
scope note: Hit också shiatsu @sv
scope note: Tähän myös shiatsu

Sairaiden ja vammaisten apuvälineet
type: Concept
References: Liikuntaelimet. Liikuntaelinten taudit
References: Optiset ja lääketieteelliset laitteet
type: YKL-luokka
alternative label: Artificiella organ (59.42) @sv
alternative label: Handikappade, hjälpmedel (59.42) @sv
alternative label: Handikapphjälpmedel (59.42) @sv
alternative label: Hjälpmedel för sjuka (59.42) @sv
alternative label: Proteesit (59.42)
alternative label: Proteser (59.42) @sv
alternative label: Sairaiden apuvälineet (59.42)
alternative label: Tekoelimet (59.42)
alternative label: Vammaiset, apuvälineet (59.42)
alternative label: Vammaisten apuvälineet (59.42)
broader: Hoitomenetelmät
in scheme: YKL - Yleisten kirjastojen luokitusjärjestelmä
notation: 59.42
preferred label: Aids and equipment for sick and disabled persons @en
preferred label: Hjälpmedel för sjuka och handikappade @sv
scope note: Allmänna verk om hjälpmedel för sjuka och handikappade och hur de används Konstgjorda organ och proteser i allmänhet Hjälpmedel, konstgjorda organ och proteser som hänför sig till en speciell sjukdom förs till den ifrågavarande sjukdomens klass 59.5+ @sv
scope note: Sairaiden ja vammaisten apuvälineitä ja niiden käyttöä koskevat yleisteokset Tekoelimet ja proteesit yleensä Tiettyyn tautiin liittyvät apuvälineet, tekoelimet ja proteesit luokitetaan ko. taudin luokkaan 59.5+

Lääkehoito. Lääkeaineoppi
type: Concept
References: Lääketieteellinen mikrobiologia. Immunologia
References: Tapaturmantorjunta. Ensiapu
References: Huumeriippuvuus
References: Kemianteollisuus
References: Yrtti- ja maustekasvit
alternative label: Alkaloider, farmakologi (59.43) @sv
alternative label: Alkaloidit, lääkeaineoppi (59.43)
alternative label: Antibiootit (59.43)
alternative label: Antibiotika (59.43) @sv
alternative label: Antiseptiikka, lääkeaineoppi (59.43)
alternative label: Antiseptik, farmakologi (59.43) @sv
alternative label: Apotek (59.43) @sv
alternative label: Apteekkitoiminta (59.43)
alternative label: Aseptiikka, lääkeaineoppi (59.43)
alternative label: Aseptik, farmakologi (59.43) @sv
alternative label: Biverkningar, farmakologi (59.43) @sv
alternative label: Chaga, naturmediciner (59.43) @sv
alternative label: Farmaci (59.43) @sv
alternative label: Farmakognosi (59.43) @sv
alternative label: Farmakologi (59.43) @sv
alternative label: Farmakologia (59.43)
alternative label: Farmasia (59.43)
alternative label: Fytoterapi, farmakologi (59.43) @sv
alternative label: Fytoterapia, lääkeaineoppi (59.43)
alternative label: Gifter (59.43) @sv
alternative label: Giftiga växter, toxikologi (59.43) @sv
alternative label: Giftsvampar, toxikologi (59.43) @sv
alternative label: Homeopati (59.43) @sv
alternative label: Homeopatia (59.43)
alternative label: Huumeet, lääkeaineoppi (59.43)
alternative label: Kasvilääkintä, lääkeaineoppi (59.43)
alternative label: Kemiska föreningar, farmakologi (59.43) @sv
alternative label: Kemoterapi (59.43) @sv
alternative label: Kemoterapia (59.43)
alternative label: Luonnonlääkkeet (59.43)
alternative label: Läkemedelsbehandling (59.43) @sv
alternative label: Läkemedelsordinationer (59.43) @sv
alternative label: Lääkeaineoppi (59.43)
alternative label: Lääkehoito (59.43)
alternative label: Lääkekasvit, lääkeaineoppi (59.43)
alternative label: Lääkemääräykset (59.43)
alternative label: Lääkkeet (59.43)
alternative label: Lääkkeet, annostelu ja käyttö (59.43)
alternative label: Lääkkeet, myynti ja jakelu (59.43)
alternative label: Lääkkeet, sivuvaikutukset (59.43)
alternative label: Lääkkeet, vaikutukset (59.43)
alternative label: Lääkkeet, valvonta (59.43)
alternative label: Medicinalväxter, farmakologi (59.43) @sv
alternative label: Mediciner (59.43) @sv
alternative label: Mediciner, biverkningar (59.43) @sv
alternative label: Mediciner, dosering och användning (59.43) @sv
alternative label: Mediciner, försäljning och distribution (59.43) @sv
alternative label: Mediciner, kontroll (59.43) @sv
alternative label: Mediciner, verkningar (59.43) @sv
alternative label: Myrkkykasvit, myrkkyoppi (59.43)
alternative label: Myrkkyoppi (59.43)
alternative label: Myrkkysienet, myrkkyoppi (59.43)
alternative label: Myrkyt (59.43)
alternative label: Narkoottiset aineet, lääkeaineoppi (59.43)
alternative label: Narkotika, farmakologi (59.43) @sv
alternative label: Narkotiska ämnen, farmakologi (59.43) @sv
alternative label: Naturmediciner (59.43) @sv
alternative label: Officinella växter, farmakologi (59.43) @sv
alternative label: Pakuri, luonnonlääkkeet (59.43)
alternative label: Penicillin (59.43) @sv
alternative label: Penisilliini (59.43)
alternative label: Reseptit, lääkeaineoppi (59.43)
alternative label: Rohdoskasvit, lääkeaineoppi (59.43)
alternative label: Rohdosoppi (59.43)
alternative label: Sivuvaikutukset, lääkeaineoppi (59.43)
alternative label: Toksikologia (59.43)
alternative label: Yhdisteet, lääkeaineoppi (59.43)
alternative label: Yrtit, luonnonparannus (59.43)
alternative label: Yrttilääkintä, lääkeaineoppi (59.43)
broader: Hoitomenetelmät
in scheme: YKL - Yleisten kirjastojen luokitusjärjestelmä
notation: 59.43
scope note: Hit allmänna verk i farmakologi och farmaci Hit också allmänna verk i toxikologi Mediciners och läkemedels fysikaliska och kemiska egenskaper, deras inverkan och biverkningar Dosering, användning och övervakning av mediciner Medicinalväxter och örter ur farmakologins synvinkel Naturmediciner. Homeopati Apoteksverksamhet. Distribution av mediciner Om verket innehåller både farmaci och odling eller samlande av medicinalväxter, ges företräde åt klass 67.35. Behandling av en enskild sjukdom förs till den ifrågavarande sjukdomens klass 59.5+ @sv
scope note: Tähän farmakologian ja farmasian yleisteokset Tähän myös myrkkyopin yleisteokset Lääkkeiden ja lääkeaineiden fysikaaliset ja kemialliset ominaisuudet, vaikutukset ja sivuvaikutukset Lääkkeiden annostelu, käyttö ja valvonta Lääke- ja yrttikasvit lääkeaineopin kannalta Luonnonlääkkeet. Homeopatia Apteekkitoiminta. Lääkkeiden jakelu Jos teoksessa on sekä farmasiaa että lääkekasvien viljelyä tai keräilyä, annetaan etusija luokalle 67.35 Tietyn taudin lääkehoito luokitetaan ko. taudin luokkaan 59.5+

Kirurgia. Leikkaushoito
type: Concept
References: Akupunktio. Akupainanta. Vyöhyketerapia
References: Liikuntaelimet. Liikuntaelinten taudit
References: Veri. Veritaudit. Verenkiertoelimet. Verenkiertoelinten taudit
type: YKL-luokka
alternative label: Amputaatiot, kirurgia (59.48)
alternative label: Amputationer, kirurgi (59.48) @sv
alternative label: Anestesiologi (59.48) @sv
alternative label: Anestesiologia (59.48)
alternative label: Antiseptiikka, kirurgia (59.48)
alternative label: Antiseptik, kirurgi (59.48) @sv
alternative label: Aseptiikka, kirurgia (59.48)
alternative label: Aseptik, kirurgi (59.48) @sv
alternative label: Elimensiirrot (59.48)
alternative label: Elinsiirrot (59.48)
alternative label: Kirurgi (59.48) @sv
alternative label: Kirurgia (59.48)
alternative label: Kudossiirrot (59.48)
alternative label: Laserhoito, kirurgia (59.48)
alternative label: Laservård, kirurgi (59.48) @sv
alternative label: Leikkaushoito (59.48)
alternative label: Narkoslära (59.48) @sv
alternative label: Nukutusoppi (59.48)
alternative label: Operativ behandling (59.48) @sv
alternative label: Organtransplantationer (59.48) @sv
alternative label: Plastiikkakirurgia (59.48)
alternative label: Plastikkirurgi (59.48) @sv
alternative label: Puudutusoppi (59.48)
alternative label: Vävnadstransplantationer (59.48) @sv
broader: Hoitomenetelmät
in scheme: YKL - Yleisten kirjastojen luokitusjärjestelmä
notation: 59.48
preferred label: Kirurgi. Kirurgisk vård @sv
preferred label: Surgery. Surgical treatment @en
scope note: Hit allmänna verk om kirurgi, kirurgisk vård och laservård. Plastikkirurgi Organ- och bindvävstransplantationer i allmänhet Hit också anestesi- och bedövningslära Kirurgisk vård eller laservård samt transplantation av ett enskilt organ eller av bindväv förs till klassen för sjukdomen eller organet 59.5+ @sv
scope note: Tähän yleisteokset kirurgiasta, leikkaushoidosta ja laserhoidosta. Plastiikkakirurgia Elin- ja kudossiirrot yleensä Tähän myös nukutus- ja puudutusoppi Tietyn taudin leikkaus- tai laserhoito sekä tietyn elimen tai kudoksen siirto luokitetaan ko. taudin tai elimen luokkaan 59.5+

Saattohoito
type: Concept
References: Sielunhoito
References: Kriisipsykologia. Katastrofipsykologia. Surutyö
type: YKL-luokka
alternative label: Döden, lindringsvård (59.49) @sv
alternative label: Döden, terminalvård (59.49) @sv
alternative label: Hospicevård (59.49) @sv
alternative label: Kuolema, saattohoito (59.49)
alternative label: Kuolema, terminaalihoito (59.49)
alternative label: Lindringsvård (59.49) @sv
alternative label: Mental hälsa, lindringsvård (59.49) @sv
alternative label: Mielenterveys, saattohoito (59.49)
alternative label: Oireenmukainen hoito, saattohoito (59.49)
alternative label: Palliatiivinen hoito (59.49)
alternative label: Palliativ vård (59.49) @sv
alternative label: Saattohoito (59.49)
alternative label: Saattohoitokodit (59.49)
alternative label: Sorgearbete, lindringsvård (59.49) @sv
alternative label: Surutyö, saattohoito (59.49)
alternative label: Terminaalihoito (59.49)
alternative label: Terminalvård (59.49) @sv
broader: Hoitomenetelmät
in scheme: YKL - Yleisten kirjastojen luokitusjärjestelmä
notation: 59.49
preferred label: Lindringsvård. Terminalvård @sv
preferred label: Terminal care @en
scope note: Lindringshem. Hospicevård Hit också lindringsvård ur mentalhygienisk synvinkel @sv
scope note: Terminaalihoito. Saattohoitokodit Tähän myös saattohoito mielenterveyden kannalta

Elimet. Taudit
type: Concept
References: LÄÄKETIEDE. TERVEYDENHOITO
References: Lääketieteellinen biologia
References: Sairaalatekniikka
References: Tapaturmantorjunta. Ensiapu
References: Työterveyshuolto. Opiskeluterveydenhuolto Kouluterveydenhoitajan työ
References: Oikeuslääketiede
References: Urheilulääketiede
References: Hoitomenetelmät
alternative label: Akuuttihoito, eri taudit (59.5+)
alternative label: Amalgaamisairaudet (59.5+)
alternative label: Autoimmuunisairaudet (59.5+)
alternative label: Autoimmuunitaudit (59.5+)
alternative label: Biopsia (59.5+)
alternative label: Crouzonin oireyhtymä (59.5)
alternative label: Diagnostiikka, lääketiede (59.5+)
alternative label: Elektrodiagnostiikka, lääketiede (59.5+)
alternative label: Elimet, ihminen, yksittäiset (59.5+)
alternative label: Elinoppi, ihminen, yksittäiset elimet (59.5+)
alternative label: Ennusteet, lääketiede (59.5+)
alternative label: Epämuodostumat (59.5+)
alternative label: Etiologia (59.5+)
alternative label: Fysikaalinen taudinmääritys (59.5+)
alternative label: Geenivirheet, perinnölliset sairaudet (59.5+)
alternative label: Hivenaineet, puutostaudit (59.5)
alternative label: Hoitovirheet, eri taudit (59.5+)
alternative label: Invalidit, lääketiede (59.5+)
alternative label: Jalkojenhoito, tietyn taudin kannalta (59.5+)
alternative label: Jälkitaudit (59.5+)
alternative label: Kemiallinen taudinmääritys (59.5+)
alternative label: Kipu, oireoppi (59.5+)
alternative label: Kivennäisaineet, puutostaudit (59.5)
alternative label: Kliininen fysiologia (59.5)
alternative label: Kliininen lääketiede (59.5+)
alternative label: Kooma (59.5+)
alternative label: Laboratoriotutkimukset, lääketiede (59.5+)
alternative label: Liitännäissairaudet (59.5+)
alternative label: Loiset, lääketiede, eri taudit (59.5+)
alternative label: Lyhytkasvuiset, lääketiede (59.5+)
alternative label: Lääketiede, kliininen (59.5+)
alternative label: Lääketieteelliset laboratoriot (59.5+)
alternative label: Lääketieteelliset laitteet, diagnostiikka (59.5+)
alternative label: Mikroskooppinen taudinmääritys (59.5+)
alternative label: Nanohiukkaset, taudinaiheuttajat (59.5+)
alternative label: Näytepalatutkimukset (59.5+)
alternative label: Oireoppi (59.5+)
alternative label: Oma-apuryhmät, eri taudit (59.5+)
alternative label: Organologia, ihminen, yksittäiset elimet (59.5+)
alternative label: Parantuminen (59.5+)
alternative label: Parasitologia, lääketiede, eri taudit (59.5+)
alternative label: Patologia (59.5+)
alternative label: Perinnölliset sairaudet (59.5+)
alternative label: Pienhiukkaset, taudinaiheuttajat (59.5+)
alternative label: Potilasvahingot, eri taudit (59.5+)
alternative label: Prognoosit, lääketiede (59.5+)
alternative label: Psykosomaattiset sairaudet (59.5+)
alternative label: Puutostaudit, lääketiede (59.5)
alternative label: Radiodiagnostiikka, lääketiede (59.5+)
alternative label: Röntgenkuvaus (59.5+)
alternative label: Sairaudet, lääketiede (59.5+)
alternative label: Surkastumat, patologia (59.5+)
alternative label: Säteilysairaus (59.5)
alternative label: Taudinaiheuttajat (59.5+)
alternative label: Taudinkulku (59.5+)
alternative label: Taudinmääritys (59.5+)
alternative label: Taudinsyyt (59.5+)
broader: LÄÄKETIEDE. TERVEYDENHOITO
in scheme: YKL - Yleisten kirjastojen luokitusjärjestelmä
narrower: Tartuntataudit
narrower: Liikuntaelimet. Liikuntaelinten taudit
narrower: Sisäelimet. Sisätaudit
narrower: Syöpätaudit
narrower: Hermosto. Neurologia
narrower: Psykiatria
narrower: Gynekologia
narrower: Allergiset taudit. Iho. Ihotaudit
narrower: Aistinelimet. Silmätaudit. Kurkku-, nenä- ja korvataudit
notation: 59.5
scope note: Hit allmänna verk om patologi och sjukdomar Sjukdomsorsaker. Etiologi Sjukdomsförlopp. Anamnes. Prognoser. Tillfisknande Diagnos. Symtomlära. Diagnostik Fysikaliska diagnosmetoder Elektro-, röntgen- och radiodiagnostik Laboratorieundersökningar Mikroskopisk och kemisk diagnos Provbitsundersökning. Biopsi Hit också allmänna verk om ärftliga sjukdomar och psykosomatiska sjukdomar Hit också bristsjukdomar samt strålsjuka Hit och till underklasserna också autoimmuna sjukdomar Hit och till underklasserna också specialdieter vid behandling av en bestämd sjukdom Hit och till underklasserna också memoarer och biografier där det väsentliga innehållet utgörs av en enskild sjukdom Ett enskilt organs eller en enskild organgrupps normala funktioner, anatomi och fysiologi, patologi, sjukdomar och vården av dem samt sjukdomssymptom och diagnostik förs till ifrågavarande organs eller sjukdoms klass 59.51-59.9 @sv
scope note: Tähän patologiaa ja tauteja koskevat yleisteokset Taudinsyyt. Etiologia Taudin kulku. Ennusteet. Tervehtyminen Taudinmääritys. Oireoppi. Diagnostiikka Fysikaaliset taudinmääritysmenetelmät Elektro-, röntgen- ja radiodiagnostiikka Laboratoriotutkimukset Mikroskooppinen ja kemiallinen taudinmääritys Näytepalatutkimukset. Biopsia Tähän myös yleisteokset perinnöllisistä sairauksista ja psykosomaattisista sairauksista Tähän myös puutostaudit sekä säteilysairaus Tähän ja alaluokkiin myös autoimmuunisairaudet Tähän ja alaluokkiin myös tietyn taudin hoitoon liittyvät erikoisruokavaliot Tähän ja alaluokkiin myös muistelmat ja elämäkerrat, joissa tietty sairaus on teoksen keskeinen sisältö Tiettyyn perussairauteen liittyvät liitännäissairaudet sijoitetaan liitännäissairauden, ei perussairauden luokkaan, esim. diabetekseen liittyvä silmäsairaus luokitetaan silmätauteihin, ei diabetekseen Tietyn elimen tai elinryhmän normaali toiminta, anatomia ja fysiologia, patologia, taudit ja niiden hoito sekä tautien oireet ja diagnostiikka luokitetaan ko. elimen tai taudin luokkaan 59.51-59.9

Tartuntataudit
type: Concept
References: Lääketieteellinen mikrobiologia. Immunologia
References: Yleinen terveydenhoito
References: Hengityselimet. Hengityselinten taudit
References: Lasten terveydenhoito. Lastentaudit
alternative label: AIDS (59.51)
alternative label: Bakteeritaudit (59.51+)
alternative label: Bakteriesjukdomar (59.51+) @sv
alternative label: Barnförlamning (59.51) @sv
alternative label: Barnsjukdomar, smittsamma sjukdomar (59.51) @sv
alternative label: Borrelioosi (59.51)
alternative label: Borrelios (59.51) @sv
alternative label: Difteri (59.51) @sv
alternative label: Epidemiat (59.51+)
alternative label: Epidemier (59.51+) @sv
alternative label: Epidemiologi, epidemilära (59.51) @sv
alternative label: Epidemiologia, kulkutautioppi (59.51)
alternative label: Farsoter (59.51+) @sv
alternative label: Fästingburen encefalit (59.51) @sv
alternative label: Förkylningssjukdomar (59.51) @sv
alternative label: HIV-smitta (59.51) @sv
alternative label: HIV-tartunta (59.51)
alternative label: Hinkuyskä (59.51)
alternative label: Immunitetsbrist (59.51) @sv
alternative label: Immuunikato (59.51)
alternative label: Infektionssjukdomar (59.51+) @sv
alternative label: Infektiotaudit (59.51+)
alternative label: Inflammationer. (59.51) @sv
alternative label: Influensor (59.51) @sv
alternative label: Influenssat (59.51)
alternative label: Isorokko (59.51)
alternative label: Kikhosta (59.51) @sv
alternative label: Kolera (59.51)
alternative label: Koppor (59.51) @sv
alternative label: Kulkutaudit (59.51+)
alternative label: Kurkkumätä (59.51)
alternative label: Lapsihalvaus (59.51)
alternative label: Lastentaudit, tartuntataudit (59.51)
alternative label: Lavantaudit (59.51)
alternative label: Magsjukdomar, smittsamma sjukdomar (59.51) @sv
alternative label: Mahataudit, tartuntataudit (59.51)
alternative label: Malaria (59.51)
alternative label: Mykoplasmainfektioner (59.51) @sv
alternative label: Mykoplasmainfektiot (59.51)
alternative label: Myyräkuume (59.51)
alternative label: Pandemiat, yl. (59.51)
alternative label: Pandemier, allm. (59.51) @sv
alternative label: Pest (59.51) @sv
alternative label: Polio (59.51)
alternative label: Punatauti (59.51)
alternative label: Puutiaisaivotulehdus (59.51)
alternative label: Påssjuka (59.51) @sv
alternative label: Rokot (59.51)
alternative label: Rutto (59.51)
alternative label: Rödsot (59.51) @sv
alternative label: Sikotauti (59.51)
alternative label: Smittkoppor (59.51) @sv
alternative label: Smittsamma sjukdomar (59.51+) @sv
alternative label: Sorkfeber (59.51) @sv
alternative label: Suolistotaudit, tartuntataudit (59.51)
alternative label: Sömnsjuka (59.51) @sv
alternative label: TBE (59.51)
alternative label: Tarmsjukdomar, smittsamma sjukdomar (59.51) @sv
alternative label: Tartuntataudit (59.51+)
alternative label: Trooppiset tartuntataudit (59.51)
alternative label: Tropiska smittsamma sjukdomar (59.51) @sv
alternative label: Tuberkuloosi (59.51)
alternative label: Tuberkulos (59.51) @sv
alternative label: Tulehdukset (59.51)
alternative label: Unitauti (59.51)
alternative label: Vatsataudit, tartuntataudit (59.51)
alternative label: Vilustumissairaudet (59.51)
alternative label: Virustaudit (59.51+)
alternative label: Zoonoosit, tartuntataudit (59.51+)
broader: Elimet. Taudit
in scheme: YKL - Yleisten kirjastojen luokitusjärjestelmä
narrower: Sukupuolitaudit
notation: 59.51
scope note: Smittsamma sjukdomar och epidemier i allmänhet. Epidemiologi Virus- och bakteriesjukdomar i allmänhet. Infektionssjukdomar i allmänhet Tuberkulos i allmänhet Smittsamma barnsjukdomar. Smittsamma tropiska sjukdomar Aids. Borrelios. Difteri. Fästingburen encefalit. HIV-smitta. Influensa. Kikhosta. Kolera. Koppor. Malaria. Mykoplasmainfektioner. Polio. Påssjuka. Rödsot. Sorkfeber. Sömnsjuka. Tyfus @sv
scope note: Tartunta- ja kulkutaudit sekä niiden epidemiologia yleensä Virus- ja bakteeritaudit yleensä. Tulehdussairaudet yleensä Tuberkuloosi yleensä Lasten tartuntataudit. Trooppiset tartuntataudit AIDS. Borrelioosi. Hinkuyskä. HIV-tartunta. Influenssat. Kolera. Kurkkumätä. Lavantaudit. Malaria. Mykoplasmainfektiot. Myyräkuume. Polio. Punatauti. Puutiaisaivotulehdus. Rokot. Sikotauti. Unitauti

Sukupuolitaudit
type: Concept
References: Seksologia
References: Tartuntataudit
References: Virtsaelimet. Virtsaelinten taudit
References: Gynekologia
type: YKL-luokka
alternative label: Könssjukdomar (59.511) @sv
alternative label: Lisääntymisterveys, sukupuolitaudit (59.511)
alternative label: Reproduktiv hälsa, könssjukdomar (59.511) @sv
alternative label: Seksitaudit (59.511)
alternative label: Seksuaaliterveys, sukupuolitaudit (59.511)
alternative label: Sexsjukdomar (59.511) @sv
alternative label: Sexualhälsa, könssjukdomar (59.511) @sv
alternative label: Sukupuolitaudit (59.511)
alternative label: Veneeriset taudit (59.511)
alternative label: Veneriska sjukdomar (59.511) @sv
broader: Tartuntataudit
in scheme: YKL - Yleisten kirjastojen luokitusjärjestelmä
notation: 59.511
preferred label: Könssjukdomar @sv
preferred label: Venereal diseases @en

Liikuntaelimet. Liikuntaelinten taudit
type: Concept
References: Vammaispalvelut
References: Erityisopetus. Erityiskasvatus, liikuntavammaiset
References: Urheilulääketiede
References: Optiset ja lääketieteelliset laitteet
References: Kuntoliikunta. Kuntourheilu
type: YKL-luokka
alternative label: Amputaatiot, ortopedia (59.52)
alternative label: Amputationer, ortopedi (59.52) @sv
alternative label: Bråck (59.52) @sv
alternative label: Fel i ryggen (59.52) @sv
alternative label: Handikappade, ortopedi (59.52) @sv
alternative label: Ischkias (59.52) @sv
alternative label: Iskias (59.52)
alternative label: Jänteet, ihminen (59.52)
alternative label: Jänteet, taudit (59.52)
alternative label: Leder, människan (59.52) @sv
alternative label: Leder, sjukdomar (59.52) @sv
alternative label: Ledgångsreumatism (59.52) @sv
alternative label: Lihaksisto, ihminen (59.52)
alternative label: Lihaksisto, taudit (59.52)
alternative label: Liikuntaelimet, ihminen (59.52)
alternative label: Liikuntaelimet, taudit (59.52)
alternative label: Liikuntavammaiset, lääketiede (59.52)
alternative label: Luusto, ihminen (59.52)
alternative label: Luusto, taudit (59.52)
alternative label: Muskulatur, människan (59.52) @sv
alternative label: Muskulatur, sjukdomar (59.52) @sv
alternative label: Nivelet, ihminen (59.52)
alternative label: Nivelet, taudit (59.52)
alternative label: Nivelreuma (59.52)
alternative label: Ortopedi (59.52) @sv
alternative label: Ortopedia (59.52)
alternative label: Osteoporoosi (59.52)
alternative label: Osteoporos (59.52) @sv
alternative label: Proteesit, ortopedia (59.52)
alternative label: Proteser, ortopedi (59.52) @sv
alternative label: Pyörätuolit (59.52)
alternative label: Reumataudit (59.52)
alternative label: Reumatiska sjukdomar (59.52) @sv
alternative label: Rullstolar (59.52) @sv
alternative label: Rörelsehandikappade, medicin (59.52) @sv
alternative label: Rörelseorgan, människan (59.52) @sv
alternative label: Rörelseorgan, sjukdomar (59.52) @sv
alternative label: Rörelseorganen (59.52) @sv
alternative label: Selkäviat (59.52)
alternative label: Senor, människan (59.52) @sv
alternative label: Senor, sjukdomar (59.52) @sv
alternative label: Skelettet, människan (59.52) @sv
alternative label: Skelettet, sjukdomar (59.52) @sv
alternative label: Traumatologi (59.52) @sv
alternative label: Traumatologia (59.52)
alternative label: Tuki- ja liikuntaelimet (59.52)
alternative label: Tyrät (59.52)
alternative label: Vammaiset, ortopedia (59.52)
broader: Elimet. Taudit
in scheme: YKL - Yleisten kirjastojen luokitusjärjestelmä
notation: 59.52
preferred label: Rörelseorgan. Sjukdomar i rörelseorganen @sv
preferred label: The skeleto-muscular system. Skeleto-muscular diseases @en
scope note: Ortopedi. Traumatologi Ben, muskler, leder och senor samt sjukdomar i dem Reumatism Hit också medicinsk vård, rehabilitering, hjälpmedel och proteser för rörelsehindrade @sv
scope note: Ortopedia. Traumatologia Luut, lihakset, nivelet ja jänteet sekä niiden taudit Reuma Tähän myös liikuntavammaisten lääketieteellinen hoito, kuntoutus, apuvälineet ja proteesit

Sisäelimet. Sisätaudit
type: Concept
References: Tartuntataudit
References: Liikuntaelimet. Liikuntaelinten taudit
type: YKL-luokka
alternative label: Inre organ, människan (59.53+) @sv
alternative label: Inre organ, sjukdomar (59.53+) @sv
alternative label: Invärtes sjukdomar (59.53+) @sv
alternative label: Låggradig inflammation (59.53) @sv
alternative label: Matala-asteinen tulehdus (59.53)
alternative label: Sisäelimet, ihminen (59.53+)
alternative label: Sisäelimet, taudit (59.53+)
alternative label: Sisätaudit (59.53+)
broader: Elimet. Taudit
in scheme: YKL - Yleisten kirjastojen luokitusjärjestelmä
narrower: Hengityselimet. Hengityselinten taudit
narrower: Sisäeritysrauhaset. Aineenvaihduntataudit
narrower: Veri. Veritaudit. Verenkiertoelimet. Verenkiertoelinten taudit
narrower: Ruoansulatuselimet. Ruoansulatuselinten taudit
narrower: Virtsaelimet. Virtsaelinten taudit
notation: 59.53
preferred label: Inre organ. Invärtes sjukdomar @sv
preferred label: Viscera. Internal diseases @en
scope note: Hit och till underklasserna inre organ och invärtes sjukdomar @sv
scope note: Tähän ja alaluokkiin sisäelimet ja sisätaudit

Hengityselimet. Hengityselinten taudit
type: Concept
References: Tartuntataudit
References: Allergiset taudit. Iho. Ihotaudit
References: Aistinelimet. Silmätaudit. Kurkku-, nenä- ja korvataudit
type: YKL-luokka
alternative label: Andningsorgan, människan (59.532) @sv
alternative label: Andningsorgan, sjukdomar (59.532) @sv
alternative label: Andningsstillestånd (59.532) @sv
alternative label: Apnea (59.532)
alternative label: Apné (59.532) @sv
alternative label: Hengityselimet, ihminen (59.532)
alternative label: Hengityselimet, taudit (59.532)
alternative label: Henkitorvi, ihminen (59.532)
alternative label: Keuhkopussit, ihminen (59.532)
alternative label: Keuhkoputket, ihminen (59.532)
alternative label: Keuhkosairaudet (59.532)
alternative label: Keuhkosyöpä (59.532)
alternative label: Keuhkot, ihminen (59.532)
alternative label: Keuhkotauti (59.532)
alternative label: Luftrör, människan (59.532) @sv
alternative label: Luftstrupe, människan (59.532) @sv
alternative label: Lungcancer (59.532) @sv
alternative label: Lungor, människan (59.532) @sv
alternative label: Lungsjukdomar (59.532) @sv
alternative label: Lungsot (59.532) @sv
alternative label: Lungsäckar, människan (59.532) @sv
alternative label: Sömnapnésyndrom (59.532) @sv
alternative label: Tuberkuloosi, keuhkotuberkuloosi (59.532)
alternative label: Tuberkulos, lungtuberkulos (59.532) @sv
alternative label: Uniapnea (59.532)
broader: Sisäelimet. Sisätaudit
in scheme: YKL - Yleisten kirjastojen luokitusjärjestelmä
notation: 59.532
preferred label: Andningsorgan. Sjukdomar i andningsorganen @sv
preferred label: Respiratory organs. Respiratory diseases @en
scope note: Henkitorvi, keuhkoputket, keuhkot ja keuhkopussi sekä niiden sairaudet Keuhkotuberkuloosi. Keuhkosyöpä
scope note: Luftstrupen, bronkerna, lungorna och lungsäcken samt sjukdomar i dem Lungtuberkulos. Lungcancer @sv

Sisäeritysrauhaset. Aineenvaihduntataudit
type: Concept
References: Ihmisen fysiologia
References: Ravinto-oppi. Ruokavaliot
References: Ruoansulatuselimet. Ruoansulatuselinten taudit
References: Virtsaelimet. Virtsaelinten taudit
References: Gynekologia
type: YKL-luokka
alternative label: Adrenaliini, sisäeritys (59.533)
alternative label: Adrenalin, inre sekretion (59.533) @sv
alternative label: Aineenvaihduntataudit (59.533)
alternative label: Aivolisäke, ihminen (59.533)
alternative label: Aivolisäke, taudit (59.533)
alternative label: Binjurarna, människan (59.533) @sv
alternative label: Binjurarna, sjukdomar (59.533) @sv
alternative label: Bisköldkörtlarna, människan (59.533) @sv
alternative label: Bisköldkörtlarna, sjukdomar (59.533) @sv
alternative label: Bukspottkörteln, människan (59.533) @sv
alternative label: Bukspottkörteln, sjukdomar (59.533) @sv
alternative label: Diabetes (59.533)
alternative label: Endokriiniset taudit (59.533)
alternative label: Endokrina sjukdomar (59.533) @sv
alternative label: Endokrinologi, människans fysiologi (59.533) @sv
alternative label: Endokrinologia, ihmisen fysiologia (59.533)
alternative label: Haima, ihminen (59.533)
alternative label: Haima, taudit (59.533)
alternative label: Hjärnbihang, människan (59.533) @sv
alternative label: Hjärnbihang, sjukdomar (59.533) @sv
alternative label: Hormoner, människans fysiologi (59.533) @sv
alternative label: Hormonihäiriöt (59.533)
alternative label: Hormonit, ihmisen fysiologia (59.533)
alternative label: Hormonrubbningar (59.533) @sv
alternative label: Inre sekretion, människan (59.533) @sv
alternative label: Inresekretoriska körtlarna, människan (59.533) @sv
alternative label: Inresekretoriska körtlarna, sjukdomar (59.533) @sv
alternative label: Insuliini (59.533)
alternative label: Insulin (59.533) @sv
alternative label: Keliaki (59.533) @sv
alternative label: Keliakia (59.533)
alternative label: Kilpirauhanen, ihminen (59.533)
alternative label: Kilpirauhanen, taudit (59.533)
alternative label: Koma, diabetes (59.533) @sv
alternative label: Kooma, diabetes (59.533)
alternative label: Körtelfysiologi, människan (59.533) @sv
alternative label: Laktoosi-intoleranssi (59.533)
alternative label: Laktosintolerans (59.533) @sv
alternative label: Lisäkilpirauhaset, ihminen (59.533)
alternative label: Lisäkilpirauhaset, taudit (59.533)
alternative label: Lisämunuaiset, ihminen (59.533)
alternative label: Lisämunuaiset, taudit (59.533)
alternative label: Maito, laktoosi-intoleranssi (59.533)
alternative label: Mjölk, laktosintolerans (59.533) @sv
alternative label: Rauhasfysiologia, ihminen (59.533)
alternative label: Sisäeritys, ihminen (59.533)
alternative label: Sisäeritysrauhaset, ihminen (59.533)
alternative label: Sisäeritysrauhaset, taudit (59.533)
alternative label: Sköldkörteln, människan (59.533) @sv
alternative label: Sköldkörteln, sjukdomar (59.533) @sv
alternative label: Sockersjuka (59.533) @sv
alternative label: Sokeritauti (59.533)
alternative label: Spannmålsprodukter, celiaki (59.533) @sv
alternative label: Struma (59.533) @sv
alternative label: Struuma (59.533)
alternative label: Viljatuotteet, keliakia (59.533)
alternative label: Ämnesomsättningssjukdomar (59.533) @sv
broader: Sisäelimet. Sisätaudit
in scheme: YKL - Yleisten kirjastojen luokitusjärjestelmä
notation: 59.533
preferred label: Endocrinal glands. Metabolic diseases. @en
preferred label: Inresekretoriska körtlar. Ämnesomsättningssjukdomar @sv
scope note: Inresekretoriska körtlar och sjukdomar i dem Hypofysen, sköldkörteln, bisköldkörteln, binjuren och bukspottkörteln samt sjukdomar i dem Störningar i ämnesomsättningen. Struma. Diabetes Celiaki. Laktosintolerans @sv
scope note: Sisäeritysrauhaset ja niiden taudit Aivolisäke, kilpirauhanen, lisäkilpirauhanen, lisämunuainen ja haima sekä niiden taudit Aineenvaihduntahäiriöt. Struuma. Diabetes Keliakia. Laktoosi-intoleranssi

Veri. Veritaudit. Verenkiertoelimet. Verenkiertoelinten taudit
type: Concept
type: YKL-luokka
alternative label: Anemi (59.534) @sv
alternative label: Anemia (59.534)
alternative label: Aneurysm (59.534) @sv
alternative label: Aneurysma (59.534)
alternative label: Artärerna (59.534) @sv
alternative label: Benmärg, människan (59.534) @sv
alternative label: Benmärg, sjukdomar (59.534) @sv
alternative label: Blod, människan (59.534) @sv
alternative label: Blodbildande organ, människan (59.534) @sv
alternative label: Blodcirkulation, människan (59.534) @sv
alternative label: Blodgrupper (59.534) @sv
alternative label: Blodkärlen (59.534) @sv
alternative label: Blodproppar (59.534) @sv
alternative label: Blodprov (59.534) @sv
alternative label: Blodsjukdomar (59.534) @sv
alternative label: Blodtransfusioner (59.534) @sv
alternative label: Blodtryckssjukdomar (59.534) @sv
alternative label: Bypassoperationer, hjärtsjukdomar (59.534) @sv
alternative label: Cirkulationsorganen, sjukdomar (59.534) @sv
alternative label: EKG (59.534)
alternative label: Elektrokardiografi (59.534) @sv
alternative label: Elektrokardiografia (59.534)
alternative label: Hematologi (59.534) @sv
alternative label: Hematologia (59.534)
alternative label: Hjärtat, människan (59.534) @sv
alternative label: Hjärtkirurgi (59.534) @sv
alternative label: Hjärtsjukdomar (59.534) @sv
alternative label: Hjärttransplantationer (59.534) @sv
alternative label: Imusuonisto, ihminen (59.534)
alternative label: Imusuonisto, taudit (59.534)
alternative label: Kardiologi (59.534) @sv
alternative label: Kardiologia (59.534)
alternative label: Kolesterol, hjärt- och blodkärlssjukdomar (59.534) @sv
alternative label: Kolesteroli, sydän- ja verisuonitaudit (59.534)
alternative label: Laskimot (59.534)
alternative label: Leukemi (59.534) @sv
alternative label: Leukemia (59.534)
alternative label: Luuydin, ihminen (59.534)
alternative label: Luuydin, taudit (59.534)
alternative label: Lymfsystemet, människan (59.534) @sv
alternative label: Lymfsystemet, sjukdomar (59.534) @sv
alternative label: Mjälten, människan (59.534) @sv
alternative label: Mjälten, sjukdomar (59.534) @sv
alternative label: Ohitusleikkaukset, sydäntaudit (59.534)
alternative label: Perna, ihminen (59.534)
alternative label: Perna, taudit (59.534)
alternative label: Sydämensiirrot (59.534)
alternative label: Sydän, ihminen (59.534)
alternative label: Sydänkirurgia (59.534)
alternative label: Sydäntaudit (59.534)
alternative label: Valtimot (59.534)
alternative label: Venerna (59.534) @sv
alternative label: Verenkierto, ihminen (59.534)
alternative label: Verenkiertoelimet, taudit (59.534)
alternative label: Verenpainetaudit (59.534)
alternative label: Verensiirrot (59.534)
alternative label: Veri, ihminen (59.534)
alternative label: Verikokeet (59.534)
alternative label: Verioppi (59.534)
alternative label: Veriryhmät (59.534)
alternative label: Verisuonet (59.534)
alternative label: Veritaudit (59.534)
alternative label: Veritulpat (59.534)
alternative label: Vertamuodostavat elimet, ihminen (59.534)
broader: Sisäelimet. Sisätaudit
in scheme: YKL - Yleisten kirjastojen luokitusjärjestelmä
notation: 59.534
preferred label: Blod. Blodsjukdomar. Cirkulationsorgan. Sjukdomar i cirkulationsorganen @sv
preferred label: Blood. Blood diseases. The circulatory system. Diseases of the circulatory system @en
scope note: Hit också blodbildande organ och sjukdomar i dem Hjärta, blodkärl, lymfkärl, lymfkörtlar, mjälte och benmärg samt sjukdomar i dem. Leukemi Hematologi. Blodgrupper. Blodtransfusioner. Blodprov Hjärtkirurgi. Hjärttransplantationer @sv
scope note: Tähän myös vertamuodostavat elimet ja niiden taudit Sydän, verisuonet, imusuonet, imurauhaset, perna ja luuydin sekä niiden taudit. Leukemia Verioppi. Veriryhmät. Verensiirrot. Verikokeet Sydänkirurgia. Sydämensiirrot

Ruoansulatuselimet. Ruoansulatuselinten taudit
type: Concept
References: Ravinto-oppi. Ruokavaliot
References: Tartuntataudit
References: Sisäeritysrauhaset. Aineenvaihduntataudit
References: Aistinelimet. Silmätaudit. Kurkku-, nenä- ja korvataudit
type: YKL-luokka
alternative label: Bukhinnan, människan (59.535) @sv
alternative label: Bukhålan (59.535) @sv
alternative label: Gallan, människan (59.535) @sv
alternative label: Gallsjukdomar (59.535) @sv
alternative label: Levern, människan (59.535) @sv
alternative label: Levern, sjukdomar (59.535) @sv
alternative label: Magcancer (59.535) @sv
alternative label: Magsjukdomar (59.535) @sv
alternative label: Magsjukomar (59.535) @sv
alternative label: Magsäcken, människan (59.535) @sv
alternative label: Magsår (59.535) @sv
alternative label: Mahahaava (59.535)
alternative label: Mahalaukku, ihminen (59.535)
alternative label: Mahasyöpä (59.535)
alternative label: Mahataudit (59.535)
alternative label: Maksa, ihminen (59.535)
alternative label: Maksa, taudit (59.535)
alternative label: Matsmältning, människan (59.535) @sv
alternative label: Matsmältning, sjukdomar (59.535) @sv
alternative label: Matsmältningsorganen, människan (59.535) @sv
alternative label: Matstrupen, människan (59.535) @sv
alternative label: Munhålans sjukdomar, medicin (59.535) @sv
alternative label: Ruoansulatus, ihminen (59.535)
alternative label: Ruoansulatuselimet, ihminen (59.535)
alternative label: Ruoansulatuselimet, taudit (59.535)
alternative label: Ruokatorvi, ihminen (59.535)
alternative label: Sappi, ihminen (59.535)
alternative label: Sappitaudit (59.535)
alternative label: Suolisto, ihminen (59.535)
alternative label: Suolistotaudit (59.535)
alternative label: Suuontelon taudit, lääketiede (59.535)
alternative label: Tarmsjukdomar (59.535) @sv
alternative label: Tarmsystemet, människan (59.535) @sv
alternative label: Vatsahaava (59.535)
alternative label: Vatsakalvo, ihminen (59.535)
alternative label: Vatsalaukku, ihminen (59.535)
alternative label: Vatsaontelo, ihminen (59.535)
alternative label: Vatsasyöpä (59.535)
alternative label: Vatsataudit (59.535)
broader: Sisäelimet. Sisätaudit
in scheme: YKL - Yleisten kirjastojen luokitusjärjestelmä
notation: 59.535
preferred label: Matsmältningsorgan. Sjukdomar i matsmältningsorganen @sv
preferred label: The digestive system. Diseases of the digestive system @en
scope note: Matstrupen, magsäcken, tarmsystemet, levern, gallan, bukhinnan och bukhålan samt sjukdomar i dem Magsår. Mag- och tarmcancer @sv
scope note: Ruokatorvi, vatsalaukku, suolisto, maksa, sappi, vatsakalvo ja vatsaontelo sekä niiden taudit Mahahaava. Maha- ja suolistosyöpä

Virtsaelimet. Virtsaelinten taudit
type: Concept
References: Seksologia
References: Sukupuolitaudit
References: Gynekologia
type: YKL-luokka
alternative label: Barnlöshet, urologi (59.536) @sv
alternative label: Dialysbehandling (59.536) @sv
alternative label: Dialyysihoito (59.536)
alternative label: Eturauhanen (59.536)
alternative label: Eturauhanen, taudit (59.536)
alternative label: Eturauhassyöpä (59.536)
alternative label: Hedelmättömyys, miehen (59.536)
alternative label: Hormoner, urologi (59.536) @sv
alternative label: Hormonit, urologia (59.536)
alternative label: Keinomunuaishoito (59.536)
alternative label: Kivekset, ihminen (59.536)
alternative label: Kivekset, taudit (59.536)
alternative label: Könskörtlarna, mannens (59.536) @sv
alternative label: Könsorganen, hos mannen, medicin (59.536) @sv
alternative label: Lapsettomuus, urologia (59.536)
alternative label: Lisääntymisterveys, miehen hedelmättömyys (59.536)
alternative label: Lisääntymisterveys, urologia (59.536)
alternative label: Munuaiset, ihminen (59.536)
alternative label: Munuaiset, taudit (59.536)
alternative label: Munuaissiirrot (59.536)
alternative label: Njurarna, människan (59.536) @sv
alternative label: Njurarna, sjukdomar (59.536) @sv
alternative label: Njurtransplantationer (59.536) @sv
alternative label: Omskärelse, medicin, mannens (59.536) @sv
alternative label: Prostata (59.536) @sv
alternative label: Prostata, sjukdomar (59.536) @sv
alternative label: Prostatacancer (59.536) @sv
alternative label: Reproduktiv hälsa, sterilitet hos mannen (59.536) @sv
alternative label: Reproduktiv hälsa, urologi (59.536) @sv
alternative label: Seksuaaliterveys, miehen hedelmättömyys (59.536)
alternative label: Seksuaaliterveys, urologia (59.536)
alternative label: Sexualhälsa, sterilitet hos mannen (59.536) @sv
alternative label: Sexualhälsa, urologi (59.536) @sv
alternative label: Sterilitet, manlig (59.536) @sv
alternative label: Sukupuolielimet, miehen, lääketiede (59.536)
alternative label: Sukupuolirauhaset, miehen (59.536)
alternative label: Testiklar, människan (59.536) @sv
alternative label: Testiklar, sjukdomar (59.536) @sv
alternative label: Urin, människan (59.536) @sv
alternative label: Urinorgan, människan (59.536) @sv
alternative label: Urinorgan, sjukdomar (59.536) @sv
alternative label: Urinprov (59.536) @sv
alternative label: Urologi (59.536) @sv
alternative label: Urologia (59.536)
alternative label: Virtsa, ihminen (59.536)
alternative label: Virtsaelimet, ihminen (59.536)
alternative label: Virtsaelintaudit (59.536)
alternative label: Virtsakokeet (59.536)
alternative label: Ympärileikkaus, lääketiede, miehen (59.536)
broader: Sisäelimet. Sisätaudit
in scheme: YKL - Yleisten kirjastojen luokitusjärjestelmä
notation: 59.536
preferred label: Urinary organs. Diseases of the urinary system @en
preferred label: Urinvägsorganen. Sjukdomar i urinvägsorganen @sv
scope note: Urologi Njurar, urinledare, urinrör och urinblåsa samt sjukdomar i dem Urin. Urinprov. Njurtransplantationer. Dialys Mannens könsorgan och könskörtlar samt sjukdomar i dem Testiklarna och prostatan samt sjukdomar i dem. Prostatacancer Sterilitet hos mannen @sv
scope note: Urologia Munuaiset, virtsanjohtimet, virtsaputki ja virtsarakko sekä niiden taudit Virtsa. Virtsakokeet. Munuaissiirrot. Dialyysihoito Miehen sukupuolielimet ja sukupuolirauhaset sekä niiden taudit Kivekset ja eturauhanen sekä niiden taudit. Eturauhassyöpä Miehen hedelmättömyys

Syöpätaudit
type: Concept
References: Hengityselimet. Hengityselinten taudit
References: Veri. Veritaudit. Verenkiertoelimet. Verenkiertoelinten taudit
References: Ruoansulatuselimet. Ruoansulatuselinten taudit
References: Gynekologia
References: Aistinelimet. Silmätaudit. Kurkku-, nenä- ja korvataudit
type: YKL-luokka
alternative label: Cancersjukdomar (59.54) @sv
alternative label: Cancersjukdomar, vård (59.54) @sv
alternative label: Cytostatvård, cancersjukdomar (59.54) @sv
alternative label: Karcinogener, cancersjukdomar (59.54) @sv
alternative label: Karsinogeenit, syöpätaudit (59.54)
alternative label: Kasvaimet (59.54)
alternative label: Radiologi, strålbehandling (59.54) @sv
alternative label: Radiologia, sädehoito (59.54)
alternative label: Radioterapi, cancersjukdomar (59.54) @sv
alternative label: Radioterapia, syöpätaudit (59.54)
alternative label: Radiumbehandling, cancersjukdomar (59.54) @sv
alternative label: Radiumhoito, syöpätaudit (59.54)
alternative label: Strålbehandling, cancersjukdomar (59.54) @sv
alternative label: Sytostaattihoito, syöpätaudit (59.54)
alternative label: Syöpätaudit (59.54)
alternative label: Syöpätaudit, hoito (59.54)
alternative label: Sädehoito, syöpätaudit (59.54)
alternative label: Tumörer (59.54) @sv
broader: Elimet. Taudit
in scheme: YKL - Yleisten kirjastojen luokitusjärjestelmä
notation: 59.54
preferred label: Cancerous diseases @en
preferred label: Cancersjukdomar @sv
scope note: Cancersjukdomar och tumörer, kirurgisk vård samt läkemedels-, cytostat- och strålbehandling av dem Cancer och tumörer i ett enskilt organ förs till det berörda organets eller den berörda organgruppens klass @sv
scope note: Syöpätaudit ja kasvaimet sekä niiden leikkaus-, lääke-, sytostaatti- ja sädehoito yleensä Tietyn elimen syöpä ja kasvaimet luokitetaan ko. elimen tai elinryhmän luokkaan

Hermosto. Neurologia
type: Concept
modified: 2026-05-08T08:00:39
References: Psyyken rakenne ja toiminnot
References: Vammaispalvelut
References: Erityisopetus. Erityiskasvatus, kehitysvammaiset
References: Psykiatria
alternative label: ADHD (59.55)
alternative label: ALS (59.55)
alternative label: Afasi (59.55) @sv
alternative label: Afasia (59.55)
alternative label: Aivohalvaus (59.55)
alternative label: Aivot, ihminen, yl. (59.55)
alternative label: Aivot, neurologia (59.55)
alternative label: Aivot, taudit (59.55)
alternative label: Aivovammat (59.55)
alternative label: Alzheimerin tauti (59.55)
alternative label: Aspergerin oireyhtymä (59.55)
alternative label: Autismi (59.55)
alternative label: Autonominen hermosto, ihminen (59.55)
alternative label: CP-oireyhtymä, neurologia (59.55)
alternative label: CP-vammaiset, neurologia (59.55)
alternative label: CP-vammaisuus, neurologia (59.55)
alternative label: Cerebral pares (CP) (59.55)
alternative label: DAMP (59.55)
alternative label: Dementia (59.55)
alternative label: Downin syndrooma, lääketiede (59.55)
alternative label: Dysartria, neurologia (59.55)
alternative label: Dysfasia, neurologia (59.55)
alternative label: Dysleksia, neurologia (59.55)
alternative label: Dyslogia, neurologia (59.55)
alternative label: Dyspraksia, neurologia (59.55)
alternative label: EEG (59.55)
alternative label: Elektroenkefalografia (59.55)
alternative label: Epilepsia (59.55)
alternative label: Fibromyalgia (59.55)
alternative label: Halvaus (59.55)
alternative label: Hermosto, ihminen (59.55)
alternative label: Hermosto, neurologia (59.55)
alternative label: Hermosto, taudit (59.55)
alternative label: Hermotautioppi (59.55)
alternative label: Jäykkyysoireyhtymä (59.55)
alternative label: Kaatumatauti (59.55)
alternative label: Kehityshäiriöt, neurologia (59.55)
alternative label: Kehitysvammaiset, neurologia (59.55)
alternative label: Keskushermosto, ihminen (59.55)
alternative label: Keskushermosto, taudit (59.55)
alternative label: MBD-oireyhtymä (59.55)
alternative label: MS-tauti (59.55)
alternative label: Matkapahoinvointi (59.55)
alternative label: Meritauti (59.55)
alternative label: Migreeni (59.55)
alternative label: Mongoloidismi (59.55)
alternative label: Muistihäiriöt, neurologia (59.55)
alternative label: Muistisairaudet (59.55)
alternative label: Myastenia (59.55)
alternative label: Myastenia gravis (59.55)
alternative label: Narkolepsia (59.55)
alternative label: Neurobiologia, ihminen (59.55)
alternative label: Neurofysiologia, ihminen (59.55)
alternative label: Neurofysiologia, neurologia (59.55)
alternative label: Neurologia (59.55)
alternative label: Neuroplastisuus, aivojen toiminta (59.55)
alternative label: Neurotieteet (59.55)
alternative label: Oligofrenia, neurologia (59.55)
alternative label: Parkinsonin tauti (59.55)
alternative label: Puhehäiriöt, neurologia (59.55)
alternative label: Puheviat, neurologia (59.55)
alternative label: SPS (59.55)
alternative label: Selkäydin, ihminen (59.55)
alternative label: Selkäydin, taudit (59.55)
alternative label: Tietoisuus, neurologia (59.55)
alternative label: Uni, neurologia (59.55)
alternative label: Unihäiriöt, unilääketiede (59.55)
alternative label: Unilääketiede (59.55)
alternative label: Ääreishermosto, ihminen (59.55)
broader: Elimet. Taudit
in scheme: YKL - Yleisten kirjastojen luokitusjärjestelmä
notation: 59.55
scope note: Hermoston elimelliset taudit. Neurofysiologia Keskushermosto, aivot, selkäydin, ääreis- ja autonominen hermosto sekä niiden taudit ja häiriöt Kehitysvammaisuus ja kehitysvammaisten lääketieteellinen hoito ADHD. Afasia. Alzheimerin tauti. Autismi. CP-oireyhtymä. DAMP. Dementia. Downin syndrooma. Epilepsia. Fibromyalgia. Halvaus. MBD-oireyhtymä. Matkapahoinvointi. Meritauti. Migreeni. MS-tauti. Narkolepsia. Parkinsonin tauti
scope note: Organiska sjukdomar i nervsystemet. Neurofysiologi Centrala nervsystemet, hjärnan, ryggmärgen, perifera och autonoma nervsystemet samt sjukdomar och störningar i dem Utvecklingsstörningar och medicinsk behandling av utvecklingsstörda ADHD. Afasi. Alzheimers sjukdom. Autism. Cerebral pares (CP). DAMP. Demens. Downs syndrom. Epilepsi. Fibromyalgi. Förlamning. Migrän. MBD-syndrom. Multipelskleros (MS). Narkolepsi. Parkinsons sjukdom. Åksjuka. Sjösjuka @sv

Psykiatria
type: Concept
References: PSYKOLOGIA
References: Hermosto. Neurologia
type: YKL-luokka
alternative label: Addiktioner allm. (59.56) @sv
alternative label: Addiktiot yl. (59.56)
alternative label: Aivot, psykiatria (59.56+)
alternative label: Asocialt beteende, psykiatri och mental hälsa (59.56+) @sv
alternative label: Barnpsykiatri (59.56+) @sv
alternative label: Beroende allm. (59.56) @sv
alternative label: Beteendestörningar, psykiatri och mental hälsa (59.56+) @sv
alternative label: Brottslighet, psykiatri (59.56+) @sv
alternative label: Hermosto, psykiatria (59.56+)
alternative label: Hjärnan, psykiatri (59.56+) @sv
alternative label: Itsetuhokäyttäytyminen (59.56+)
alternative label: Kehityshäiriöt, lapsi- ja nuorisopsykiatria (59.56+)
alternative label: Kriminaalipsykiatria (59.56+)
alternative label: Kriminalpsykiatri (59.56+) @sv
alternative label: Kulttuuripsykiatria (59.56+)
alternative label: Kulturpsykiatri (59.56+) @sv
alternative label: Käyttäytymishäiriöt, psykiatria ja mielenterveys (59.56+)
alternative label: Käytöshäiriöt, psykiatria ja mielenterveys (59.56+)
alternative label: Lapsipsykiatria (59.56+)
alternative label: Lastenpsykiatria (59.56+)
alternative label: Medvetenhet, psykiatri (59.56+) @sv
alternative label: Mielentilatutkimukset (59.56+)
alternative label: Mielitautioppi (59.56+)
alternative label: Nervsystemet, psykiatri (59.56+) @sv
alternative label: Neurofysiologi, psykiatri (59.56+) @sv
alternative label: Neurofysiologia, psykiatria (59.56+)
alternative label: Nuorisopsykiatria (59.56+)
alternative label: Oikeuspsykiatria (59.56+)
alternative label: Ongelmakäyttäytyminen, psykiatria ja mielenterveys (59.56+)
alternative label: Problembeteende, psykiatri och mental hälsa (59.56+) @sv
alternative label: Psyke, psykiatri (59.56+) @sv
alternative label: Psykiaterns arbete (59.56+) @sv
alternative label: Psykiatri (59.56+) @sv
alternative label: Psykiatria (59.56+)
alternative label: Psykiatrin työ (59.56+)
alternative label: Psykiatriset sairaalat (59.56+)
alternative label: Psykiatriska sjukhus (59.56+) @sv
alternative label: Psyyke, psykiatria (59.56+)
alternative label: Riippuvuus yl. (59.56)
alternative label: Rikollisuus, psykiatria (59.56+)
alternative label: Rättspsykiatri (59.56+) @sv
alternative label: Sinnessjukdomslära (59.56+) @sv
alternative label: Sinnesundersökningar (59.56+) @sv
alternative label: Självskadebeteende (59.56+) @sv
alternative label: Självskärning, självskadebeteende (59.56+) @sv
alternative label: Socialpsykiatri (59.56+) @sv
alternative label: Sosiaalipsykiatria (59.56+)
alternative label: Tietoisuus, psykiatria (59.56+)
alternative label: Trauman, psykiatri (59.56+) @sv
alternative label: Traumat, psykiatria (59.56+)
alternative label: Traumateoriat, psykiatria (59.56+)
alternative label: Traumateorier, psykiatri (59.56+) @sv
alternative label: Ungdomspsykiatri (59.56+) @sv
alternative label: Utvecklingsstörningar, barn- och ungdomspsykiatri (59.56+) @sv
alternative label: Vanhukset, psykiatria (59.56+)
alternative label: Viiltely, itsetuhokäyttäytyminen (59.56+)
alternative label: Åldringar, psykiatri (59.56+) @sv
broader: Elimet. Taudit
in scheme: YKL - Yleisten kirjastojen luokitusjärjestelmä
narrower: Psyykkiset sairaudet
narrower: Psykoterapia. Mielenterveystyö
narrower: Mielenterveys. Tunne-elämän häiriöt
narrower: Kriisipsykologia. Katastrofipsykologia. Surutyö
narrower: Itsemurhat ja niiden ehkäisy
narrower: Päihteiden ja piristeiden käyttö
notation: 59.56
preferred label: Psychiatry @en
preferred label: Psykiatri @sv
scope note: Hit allmänna psykiatriska verk om psykiska sjukdomar eller störningar i känslolivet och olika former av psykiatrisk terapi Rättspsykiatri. Sinnesundersökningar Hit och till underklasserna också kultur- och socialpsykiatri Hit och till underklasserna också barn- och ungdomspsykiatri samt geriatrisk psykiatri Hit och till underklasserna också neurofysiologiska teorier och grunderna för dem inom psykiatrin Om verket innehåller både psykiatri och psykologi, ges företräde åt klass 14+ @sv
scope note: Tähän psykiatrian yleisteokset, jotka koskevat sekä psyykkisiä sairauksia tai tunne-elämän häiriöitä että psykiatrisen terapian eri muotoja Oikeuspsykiatria. Mielentilatutkimukset Tähän ja alaluokkiin myös kulttuuri- ja sosiaalipsykiatria Tähän ja alaluokkiin myös lapsi- ja nuorisopsykiatria sekä vanhusten psykiatria Tähän ja alaluokkiin myös psykiatrian neurofysiologiset teoriat ja perusteet Jos teos koskee sekä psykiatriaa että psykologiaa, annetaan etusija luokalle 14+

Psyykkiset sairaudet
type: Concept
alternative label: Addiktioner, psykiatri, allm. (59.561) @sv
alternative label: Addiktioner, spel (59.561) @sv
alternative label: Addiktiot, pelit (59.561)
alternative label: Addiktiot, psykiatria, yl. (59.561)
alternative label: Beroende, psykiatri (59.561) @sv
alternative label: Beroende, spel (59.561) @sv
alternative label: Bipolaarinen häiriö (59.561)
alternative label: Bipolaariset psykoosit (59.561)
alternative label: Bipolär sjukdom (59.561) @sv
alternative label: Bipolär störning (59.561) @sv
alternative label: Depressio, maanis-depressiivinen (59.561)
alternative label: Depression, manodepressiv (59.561) @sv
alternative label: Dissociativa störningar (59.561) @sv
alternative label: Dissosiaatiohäiriöt (59.561)
alternative label: Fobiat (59.561)
alternative label: Fobier (59.561) @sv
alternative label: Förföljelsemani (59.561) @sv
alternative label: Gränstillstånd, psykiatri (59.561) @sv
alternative label: Hallucinationer, mentala störningar (59.561) @sv
alternative label: Hallusinaatiot, mielenterveyden häiriöt (59.561)
alternative label: Harha-aistimukset, mielenterveyden häiriöt (59.561)
alternative label: Hypokondri (59.561) @sv
alternative label: Hypokondria (59.561)
alternative label: Hypokondrinen häiriö (59.561)
alternative label: Hysteri (59.561) @sv
alternative label: Hysteria (59.561)
alternative label: Inbillningssjuka (59.561) @sv
alternative label: Jakomielitauti (59.561)
alternative label: Kaksisuuntainen mielialahäiriö (59.561)
alternative label: Katatoniset tilat (59.561)
alternative label: Katatoniska tillstånd (59.561) @sv
alternative label: Luulosairaus (59.561)
alternative label: Luulotauti (59.561)
alternative label: Luulotautisuus (59.561)
alternative label: Maanis-depressiivinen mielisairaus (59.561)
alternative label: Maanisdepressiiviset psykosit (59.561)
alternative label: Maanisdepressiivisyys (59.561)
alternative label: Manisk-depressiv sjukdom (59.561) @sv
alternative label: Manodepressiva psykoser (59.561) @sv
alternative label: Manodepressivitet (59.561) @sv
alternative label: Mental hälsa, störningar (59.561+) @sv
alternative label: Mentala störningar (59.561+) @sv
alternative label: Mielenterveys, häiriöt (59.561+)
alternative label: Mielenterveyshäiriöt (59.561+)
alternative label: Narcissism, personlighetsstörningar (59.561) @sv
alternative label: Narsismi, persoonallisuushäiriöt (59.561)
alternative label: Neurasteni (59.561) @sv
alternative label: Neurastenia (59.561)
alternative label: Neuroosit (59.561)
alternative label: Neuroser (59.561) @sv
alternative label: Paniikkihäiriö (59.561)
alternative label: Paniksyndrom (59.561) @sv
alternative label: Paranoia (59.561)
alternative label: Pelit, riippuvuus (59.561)
alternative label: Pelko, psykiatria (59.561)
alternative label: Pelot, psykiatria (59.561)
alternative label: Persoonallisuushäiriöt, psykiatria (59.561)
alternative label: Psykiatria, riippuvuudet (59.561)
alternative label: Psykiatriset sairaudet (59.561+)
alternative label: Psykofarmakologia (59.561+)
alternative label: Psykoosit (59.561)
alternative label: Psykoottiset tilat (59.561)
alternative label: Psykopatia (59.561+)
alternative label: Psykopatologia (59.561+)
alternative label: Psyyke, sairaudet ja lääkkeet (59.561)
alternative label: Psyykenlääkkeet (59.561)
alternative label: Psyykkiset sairaudet (59.561+)
alternative label: Rajatilat, psykiatria (59.561)
alternative label: Riippuvuus, pelit (59.561)
alternative label: Riippuvuus, psykiatria (59.561)
alternative label: Skitsofrenia (59.561)
alternative label: Traumaperäinen dissosiaatiohäiriö (59.561)
alternative label: Vainoharhaisuus (59.561)
broader: Psykiatria
in scheme: YKL - Yleisten kirjastojen luokitusjärjestelmä
narrower: Syömishäiriöt
notation: 59.561
scope note: Psykiska sjukdomar. Personlighetsstörningar. Psykofarmaka Schizofreni. Paranoia. Bipolär sjukdom. Psykotiska och katatoniska tillstånd. Gränstillstånd. Neuroser. Rädslor. Fobier. Hysteri. Hit också verk om någon bestämd psykisk sjukdom och vården av den @sv
scope note: Psyykkiset sairaudet. Persoonallisuushäiriöt. Psyykenlääkkeet Skitsofrenia. Paranoia. Kaksisuuntainen mielialahäiriö. Psykoottiset ja katatoniset tilat. Rajatilat. Neuroosit. Pelot. Fobiat. Hysteria. Tähän myös teokset, jotka koskevat jotakin tiettyä psyykkistä sairautta ja sen hoitoa

Syömishäiriöt
type: Concept
type: YKL-luokka
alternative label: Ahmimishäiriö (59.5612)
alternative label: Anoreksia (59.5612)
alternative label: Anorexi (59.5612) @sv
alternative label: Anorexia nervosa (59.5612)
alternative label: Bulimi (59.5612) @sv
alternative label: Bulimia (59.5612)
alternative label: EDNOS (59.5612)
alternative label: Hetsätning (59.5612) @sv
alternative label: Ortoreksia (59.5612)
alternative label: Ortorexi (59.5612) @sv
alternative label: Syömishäiriöt (59.5612)
alternative label: Ätstörningar (59.5612) @sv
broader: Psyykkiset sairaudet
in scheme: YKL - Yleisten kirjastojen luokitusjärjestelmä
notation: 59.5612
preferred label: Eating disorders @en
preferred label: Ätstörningar @sv
scope note: Anoreksia. Bulimia. Ahmimishäiriö. Ortoreksia. EDNOS Tähän myös syömishäiriöiden hoito
scope note: Anorexi. Bulimi. Hetsätning. Ortorexi. EDNOS Hit också vård av åtstörningar @sv

Psykoterapia. Mielenterveystyö
type: Concept
References: Ihmissuhteiden psykologia
References: Psyykkiset sairaudet
References: Mielenterveys. Tunne-elämän häiriöt
References: Kriisipsykologia. Katastrofipsykologia. Surutyö
References: Itsemurhat ja niiden ehkäisy
type: YKL-luokka
alternative label: Addiktioner, psykoterapi, allm. (59.562) @sv
alternative label: Addiktiot, psykoterapia, yl. (59.562)
alternative label: Beroende, psykoterapi (59.562) @sv
alternative label: Beteendeterapi (59.562+) @sv
alternative label: Hypnoosi, psykiatria (59.562+)
alternative label: Hypnos, psykiatri (59.562+) @sv
alternative label: Hypnoterapi (59.562+) @sv
alternative label: Hypnoterapia (59.562+)
alternative label: Individualterapier, psykoterapi (59.562+) @sv
alternative label: Kliininen psykologia (59.562+)
alternative label: Klinisk psykologi (59.562+) @sv
alternative label: Korttidsterapi (59.562+) @sv
alternative label: Käyttäytymisterapia (59.562+)
alternative label: Logoterapi (59.562) @sv
alternative label: Logoterapia (59.562)
alternative label: Lyhytterapia (59.562+)
alternative label: Mentalhygien (59.562+) @sv
alternative label: Mentalvårdarens arbete (59.562+) @sv
alternative label: Mielenterveyshoitajan työ (59.562+)
alternative label: Mielenterveystyö (59.562+)
alternative label: Mielisairaanhoito (59.562+)
alternative label: NLP, psykoterapi (59.562) @sv
alternative label: NLP, psykoterapia (59.562)
alternative label: Neurolingvistinen ohjelmointi, psykoterapia (59.562)
alternative label: Neurolingvistisk programmering, psykoterapi (59.562) @sv
alternative label: Psykiatrinen hoitotyö (59.562+)
alternative label: Psykiatrinen terapia (59.562+)
alternative label: Psykiatrisk terapi (59.562+) @sv
alternative label: Psykiatrisk vård (59.562+) @sv
alternative label: Psykologi, klinisk (59.562+) @sv
alternative label: Psykologia, kliininen (59.562+)
alternative label: Psykoterapi (59.562+) @sv
alternative label: Psykoterapi, beroende (59.562) @sv
alternative label: Psykoterapia (59.562+)
alternative label: Psykoterapia, riippuvuudet (59.562)
alternative label: Riippuvuus, psykoterapia (59.562)
alternative label: Sensitivity training (59.562)
alternative label: Terapi, psykiatri (59.562+) @sv
alternative label: Terapia, psykiatria (59.562+)
alternative label: Yksilöterapiat, psykoterapia (59.562+)
alternative label: kuntoutus, psykiatrinen kuntoutus (59.562+) @sv
alternative label: mielenterveyskuntoutus (59.562+)
alternative label: psykiatrinen kuntoutus (59.562+)
alternative label: psykiatrisk rehabilitering (59.562+) @sv
alternative label: psykisk rehabilitering (59.562+)
broader: Psykiatria
in scheme: YKL - Yleisten kirjastojen luokitusjärjestelmä
narrower: Psykoanalyysi
narrower: Perhe-, ryhmä- ja ympäristöterapiat
narrower: Luovuus- ja toimintaterapiat
notation: 59.562
preferred label: Psychotherapy. Mental health care @en
preferred label: Psykoterapi. Mentalhygien @sv
scope note: Hit och till underklasserna allmänna verk om psykoterapeutiskt och psykiatriskt vårdarbete och vårdarbete inom klinisk psykologi Sinnessjukvårdarens arbete i allmänhet Korttidsterapi i allmänhet. Hypnoterapi i allmänhet @sv
scope note: Tähän ja alaluokkiin psykoterapian, kliinisen psykologian ja psykiatrisen hoitotyön yleisteokset Mielenterveyshoitajan työ yleensä Lyhytterapia yleensä. Hypnoterapia yleensä

Psykoanalyysi
type: Concept
References: Syvyyspsykologia. Tiedostamaton sielunelämä
References: Psyykkiset sairaudet
References: Mielenterveys. Tunne-elämän häiriöt
type: YKL-luokka
alternative label: Alitajunta, psykoanalyyttinen terapia (59.5622)
alternative label: Analytisk psykoterapi (59.5622) @sv
alternative label: Analyyttinen psykoterapia (59.5622)
alternative label: Drömanalys, psykoanalytisk terapi (59.5622) @sv
alternative label: Drömmar, psykoanalytisk terapi (59.5622) @sv
alternative label: Freudianism, terapi (59.5622) @sv
alternative label: Freudilaisuus, terapia (59.5622)
alternative label: Jungianism, psykoanalytisk terapi (59.5622) @sv
alternative label: Jungilaisuus, psykoanalyyttinen terapia (59.5622)
alternative label: Omedvetna själslivet, psykoanalytisk terapi (59.5622) @sv
alternative label: Piilotajunta, psykoanalyyttinen terapia (59.5622)
alternative label: Psykoanalys, terapi (59.5622) @sv
alternative label: Psykoanalyysi, terapia (59.5622)
alternative label: Psykoterapi, analytisk (59.5622) @sv
alternative label: Psykoterapia, analyyttinen (59.5622)
alternative label: Symboler, psykoanalytisk terapi (59.5622) @sv
alternative label: Symbolit, psykoanalyyttinen terapia (59.5622)
alternative label: Tiedostamaton sielunelämä, psykoanalyyttinen terapia (59.5622)
alternative label: Undermedvetna, psykoanalytisk terapi (59.5622) @sv
alternative label: Unet, psykoanalyyttinen terapia (59.5622)
alternative label: Unianalyysi, psykoanalyyttinen terapia (59.5622)
broader: Psykoterapia. Mielenterveystyö
in scheme: YKL - Yleisten kirjastojen luokitusjärjestelmä
notation: 59.5622
preferred label: Psychoanalysis @en
preferred label: Psykoanalys @sv
scope note: Allmänna verk i analytisk psykoterapi Hit psykoanalys, freudianism och drömanalys ur den psykiatriska terapins synvinkel i allmänhet Om verket behandlar psykoanalys både ur psykiatrisk och psykologisk synvinkel, ges företräde åt klass 14.45+ @sv
scope note: Analyyttisen psykoterapian yleisteokset Tähän psykoanalyysi, freudilaisuus ja unianalyysi psykiatrisen terapian kannalta yleensä Jos teos koskee psykoanalyysiä sekä psykiatrian että psykologian kannalta, annetaan etusija luokalle 14.45+

Perhe-, ryhmä- ja ympäristöterapiat
type: Concept
References: Perhepolitiikka
type: YKL-luokka
alternative label: Avioero, perheterapia (59.5623)
alternative label: Avioliitto, perheterapia (59.5623)
alternative label: Avoliitto, perheterapia (59.5623)
alternative label: Familjeterapier (59.5623) @sv
alternative label: Gruppterapier (59.5623) @sv
alternative label: Miljöterapier (59.5623) @sv
alternative label: Pariterapia (59.5623)
alternative label: Parterapi (59.5623) @sv
alternative label: Perheterapiat (59.5623)
alternative label: Ryhmäterapiat (59.5623)
alternative label: Sammanboende, familjeterapi (59.5623) @sv
alternative label: Skilsmässa, familjeterapi (59.5623) @sv
alternative label: Ympäristöterapiat (59.5623)
alternative label: Äktenskap, familjeterapi (59.5623) @sv
broader: Psykoterapia. Mielenterveystyö
in scheme: YKL - Yleisten kirjastojen luokitusjärjestelmä
notation: 59.5623
preferred label: Familje-, grupp- och miljöterapi @sv
preferred label: Family, group and relational therapy @en

Luovuus- ja toimintaterapiat
type: Concept
type: YKL-luokka
alternative label: Arbetsterapier (59.5624) @sv
alternative label: Askarteluterapiat (59.5624)
alternative label: Biblioterapi (59.5624) @sv
alternative label: Biblioterapia (59.5624)
alternative label: Dansterapi (59.5624) @sv
alternative label: Diktterapi (59.5624) @sv
alternative label: Draamaterapia (59.5624)
alternative label: Dramaterapi (59.5624) @sv
alternative label: Ergoterapier (59.5624) @sv
alternative label: Kirjallisuusterapia (59.5624)
alternative label: Konstterapier (59.5624) @sv
alternative label: Kreativitetsterapier (59.5624) @sv
alternative label: Leikkiterapia, psykoterapia (59.5624)
alternative label: Lekterapi, psykoterapi (59.5624) @sv
alternative label: Liike- ja tanssiterapia (59.5624)
alternative label: Liiketerapia (59.5624)
alternative label: Litteraturterapi (59.5624) @sv
alternative label: Luovuusterapiat (59.5624)
alternative label: Musiikkiterapia (59.5624)
alternative label: Musikterapi (59.5624) @sv
alternative label: Psykodraama (59.5624)
alternative label: Psykodrama (59.5624) @sv
alternative label: Runoterapia (59.5624)
alternative label: Rörelse- och dansterapi (59.5624) @sv
alternative label: Rörelseterapi (59.5624) @sv
alternative label: Sadutus, luovuus- ja toimintaterapiat (59.5624)
alternative label: Sagotering, kreativitets- och aktivitetsterapi (59.5624) @sv
alternative label: Sociodrama (59.5624) @sv
alternative label: Sosiodraama (59.5624)
alternative label: Sysselsättningsterapier (59.5624) @sv
alternative label: Taideterapiat (59.5624)
alternative label: Tanssiterapia (59.5624)
alternative label: Toimintaterapiat (59.5624)
alternative label: Työterapiat (59.5624)
broader: Psykoterapia. Mielenterveystyö
in scheme: YKL - Yleisten kirjastojen luokitusjärjestelmä
notation: 59.5624
preferred label: Creativity and activity therapy @en
preferred label: Kreativitets- och aktivitetsterapi @sv
scope note: Konst-, litteratur-, dikt-, drama- och musikterapier Lek-, sysselsättnings- och ergoterapier Psykodrama. Sociodrama @sv
scope note: Taide-, kirjallisuus-, runo-, draama- ja musiikkiterapiat Leikki-, askartelu- ja työterapiat Psykodraama. Sosiodraama

Mielenterveys. Tunne-elämän häiriöt
type: Concept
References: Ihmissuhteiden psykologia
References: Elämänfilosofia. Elämäntaito
References: Sielunhoito
References: Sosiaalipsykologia
References: Tapaturmantorjunta. Ensiapu
References: Rentoutus. Uni. Unettomuus
References: Saattohoito
References: Psykoterapia. Mielenterveystyö
References: Kriisipsykologia. Katastrofipsykologia. Surutyö
References: Itsemurhat ja niiden ehkäisy
type: YKL-luokka
alternative label: Ahdistus, tunne-elämän häiriöt (59.563)
alternative label: Alemmuuskompleksit, tunne-elämän häiriöt (59.563)
alternative label: Beroende, medberoende, störningar i känslolivet (59.563) @sv
alternative label: Burnout (59.563)
alternative label: Depressio, tunne-elämän häiriöt (59.563)
alternative label: Depression, störningar i känslolivet (59.563) @sv
alternative label: Elämänohjeet, mielenterveys (59.563)
alternative label: Förlossningsdepression (59.563) @sv
alternative label: Graviditetsdepression (59.563) @sv
alternative label: Henkinen hyvinvointi, mielenterveys (59.563)
alternative label: Hälsovård, mental hälsa (59.563) @sv
alternative label: Ihmissuhteet, mielenterveys (59.563)
alternative label: Jaksaminen, mielenterveys (59.563)
alternative label: Jännittäminen, tunne-elämän häiriöt (59.563)
alternative label: Känsloliv, mental hälsa (59.563) @sv
alternative label: Levnadsregler, psykisk hälsa (59.563) @sv
alternative label: Liikarasitus, tunne-elämän häiriöt (59.563)
alternative label: Läheisriippuvuus, tunne-elämän häiriöt (59.563)
alternative label: Masennus, tunne-elämän häiriöt (59.563)
alternative label: Medberonde, störningar i känslolivet (59.563) @sv
alternative label: Mental hälsa (59.563) @sv
alternative label: Mental hälsa, levnadsregler (59.563) @sv
alternative label: Mielenterveys (59.563)
alternative label: Mielenterveys, elämänohjeet (59.563)
alternative label: Mindervärdeskomplex, störningar i känslolivet (59.563) @sv
alternative label: Mustasukkaisuus, mielenterveys (59.563)
alternative label: Mänskliga relationer, mental hälsa (59.563) @sv
alternative label: Ork, mental hälsa (59.563) @sv
alternative label: Psyke, mental hälsa (59.563) @sv
alternative label: Psykiskt välbefinnande, mental hälsa (59.563) @sv
alternative label: Psyyke, mielenterveys (59.563)
alternative label: Raskausajan masennus (59.563)
alternative label: Riippuvuus, läheisriippuvuus, tunne-elämän häiriöt (59.563)
alternative label: Spänningstillstånd, störningar i känslolivet (59.563) @sv
alternative label: Stress (59.563) @sv
alternative label: Stressi (59.563)
alternative label: Svartsjuka, mental hälsa (59.563) @sv
alternative label: Synnytyksen jälkeinen masennus (59.563)
alternative label: Terveydenhoito, mielenterveys (59.563)
alternative label: Tunne-elämä, mielenterveys (59.563)
alternative label: Työuupumus (59.563)
alternative label: Utbrändhet (59.563) @sv
alternative label: Utbrändhet i arbetslivet (59.563) @sv
alternative label: Uupumus (59.563)
alternative label: Vanhukset, mielenterveys (59.563)
alternative label: Åldringar, mental hälsa (59.563) @sv
alternative label: Ångest, störningar i känslolivet (59.563) @sv
alternative label: Överansträngning, störningar i känslolivet (59.563) @sv
broader: Psykiatria
in scheme: YKL - Yleisten kirjastojen luokitusjärjestelmä
notation: 59.563
preferred label: Mental health. Emotional disorders @en
preferred label: Mental hälsa. Störningar i känslolivet @sv
scope note: Hit känslolivet och människorelationerna ur den mentala hälsans synvinkel Spänningstillstånd. Ångest. Depression. Stress. Utbrändhet. Burnout Överansträngning ur den mentala hälsans synvinkel Hit också verk som behandlar en bestämd störning i känslolivet och vården av den @sv
scope note: Tähän tunne-elämä ja ihmissuhteet mielenterveyden kannalta Jännittäminen. Ahdistus. Masennus. Stressi. Uupumus. Burnout Liikarasitus mielenterveyden kannalta Tähän myös teokset, jotka koskevat jotakin tiettyä tunne-elämän häiriötä ja sen hoitoa

Kriisipsykologia. Katastrofipsykologia. Surutyö
type: Concept
References: Elämänfilosofia. Elämäntaito
References: Sielunhoito
References: Saattohoito
References: Psykoterapia. Mielenterveystyö
References: Mielenterveys. Tunne-elämän häiriöt
References: Itsemurhat ja niiden ehkäisy
type: YKL-luokka
alternative label: Debriefing (59.564)
alternative label: Döden, sorgearbete (59.564) @sv
alternative label: Ensiapu, psyykkinen (59.564)
alternative label: Faromoment, katastrofpsykologi (59.564) @sv
alternative label: Första hjälpen, psykisk (59.564) @sv
alternative label: Katastrofipsykologia yksilön kannalta (59.564)
alternative label: Katastrofpsykologi från individens synpunkt (59.564) @sv
alternative label: Kriisiapu, kriisipsykologia (59.564)
alternative label: Kriisipsykologia, mielenterveys (59.564)
alternative label: Kriisit, mielenterveys (59.564)
alternative label: Kriisiterapia (59.564)
alternative label: Kriisituki (59.564)
alternative label: Kriser, mental hälsa (59.564) @sv
alternative label: Krishjälp, krispsykologi (59.564) @sv
alternative label: Krispsykologi, mental hälsa (59.564) @sv
alternative label: Krissituationer, psykiskt stöd (59.564) @sv
alternative label: Kristerapi (59.564) @sv
alternative label: Kuolema, surutyö (59.564)
alternative label: Psykisk första hjälp (59.564) @sv
alternative label: Psykiskt stöd vid krissituationer (59.564) @sv
alternative label: Psyykkinen ensiapu (59.564)
alternative label: Psyykkinen kriisituki (59.564)
alternative label: Sorgearbete, mental hälsa (59.564) @sv
alternative label: Surutyö, mielenterveys (59.564)
alternative label: Vaaratilanteet, katastrofipsykologia (59.564)
broader: Psykiatria
in scheme: YKL - Yleisten kirjastojen luokitusjärjestelmä
notation: 59.564
preferred label: Crisis psychology. Disaster psychology. Grief work @en
preferred label: Krispsykologi. Katastrofpsykologi. Sorgearbete @sv
scope note: Kriisi- ja katastrofipsykologia yksilön mielenterveyden kannalta Debriefing. Psyykkinen kriisiapu. Kriisituki. Kriisiterapia Surutyö yleensä
scope note: Kris- och katastrofpsykologi ur individualpsykologisk synvinkel Debriefing. Psykologisk krishjälp. Psykiskt stöd vid krissituationer. Kristerapi Sorgearbete i allmänhet @sv

Itsemurhat ja niiden ehkäisy
type: Concept
References: Kristillinen etiikka
type: YKL-luokka
alternative label: Itsemurhat (59.565)
alternative label: Itsemurhat, ehkäisy (59.565)
alternative label: Itsemurhat, etiikka (59.565)
alternative label: Itsemurhat, psykologia (59.565)
alternative label: Itsemurhat, sosiologia (59.565)
alternative label: Itsetuhokäyttäytyminen, itsemurha (59.565)
alternative label: Självmord (59.565) @sv
alternative label: Självmord, etik (59.565) @sv
alternative label: Självmord, förebyggande (59.565) @sv
alternative label: Självmord, psykologi (59.565) @sv
alternative label: Självmord, sociologi (59.565) @sv
alternative label: Självskadebeteende, självmord (59.565) @sv
broader: Psykiatria
in scheme: YKL - Yleisten kirjastojen luokitusjärjestelmä
notation: 59.565
preferred label: Självmord och förebyggandet av dem @sv
preferred label: Suicides and their prevention @en
scope note: Hit självmord och förebyggandet av dem ur etisk, psykologisk och social synvinkel Problem hos anhöriga till personer som har begått självmord @sv
scope note: Tähän itsemurhat ja niiden ehkäisy eettiseltä, psykologiselta ja sosiaaliselta kannalta Itsemurhan tehneen omaisten ongelmat

Päihteiden ja piristeiden käyttö
type: Concept
References: Päihdepolitiikka. Päihdehuolto
type: YKL-luokka
alternative label: Addiktioner, rusmedel (59.567+) @sv
alternative label: Addiktiot, päihteet (59.567+)
alternative label: Beroende, rusmedel (59.567+) @sv
alternative label: Piristeet, lääketiede (59.567+)
alternative label: Päihderiippuvuus (59.567+)
alternative label: Päihteet, käyttö, lääketiede (59.567+)
alternative label: Päihteet, riippuvuus (59.567+)
alternative label: Päihteet, vaikutukset, lääketiede (59.567+)
alternative label: Riippuvuus, päihteet (59.567+)
alternative label: Rusmedel, beroende (59.567+) @sv
alternative label: Rusmedel, bruk, medicin (59.567+) @sv
alternative label: Rusmedel, inverkan, medicin (59.567+) @sv
alternative label: Rusmedelsberoende (59.567+) @sv
alternative label: Stimulantier, medicin (59.567+) @sv
broader: Psykiatria
in scheme: YKL - Yleisten kirjastojen luokitusjärjestelmä
narrower: Tupakointi
narrower: Alkoholiriippuvuus. Alkoholinkäyttö
narrower: Huumeriippuvuus
notation: 59.567
preferred label: Bruk av rusmedel och stimulantia @sv
preferred label: Use of intoxicants and stimulants @en
scope note: Hit och till underklasserna bruk och brukare av rusmedel och stimulantia ur medicinsk synvinkel Hit och till underklasserna också beroende förorsakat av rusmedel och stimulantia samt inverkan av rusmedel och stimulantia ur medicinsk och psykiatrisk synvinkel och ur den mentala hälsans synvinkel Hit och till underklasserna också medicinsk vård av missbrukare @sv
scope note: Tähän ja alaluokkiin päihteiden ja piristeiden käyttö ja käyttäjät lääketieteelliseltä kannalta Tähän ja alaluokkiin myös päihteiden ja piristeiden aiheuttama riippuvuus sekä päihteiden ja piristeiden vaikutukset lääketieteelliseltä, psykiatriselta ja mielenterveydelliseltä kannalta Tähän ja alaluokkiin myös päihteiden käyttäjien lääketieteellinen hoito

Tupakointi
type: Concept
References: Muut hyötykasvit
References: Nautintoaineteollisuus
References: Yleinen kulttuurihistoria
type: YKL-luokka
alternative label: Addiktioner, tobak (59.5671) @sv
alternative label: Addiktiot, tupakka (59.5671)
alternative label: Beroende, tobak (59.5671) @sv
alternative label: Nuuskaaminen, terveydelliseltä kannalta (59.5671)
alternative label: Riippuvuus, tupakka (59.5671)
alternative label: Snusning från hälsosynpunkt (59.5671) @sv
alternative label: Tobak, beroende (59.5671) @sv
alternative label: Tobaksrökning (59.5671) @sv
alternative label: Tobaksrökning, slutande (59.5671) @sv
alternative label: Tobaksrökning, verkningar (59.5671) @sv
alternative label: Tupakka, riippuvuus (59.5671)
alternative label: Tupakointi (59.5671)
alternative label: Tupakointi, lopettaminen (59.5671)
alternative label: Tupakointi, vaikutukset (59.5671)
broader: Päihteiden ja piristeiden käyttö
in scheme: YKL - Yleisten kirjastojen luokitusjärjestelmä
notation: 59.5671
preferred label: Rökning @sv
preferred label: Smoking @en
scope note: Hit rökning, att sluta röka samt rökningens skadliga inverkan på hälsan och folkhälsan @sv
scope note: Tähän tupakointi, sen lopettaminen sekä tupakoinnin terveydelliset ja kansanterveydelliset haitat yleensä

Alkoholiriippuvuus. Alkoholinkäyttö
type: Concept
modified: 2026-05-06T14:25:20
References: Elinkeino-oikeus
References: Alkoholipolitiikka
References: Nautintoaineteollisuus
References: Juomat
type: YKL-luokka
alternative label: Addiktioner, alkohol (59.5672) @sv
alternative label: Addiktiot, alkoholi (59.5672)
alternative label: Alkohol, beroende (59.5672) @sv
alternative label: Alkohol, inverkan på hälsan (59.5672) @sv
alternative label: Alkoholberoende (59.5672) @sv
alternative label: Alkoholfysiologi (59.5672) @sv
alternative label: Alkoholi, riippuvuus (59.5672)
alternative label: Alkoholi, vaikutukset terveyteen (59.5672)
alternative label: Alkoholifysiologia (59.5672)
alternative label: Alkoholiriippuvuus (59.5672)
alternative label: Alkoholism, medicin (59.5672) @sv
alternative label: Alkoholismi, lääketiede (59.5672)
alternative label: Baksmälla (59.5672) @sv
alternative label: Beroende, alkohol (59.5672) @sv
alternative label: Krapula (59.5672)
alternative label: Riippuvuus, alkoholi (59.5672)
alternative label: Spritdrycker, medicin (59.5672) @sv
alternative label: Väkijuomat, lääketiede (59.5672)
broader: Päihteiden ja piristeiden käyttö
in scheme: YKL - Yleisten kirjastojen luokitusjärjestelmä
notation: 59.5672
preferred label: Addiction to alcohol. Alcohol use @en
preferred label: Alkoholberoende. Alkoholanvändning @sv
scope note: Alkoholistien lääketieteellinen hoito Alkoholiriippuvuus Alkoholin psyykkiset ja fyysiset vaikutukset
scope note: Medicinsk vård av alkoholister Alkoholberoende Alkoholens psykiska och fysiska inverkan @sv

Huumeriippuvuus
type: Concept
modified: 2026-05-06T14:27:19
References: Kriminologia. Kriminaalisosiologia
References: Elinkeino-oikeus
References: Huumausainepolitiikka
References: Lääkehoito. Lääkeaineoppi
References: Kemianteollisuus
type: YKL-luokka
alternative label: Addiktioner, läkemedel (59.5673) @sv
alternative label: Addiktioner, narkotika (59.5673) @sv
alternative label: Addiktiot, huumeet (59.5673)
alternative label: Addiktiot, lääkeaineet (59.5673)
alternative label: Beroende, läkemedel (59.5673) @sv
alternative label: Beroende, narkotika (59.5673) @sv
alternative label: Huumausaineriippuvuus (59.5673)
alternative label: Huumeet, riippuvuus (59.5673)
alternative label: Huumeet, vaikutukset terveyteen (59.5673)
alternative label: Huumeiden käyttäjät, lääketieteellinen hoito (59.5673)
alternative label: Läkemedel, beroende (59.5673) @sv
alternative label: Läkemedelsberoende (59.5673) @sv
alternative label: Lääkeaineet, riippuvuus (59.5673)
alternative label: Lääkeaineriippuvuus (59.5673)
alternative label: Lääkkeet, riippuvuus (59.5673)
alternative label: Lääkkeet, väärinkäyttö, lääketiede (59.5673)
alternative label: Mediciner, beroende (59.5673) @sv
alternative label: Mediciner, missbruk, medicin (59.5673) @sv
alternative label: Narkomaner, medicinsk vård (59.5673) @sv
alternative label: Narkomani, medicin (59.5673) @sv
alternative label: Narkomania, lääketiede (59.5673)
alternative label: Narkotika, beroende (59.5673) @sv
alternative label: Narkotika, inverkan på hälsan (59.5673) @sv
alternative label: Narkotikaberoende (59.5673) @sv
alternative label: Riippuvuus, huumeet (59.5673)
alternative label: Riippuvuus, lääkeaineet (59.5673)
broader: Päihteiden ja piristeiden käyttö
in scheme: YKL - Yleisten kirjastojen luokitusjärjestelmä
notation: 59.5673
preferred label: Drogberoende @sv
preferred label: Drug addiction @en
scope note: Huumeiden käyttäjien ja lääkkeiden väärinkäyttäjien lääketieteellinen hoito Huume- ja lääkeaineriippuvuus Huumeiden käytön ja lääkkeiden väärinkäytön psyykkiset ja fyysiset vaikutukset
scope note: Medicinsk vård av narkomaner och läkemedelsmissbrukare Narkotika- och läkemedelsberoende Psykisk och fysisk inverkan av narkotika- och läkemedelsmissbruk @sv

Gynekologia
type: Concept
References: Seksologia
References: Sukupuolitaudit
References: Virtsaelimet. Virtsaelinten taudit
type: YKL-luokka
alternative label: Barnlöshet (59.57) @sv
alternative label: Barnlöshet, gynekologi (59.57) @sv
alternative label: Bröstcancer (59.57) @sv
alternative label: Endometrioosi (59.57)
alternative label: Endometrios (59.57) @sv
alternative label: Gynekologi (59.57+) @sv
alternative label: Gynekologia (59.57+)
alternative label: Hedelmättömyys, naisen (59.57)
alternative label: Hormoner, gynekologi (59.57+) @sv
alternative label: Hormonit, gynekologia (59.57+)
alternative label: Klimakterium (59.57) @sv
alternative label: Kuukautiskierto (59.57)
alternative label: Kvinnosjukdomar (59.57+) @sv
alternative label: Könskörtlarna, kvinnans (59.57) @sv
alternative label: Könsorganen, hos kvinnan, medicin (59.57) @sv
alternative label: Lapsettomuus (59.57)
alternative label: Lapsettomuus, gynekologia (59.57)
alternative label: Lisääntymisterveys, gynekologia (59.57+)
alternative label: Maitorauhanen (59.57)
alternative label: Maitorauhanen, taudit (59.57)
alternative label: Mammografi (59.57) @sv
alternative label: Mammografia (59.57)
alternative label: Menstruationscykel (59.57) @sv
alternative label: Mjölkkörteln (59.57) @sv
alternative label: Mjölkkörteln, sjukdomar (59.57) @sv
alternative label: Naistentaudit (59.57+)
alternative label: Omskärelse, medicin, kvinnans (59.57) @sv
alternative label: Reproduktiv hälsa, gynekologi (59.57+) @sv
alternative label: Rintasyöpä (59.57)
alternative label: Seksuaaliterveys, gynekologia (59.57+)
alternative label: Sexualhälsa, gynekologi (59.57+) @sv
alternative label: Sterilitet, kvinnlig (59.57) @sv
alternative label: Sukupuolielimet, naisen, lääketiede (59.57)
alternative label: Sukupuolirauhaset, naisen (59.57)
alternative label: Vaihdevuodet (59.57)
alternative label: Ympärileikkaus, lääketiede, naisen (59.57)
broader: Elimet. Taudit
in scheme: YKL - Yleisten kirjastojen luokitusjärjestelmä
narrower: Raskaus. Sikiönkehitys. Synnytys
notation: 59.57
preferred label: Gynaecology @en
preferred label: Gynekologi @sv
scope note: Hit kvinnans könsorgan och könskörtlar samt sjukdomar i dem Sterilitet hos kvinnan. Barnlöshet i allmänhet Hit också mjölkkörteln och sjukdomar i den. Bröstcancer @sv
scope note: Tähän naisen sukupuolielimet ja sukupuolirauhaset sekä niiden taudit Naisen hedelmättömyys. Lapsettomuus yleensä Tähän myös maitorauhanen ja sen taudit. Rintasyöpä

Raskaus. Sikiönkehitys. Synnytys
type: Concept
References: Sosiaalioikeus
type: YKL-luokka
alternative label: Abort, medicin (59.571) @sv
alternative label: Abortti, lääketiede (59.571)
alternative label: Barnmorskans arbete (59.571) @sv
alternative label: Embryologi, människan (59.571) @sv
alternative label: Embryologia, ihminen (59.571)
alternative label: Epämuodostumat, sikiönkehitys (59.571)
alternative label: Familjeförberedelse, förlossningsförberedelse (59.571) @sv
alternative label: Fosterutveckling, människan (59.571) @sv
alternative label: Förlossning (59.571) @sv
alternative label: Förlossningsförberedelse (59.571) @sv
alternative label: Graviditet (59.571) @sv
alternative label: Individutveckling, människans fosterutveckling (59.571) @sv
alternative label: Kehityshäiriöt, sikiönkehitys (59.571)
alternative label: Keinohedelmöitys, ihminen (59.571)
alternative label: Keisarileikkaus (59.571)
alternative label: Kejsarsnitt (59.571) @sv
alternative label: Keskenmeno (59.571)
alternative label: Koeputkilapset (59.571)
alternative label: Konstgjord befruktning, människor (59.571) @sv
alternative label: Kätilön työ (59.571)
alternative label: Lisääntymisterveys, raskaus (59.571)
alternative label: Lisääntymisterveys, synnytys (59.571)
alternative label: Missbildningar, fosterutveckling (59.571) @sv
alternative label: Missfall (59.571) @sv
alternative label: Moderskap, hälsovård (59.571) @sv
alternative label: Mödragymnastik (59.571) @sv
alternative label: Mödravård (59.571) @sv
alternative label: Neuvolat, äitiysneuvolat (59.571)
alternative label: Obstetriikka (59.571)
alternative label: Obstetrik (59.571) @sv
alternative label: Perhevalmennus, synnytysvalmennus (59.571)
alternative label: Provrörsbarn (59.571) @sv
alternative label: Raskaus (59.571)
alternative label: Reproduktiv hälsa, förlossning (59.571) @sv
alternative label: Reproduktiv hälsa, graviditet (59.571) @sv
alternative label: Rådgivningsbyråer för mödravård (59.571) @sv
alternative label: Seksuaaliterveys, raskaus (59.571)
alternative label: Seksuaaliterveys, synnytys (59.571)
alternative label: Sexualhälsa, förlossning (59.571) @sv
alternative label: Sexualhälsa, graviditet (59.571) @sv
alternative label: Sikiönkehitys, ihminen (59.571)
alternative label: Synnytys (59.571)
alternative label: Synnytysoppi (59.571)
alternative label: Synnytysvalmennus (59.571)
alternative label: Teratologi, fosterutveckling (59.571) @sv
alternative label: Teratologia, sikiönkehitys (59.571)
alternative label: Utvecklingsstörningar, fosterutveckling (59.571) @sv
alternative label: Yksilönkehitys, ihmisen sikiönkehitys (59.571)
alternative label: Äitiys, terveydenhoito (59.571)
alternative label: Äitiyshuolto (59.571)
alternative label: Äitiysneuvolat (59.571)
alternative label: Äitiysvoimistelu (59.571)
broader: Gynekologia
in scheme: YKL - Yleisten kirjastojen luokitusjärjestelmä
notation: 59.571
preferred label: Graviditet. Fosterutveckling. Förlossning @sv
preferred label: Pregnancy. Foetal development. Delivery @en
scope note: Hälsovård under graviditet i allmänhet Rådgivningsbyråer för mödravård. Förlossningsförberedelse Mammagymnastik Fosterutveckling och störningar i fostrets utveckling. Missfall. Abort Förlossning. Barnmorskans arbete. Kejsarsnitt Konstgjord befruktning. Provrörsbarn @sv
scope note: Raskaudenaikainen terveydenhoito yleensä Äitiysneuvolat. Synnytysvalmennus. Äitiysvoimistelu Sikiönkehitys ja sen häiriöt. Keskenmeno. Abortti Synnytys. Kätilön työ. Keisarileikkaus Keinohedelmöitys. Koeputkilapset

Allergiset taudit. Iho. Ihotaudit
type: Concept
References: Kauneudenhoito. Ulkonäkö
References: Hengityselimet. Hengityselinten taudit
References: Sisäeritysrauhaset. Aineenvaihduntataudit
type: YKL-luokka
alternative label: Agens, allergi (59.58) @sv
alternative label: Akne (59.58)
alternative label: Allergeenit (59.58)
alternative label: Allergener (59.58) @sv
alternative label: Allergiat (59.58)
alternative label: Allergier (59.58) @sv
alternative label: Altisteet, allergia (59.58)
alternative label: Altistuminen, allergia (59.58)
alternative label: Andningsorgan, allergiska sjukdomar (59.58) @sv
alternative label: Astma (59.58)
alternative label: Brandskador, dermatologi (59.58) @sv
alternative label: Dammallergi (59.58) @sv
alternative label: Dermatologi (59.58) @sv
alternative label: Dermatologia (59.58)
alternative label: Djurallergi (59.58) @sv
alternative label: Eksem (59.58) @sv
alternative label: Eläinallergia (59.58)
alternative label: Exposition, allergi (59.58) @sv
alternative label: Födoämnen, allergier (59.58) @sv
alternative label: Födoämnesallergi (59.58) @sv
alternative label: Heinänuha (59.58)
alternative label: Hengityselimet, allergiset sairaudet (59.58)
alternative label: Homeallergia (59.58)
alternative label: Hud (59.58) @sv
alternative label: Hudcancer (59.58) @sv
alternative label: Hudsjukdomar (59.58) @sv
alternative label: Hösnuva (59.58) @sv
alternative label: Iho (59.58)
alternative label: Ihosyöpä (59.58)
alternative label: Ihotaudit (59.58)
alternative label: Ihottumat (59.58)
alternative label: Liikaherkkyys, allergiat (59.58)
alternative label: Livsmedelsallergi (59.58) @sv
alternative label: Läkemedelsallergi (59.58) @sv
alternative label: Lääkeaineallergia (59.58)
alternative label: Maitoallergia (59.58)
alternative label: Melanom (59.58) @sv
alternative label: Melanooma (59.58)
alternative label: Mjölkallergi (59.58) @sv
alternative label: Mögelallergi (59.58) @sv
alternative label: Palovammat, ihotautioppi (59.58)
alternative label: Pollenallergi (59.58) @sv
alternative label: Psoriasis (59.58)
alternative label: Pölyallergia (59.58)
alternative label: Ruoka-aineallergia (59.58)
alternative label: Ruoka-aineet, allergiat (59.58)
alternative label: Ruoka-allergia (59.58)
alternative label: Siitepölyallergia (59.58)
alternative label: Överkänslighet, allergier (59.58) @sv
broader: Elimet. Taudit
in scheme: YKL - Yleisten kirjastojen luokitusjärjestelmä
notation: 59.58
preferred label: Allergies. Skin. Skin diseases @en
preferred label: Allergiska sjukdomar. Huden. Hudsjukdomar @sv
scope note: Allergiat. Allergeenit. Allergiset reaktiot Eläinallergia. Homeallergia. Lääkeaineallergia. Maitoallergia. Pölyallergia. Ruoka-aineallergia. Siitepölyallergia Astma. Heinänuha Ihottumat. Ihon tulehdukset. Psoriasis. Akne
scope note: Allergier. Allergener. Allergiska reaktioner Dammallergi. Djurallergi. Födoämnesallergi. Läkemedelsallergi. Mjölkallergi. Mögelallergi. Pollenallergi Astma. Hösnuva Eksem. Hudinflammationer. Psoriasis. Akne @sv

Aistinelimet. Silmätaudit. Kurkku-, nenä- ja korvataudit
type: Concept
References: Erityisopetus. Erityiskasvatus, kuulovammaiset
References: Erityisopetus. Erityiskasvatus, näkövammaiset
References: Hermosto. Neurologia
References: Optiset ja lääketieteelliset laitteet
alternative label: Aistinfysiologia, ihminen, yl. (59.59)
alternative label: Aistit, ihminen (59.59)
alternative label: Aistivammat, lääketiede (59.59)
alternative label: Audiologi (59.59) @sv
alternative label: Audiologia (59.59)
alternative label: Audiometri (59.59) @sv
alternative label: Audiometria (59.59)
alternative label: Balansorgan, människan (59.59) @sv
alternative label: Balansorgan, sjukdomar (59.59) @sv
alternative label: Blindhet, ögonsjukdomar (59.59) @sv
alternative label: Brytningsfel (59.59) @sv
alternative label: Doft, luktsinne (59.59) @sv
alternative label: Dövhet, medicin (59.59) @sv
alternative label: Färgblindhet (59.59) @sv
alternative label: Glasögon, ögonsjukdomar (59.59) @sv
alternative label: Hajuaisti, ihmisen fysiologia (59.59)
alternative label: Halssjukdomar (59.59) @sv
alternative label: Hörapparater, användning (59.59) @sv
alternative label: Hörselsinne, medicin (59.59) @sv
alternative label: Hörselsinne, människan (59.59) @sv
alternative label: Hörselskador, medicin (59.59) @sv
alternative label: Kaihi (59.59)
alternative label: Karsastus, silmätaudit (59.59)
alternative label: Kinestetiskt sinne (59.59) @sv
alternative label: Kitarisat (59.59)
alternative label: Korva, ihminen (59.59)
alternative label: Korvataudit (59.59)
alternative label: Kurkkutaudit (59.59)
alternative label: Kurkunpään syöpä (59.59)
alternative label: Kuuloaisti, ihminen (59.59)
alternative label: Kuuloaisti, lääketiede (59.59)
alternative label: Kuulolaitteet, käyttö (59.59)
alternative label: Kuulovammat, lääketiede (59.59)
alternative label: Kuurous, lääketiede (59.59)
alternative label: Känselsinnet, människan (59.59) @sv
alternative label: Laryngologi (59.59) @sv
alternative label: Laryngologia (59.59)
alternative label: Liikeaisti, ihminen (59.59)
alternative label: Likinäköisyys (59.59)
alternative label: Luktsinne, människans fysiologi (59.59) @sv
alternative label: Nenätaudit (59.59)
alternative label: Nielurisat (59.59)
alternative label: Näköaisti, ihminen (59.59)
alternative label: Näköaisti, lääketiede (59.59)
alternative label: Näkövammat, silmätaudit (59.59)
alternative label: Närsynthet (59.59) @sv
alternative label: Nässjukdomar (59.59) @sv
alternative label: Oftalmologi (59.59) @sv
alternative label: Oftalmologia (59.59)
alternative label: Otologi (59.59) @sv
alternative label: Otologia (59.59)
alternative label: Puhehäiriöt, kurkkutaudit (59.59)
alternative label: Puheviat, kurkkutaudit (59.59)
alternative label: Rhinologi (59.59) @sv
alternative label: Rhinologia (59.59)
alternative label: Silmä, ihminen (59.59)
alternative label: Silmälasit, silmätaudit (59.59)
alternative label: Silmätaudit (59.59)
alternative label: Sinnen, människan (59.59) @sv
alternative label: Sinnesfysiologi, människan, allm. (59.59) @sv
alternative label: Skelning, ögonsjukdomar (59.59) @sv
alternative label: Sokeus, silmätaudit (59.59)
alternative label: Starr (59.59) @sv
alternative label: Taittoviat (59.59)
alternative label: Tasapainoelin, ihminen (59.59)
alternative label: Tasapainoelin, taudit (59.59)
alternative label: Tuntoaisti, ihminen (59.59)
alternative label: Tuoksu, hajuaisti (59.59)
alternative label: Värisokeus (59.59)
alternative label: Äänihuulet, ihminen (59.59)
broader: Elimet. Taudit
in scheme: YKL - Yleisten kirjastojen luokitusjärjestelmä
notation: 59.59
scope note: Silmä ja näköhermo sekä niiden taudit Taittoviat. Näkövammaisuus. Sokeus. Värisokeus Korva ja tasapainoelin sekä niiden taudit Kuulovammaisuus. Kuurous Nenäontelo, kurkku, kurkunpää, nielu- ja kitarisat sekä niiden taudit Tähän myös silmälasit ja kuulolaitteet ja niiden käyttö
scope note: Ögat och synnerven samt sjukdomar i dem Brytningsfel. Synskador. Blindhet. Färgblindhet Örat och balansorganet samt sjukdomar i dem Hörselskador. Dövhet Näshålan, halsen, struphuvudet, halsmandlarna och tonsillerna samt sjukdomar i dem Hit också glasögon och hörapparater och användningen av dem @sv

Lasten terveydenhoito. Lastentaudit
type: Concept
References: Lapsuuden ja nuoruuden psykologia
References: Perhepolitiikka
References: Tartuntataudit
References: Psykiatria
type: YKL-luokka
alternative label: Amning (59.6) @sv
alternative label: Babyer, barnsjukdomar (59.6) @sv
alternative label: Babyer, skötsel (59.6) @sv
alternative label: Babysim (59.6) @sv
alternative label: Barn, hälsovård (59.6) @sv
alternative label: Barn, utveckling (59.6) @sv
alternative label: Barn, utveckling, fysisk (59.6) @sv
alternative label: Barnavdelningar, sjukhus (59.6) @sv
alternative label: Barnavård (59.6) @sv
alternative label: Barnens utveckling (59.6) @sv
alternative label: Barnets utveckling (59.6) @sv
alternative label: Barnrådgivningsbyråer (59.6) @sv
alternative label: Barnsjukdomar (59.6) @sv
alternative label: Barnsjukhus (59.6) @sv
alternative label: Hälsovård, barn (59.6) @sv
alternative label: Imetys (59.6)
alternative label: Individutveckling, barnets utveckling (59.6) @sv
alternative label: Kasvaminen, ihminen (59.6)
alternative label: Keskoset (59.6)
alternative label: Lapsen kehitys (59.6)
alternative label: Lapset, kehitys (59.6)
alternative label: Lapset, kehitys, fyysinen (59.6)
alternative label: Lapset, terveydenhoito (59.6)
alternative label: Lasten kehitys (59.6)
alternative label: Lastenhoito (59.6)
alternative label: Lastenlääketiede (59.6)
alternative label: Lastenneuvolat (59.6)
alternative label: Lastenosastot, sairaalat (59.6)
alternative label: Lastensairaalat (59.6)
alternative label: Lastentaudit (59.6)
alternative label: Neuvolat, lastenneuvolat (59.6)
alternative label: Pediatria (59.6)
alternative label: Pediatrik (59.6) @sv
alternative label: Prematurbarn (59.6) @sv
alternative label: Rådgivningsbyråer för barnavård (59.6) @sv
alternative label: Simning, babysim (59.6) @sv
alternative label: Terveydenhoito, lapset (59.6)
alternative label: Uinti, vauvauinti (59.6)
alternative label: Vauvat, hoito (59.6)
alternative label: Vauvat, lastentaudit (59.6)
alternative label: Vauvauinti (59.6)
alternative label: Växande, människan (59.6) @sv
alternative label: Yksilönkehitys, lapsen kehitys (59.6)
broader: LÄÄKETIEDE. TERVEYDENHOITO
in scheme: YKL - Yleisten kirjastojen luokitusjärjestelmä
notation: 59.6
preferred label: Children's health care. Children's diseases @en
preferred label: Hälso- och sjukvård för barn. Barnsjukdomar @sv
scope note: Hit allmänna verk om barnavård, hälso- och sjukvård för barn, barnsjukdomar eller pediatrik Rådgivningsbyråer för barnavård Om verket behandlar både barnets fysiska och psykiska utveckling, ges företräde åt klass 59.6 Verk som behandlar en enskild barnsjukdom förs till den ifrågavarande sjukdomens klass 59.5+ eller 59.9 @sv
scope note: Tähän lastenhoitoa, lasten terveydenhoitoa, lastentauteja tai lastenlääketiedettä koskevat yleisteokset Lastenneuvolat Jos teos koskee sekä lapsen fyysistä että henkistä kehitystä, annetaan etusija luokalle 59.6 Tiettyä lastentautia koskevat teokset luokitetaan ko. taudin luokkaan 59.5+ tai 59.9

Vanhusten terveydenhoito. Vanhusten taudit
type: Concept
References: Aikuisiän ja vanhuuden psykologia
References: Vanhuspalvelut
References: Hermosto. Neurologia
References: Psykiatria
type: YKL-luokka
alternative label: Geriatri (59.8) @sv
alternative label: Geriatria (59.8)
alternative label: Gerontologi (59.8) @sv
alternative label: Gerontologi, medicin (59.8) @sv
alternative label: Gerontologia (59.8)
alternative label: Gerontologia, lääketiede (59.8)
alternative label: Hälsovård, åldringar (59.8) @sv
alternative label: Ikääntyminen, fyysinen (59.8)
alternative label: Individutveckling, människans åldrande (59.8) @sv
alternative label: Terveydenhoito, vanhukset (59.8)
alternative label: Vanheneminen, fyysinen (59.8)
alternative label: Vanheneminen, geriatria ja gerontologia (59.8)
alternative label: Vanhukset, geriatria ja gerontologia (59.8)
alternative label: Vanhukset, lääketiede (59.8)
alternative label: Vanhukset, terveydenhoito (59.8)
alternative label: Yksilönkehitys, ihmisen vanheneminen (59.8)
alternative label: Åldrande, fysiskt (59.8) @sv
alternative label: Åldrande, geriatri och gerontologi (59.8) @sv
alternative label: Åldringar, geriatri och gerontologi (59.8) @sv
alternative label: Åldringar, hälsovård (59.8) @sv
alternative label: Åldringar, medicin (59.8) @sv
broader: LÄÄKETIEDE. TERVEYDENHOITO
in scheme: YKL - Yleisten kirjastojen luokitusjärjestelmä
notation: 59.8
preferred label: Health care for the elderly. Geriatric diseases @en
preferred label: Hälso- och sjukvård för äldre. Geriatriska sjukdomar @sv
scope note: Hit allmänna verk om hälsovård för äldre, geriatriska sjukdomar eller verk om människans fysiska åldrande i allmänhet Hit också allmänna verk om geriatri och gerontologi Verk som behandlar en bestämd geriatrisk sjukdom förs till den ifrågavarande sjukdomens klass 59.5+ eller 59.9 @sv
scope note: Tähän vanhusten terveydenhoitoa, vanhusten tauteja tai ihmisen fyysistä vanhenemista koskevat yleisteokset Tähän myös geriatrian ja gerontologian yleisteokset Tiettyä vanhusten tautia koskevat teokset luokitetaan ko. taudin luokkaan 59.5+ tai 59.9

Hammaslääketiede
type: Concept
type: YKL-luokka
alternative label: Amalgaami, hammaslääketiede (59.9)
alternative label: Amalgam, odontologi (59.9) @sv
alternative label: Bett, odontologi (59.9) @sv
alternative label: Hammashuolto (59.9)
alternative label: Hammaskirurgia (59.9)
alternative label: Hammaslääketiede (59.9)
alternative label: Hammasproteesit (59.9)
alternative label: Hammasteknikon työ (59.9)
alternative label: Hampaat, hoito (59.9)
alternative label: Hampaat, ihminen (59.9)
alternative label: Hampaat, taudit (59.9)
alternative label: Ikenet, hoito ja sairaudet (59.9)
alternative label: Kouluterveydenhuolto, hammashoito (59.9)
alternative label: Ksylitoli, hampaidenhoito (59.9+)
alternative label: Käkkirurgi (59.9) @sv
alternative label: Leukakirurgia (59.9)
alternative label: Munhygien (59.9) @sv
alternative label: Munhälsa (59.9) @sv
alternative label: Munhålans sjukdomar, odontologi (59.9) @sv
alternative label: Odontologi (59.9) @sv
alternative label: Odontologia (59.9)
alternative label: Opiskelijaterveydenhuolto, hammashuolto (59.9)
alternative label: Opiskeluterveydenhuolto, hammashuolto (59.9)
alternative label: Oral kirurgi (59.9) @sv
alternative label: Proteesit, hammaslääketiede (59.9)
alternative label: Proteser, odontologi (59.9) @sv
alternative label: Purenta, hammaslääketiede (59.9)
alternative label: Skolhälsovård, tandvård (59.9) @sv
alternative label: Studenthälsovård, tandvård (59.9) @sv
alternative label: Suuhygienia (59.9)
alternative label: Suukirurgia (59.9)
alternative label: Suun terveys (59.9)
alternative label: Suuontelon taudit, hammaslääketiede (59.9)
alternative label: Tandkirurgi (59.9) @sv
alternative label: Tandkött, vård och sjukdomar (59.9) @sv
alternative label: Tandmedicin (59.9) @sv
alternative label: Tandproteser (59.9) @sv
alternative label: Tandteknikerns arbete (59.9) @sv
alternative label: Tandvård (59.9) @sv
alternative label: Tänder, människan (59.9) @sv
alternative label: Tänder, sjukdomar (59.9) @sv
alternative label: Tänder, vård (59.9) @sv
alternative label: Xylitol, tandvård (59.9+) @sv
broader: LÄÄKETIEDE. TERVEYDENHOITO
in scheme: YKL - Yleisten kirjastojen luokitusjärjestelmä
notation: 59.9
preferred label: Odontologi @sv
preferred label: Odontology @en
scope note: Hampaat ja ikenet ja niiden taudit. Yleinen hammashuolto. Suun terveys. Hammaslääkärin ja hammashoitajan työ. Hammasteknikon työ. Hammasproteesit. Hammaskirurgia. Leukakirurgia. Suukirurgia. Tähän myös suuhygienia sekä hampaiden ja ikenien hoito henkilökohtaisen terveydenhoidon kannalta
scope note: Tänder och tandkött samt sjukdomar i dem. Allmän tandvård. Munhälsa. Tandteknikerns arbete. Tandproteser. Tandkirurgi. Käkkirurgi. Oral kirurgi. Hit också munhygien samt vården av tänder och tandkött sedd ur den personliga hygienens synvinkel @sv

TEKNIIKKA. TEOLLISUUS. KÄSITYÖ. MAA- JA METSÄTALOUS KOTITALOUS. LIIKETALOUS. LIIKENNE
type: Concept
type: YKL-luokka
in scheme: YKL - Yleisten kirjastojen luokitusjärjestelmä
narrower: SOVELLETUT TIETEET
narrower: TIETOTEKNIIKKA. TIETOLIIKENNE. VIESTINTÄTEKNIIKKA. TEKOÄLY
narrower: METALLITEOLLISUUS. KONETEKNIIKKA. LIIKENNEVÄLINEET SÄHKÖTEKNIIKKA
narrower: KAIVANNAISTEOLLISUUS. KEMIANTEOLLISUUS
narrower: PUUNJALOSTUSTEOLLISUUS. TEKSTIILITEOLLISUUS NAHKATEOLLISUUS. HIENOMEKAANINEN TEOLLISUUS
narrower: KÄSITYÖ. KOTITEOLLISUUS
narrower: RAKENNUSTEKNIIKKA
narrower: MAA- JA METSÄTALOUS. ELINTARVIKETEOLLISUUS. BIOTEKNIIKKA
narrower: KOTITALOUS. LAITOSTALOUS
narrower: LIIKETALOUS. MARKKINOINTI. KAUPPA. LIIKENNE
notation: 6
preferred label: TECHNOLOGY. INDUSTRY. HANDICRAFT. AGRICULTURE AND FORESTRY. DOMESTIC SCIENCE. BUSINESS ECONOMY. TRAFFIC @en
preferred label: TEKNIK. INDUSTRI HANTVERK OCH HANDARBETE JORD- OCH SKOGSBRUK. HUSHÅLLNING FÖRETAGSEKONOMI. TRAFIK @sv
top concept of: YKL - Yleisten kirjastojen luokitusjärjestelmä

SOVELLETUT TIETEET
type: Concept
References: Kirjapainotaito. Graafinen teollisuus
References: Palo- ja pelastustoimi
References: Pääoma. Luonnonvarat
References: Työsuojelu. Ergonomia
References: Sairaalatekniikka
References: Säätö- ja systeemitekniikka. Teollinen automaatio
type: YKL-luokka
alternative label: Flerbranschföretag, industri (60) @sv
alternative label: Fysiikka, tekninen (60)
alternative label: Fysik, teknisk (60) @sv
alternative label: Industri (60) @sv
alternative label: Industrialisering, industrins historia (60+) @sv
alternative label: Industrialism, industrins historia (60+) @sv
alternative label: Industrialismi, teollisuuden historia (60+)
alternative label: Industriell formgivning, resp. område (60 ... 64+) @sv
alternative label: Industriella processer (60) @sv
alternative label: Industriella yrken (60) @sv
alternative label: Industripolitik (60) @sv
alternative label: Industrisamhällen, historia allm. (60+) @sv
alternative label: Korjaus, tekniikka (60)
alternative label: Korjausoppaat, tekniikka (60)
alternative label: Mjuk teknologi (60) @sv
alternative label: Monialayritykset, teollisuus (60)
alternative label: Nanotekniikka (60)
alternative label: Nanoteknik (60) @sv
alternative label: Nanoteknologi (60) @sv
alternative label: Nanoteknologia (60)
alternative label: Pehmeä teknolgia (60)
alternative label: Processindustri (60) @sv
alternative label: Processteknik (60) @sv
alternative label: Produktion, industri (60) @sv
alternative label: Produktionsprocesser, processindustri (60) @sv
alternative label: Prosessitekniikka (60)
alternative label: Prosessiteollisuus (60)
alternative label: Raaka-aineet, teollisuus (60)
alternative label: Reparation, teknik (60) @sv
alternative label: Reparationshandböcker, teknik (60) @sv
alternative label: Råmaterial, industri (60) @sv
alternative label: Sovelletut tieteet (60)
alternative label: Tekniikka (60)
alternative label: Teknik (60) @sv
alternative label: Tekninen fysiikka (60)
alternative label: Tekninen työ (60)
alternative label: Teknisk fysik (60) @sv
alternative label: Tekniskt arbete (60) @sv
alternative label: Teknokrati (60) @sv
alternative label: Teknokratia (60)
alternative label: Teknologi (60) @sv
alternative label: Teknologia (60)
alternative label: Teknologiakasvatus (60)
alternative label: Teknologiapolitiikka (60)
alternative label: Teknologifostran (60) @sv
alternative label: Teknologipolitik (60) @sv
alternative label: Teollinen muotoilu, aloittain (60 ... 64+)
alternative label: Teolliset prosessit (60)
alternative label: Teollistuminen, teollisuuden historia (60+)
alternative label: Teollisuus (60)
alternative label: Teollisuusammatit (60)
alternative label: Teollisuuspolitiikka (60)
alternative label: Teollisuusprosessit (60)
alternative label: Teollisuusyhdyskunnat, historia yl. (60+)
alternative label: Tillämpade vetenskaper (60) @sv
alternative label: Tuotanto, teollisuus (60)
alternative label: Tuotantoprosessit, prosessiteollisuus (60)
alternative label: Työkalut, tekniikka (60)
alternative label: Verktyg, teknik (60) @sv
broader: TEKNIIKKA. TEOLLISUUS. KÄSITYÖ. MAA- JA METSÄTALOUS KOTITALOUS. LIIKETALOUS. LIIKENNE
in scheme: YKL - Yleisten kirjastojen luokitusjärjestelmä
narrower: Tekninen piirustus
narrower: Aineoppi. Aineenkoetus. Tekninen mekaniikka
narrower: Standardit. Normit. Mittayksiköt
narrower: Innovaatiot. Keksinnöt. Patentit
narrower: Tekniikka ja sovelletut tieteet harrasteena
narrower: Energia
notation: 60
preferred label: APPLIED SCIENCES @en
preferred label: TILLÄMPADE VETENSKAPER @sv
scope note: Hit allmänna verk om tillämpade vetenskaper, teknik och industri samt verk som behandlar flera områden av tillämpad vetenskap, teknik eller industri. Teknologi och teknologipolitik i allmänhet. Nanoteknologi i allmänhet. Mjuk teknologi i allmänhet. Teknisk fysik i allmänhet. Processteknik i allmänhet. Industrins råmaterial i allmänhet. Industriella processer i allmänhet. Industri- och affärsföretag som verkar inom flera branscher. Hit också allmänna verk om verktyg. Om tyngdpunkten i ett verk som behandlar tillämpade vetenskaper, teknik eller industri ligger på ett enskilt område, ges företräde åt områdets klass. Tillämpade vetenskapernas, teknikens och industrins allmänna historia 60.09. Teknik, filosofi 60.01 @sv
scope note: Tähän sovellettujen tieteiden, tekniikan ja teollisuuden yleisteokset sekä teokset, jotka koskevat useampaa sovelletun tieteen, tekniikan tai teollisuuden alaa. Teknologia ja teknologiapolitiikka yleensä. Nanoteknologia yleensä. Pehmeä teknologia yleensä. Tekninen fysiikka yleensä. Prosessitekniikka yleensä. Teollisuuden raaka-aineet yleensä. Teolliset prosessit yleensä. Monialaiset teollisuus- ja liikeyritykset yleensä. Tähän myös työkaluja koskevat yleisteokset. Jos sovellettuja tieteitä, tekniikkaa tai teollisuutta koskeva teos painottuu johonkin tiettyyn alaan, annetaan etusija alan mukaiselle luokalle. Sovellettujen tieteiden, tekniikan ja teollisuuden yleinen historia 60.09. Teollisuusyhdyskunnat teollisuuden historian näkökulmasta luokitetaan ko. teollisuuden alan mukaiseen luokkaan. Tekniikan filosofia 60.01

Tekninen piirustus
type: Concept
References: Geodesia. Maanmittaus. Kartoitus
References: Konetekniikka. Voitelutekniikka
References: Rakennusstatiikka. Rakennussuunnittelu
References: ARKKITEHTUURI
References: MAALAUSTAIDE. PIIRUSTUSTAIDE
type: YKL-luokka
alternative label: Perspektiivioppi, tekninen piirustus (60.1)
alternative label: Perspektivlära, teknisk ritning (60.1) @sv
alternative label: Piirustus, tekninen (60.1)
alternative label: Projektio-oppi, tekninen piirustus (60.1)
alternative label: Projektionslära, teknisk ritning (60.1) @sv
alternative label: Ritning, teknisk (60.1) @sv
alternative label: Tekninen piirustus (60.1)
alternative label: Teknisk ritning (60.1) @sv
broader: SOVELLETUT TIETEET
in scheme: YKL - Yleisten kirjastojen luokitusjärjestelmä
notation: 60.1
preferred label: Technical drawing @en
preferred label: Teknisk ritning @sv
scope note: Hit allmänna verk om teknisk ritning Hit också perspektiv- och projektionslära som har samband med teknisk ritning Teknisk ritning inom specialområden klassificeras enligt område @sv
scope note: Tähän teknisen piirustuksen yleisteokset Tähän myös tekniseen piirustukseen liittyvä perspektiivi- ja projektio-oppi Erikoisalojen tekninen piirustus luokitetaan alan mukaan

Aineoppi. Aineenkoetus. Tekninen mekaniikka
type: Concept
References: Mekaniikka
References: Rakennusstatiikka. Rakennussuunnittelu
References: Tavaraoppi
type: YKL-luokka
alternative label: Aerodynamiikka, tekniikka, yl. (60.2)
alternative label: Aerodynamik, teknik, allm. (60.2) @sv
alternative label: Aeromekaniikka, tekniikka, yl. (60.2)
alternative label: Aeromekanik, teknik, allm. (60.2) @sv
alternative label: Aerostatiikka, tekniikka, yl. (60.2)
alternative label: Aerostatik, teknik, allm. (60.2) @sv
alternative label: Aineenkoetus, yl. (60.2)
alternative label: Aineensuojelu, yl. (60.2)
alternative label: Aineoppi, yl. (60.2)
alternative label: Aineviat, yl. (60.2)
alternative label: Diffusion, teknisk mekanik (60.2) @sv
alternative label: Diffuusio, tekninen mekaniikka (60.2)
alternative label: Elasticitet, teknik (60.2) @sv
alternative label: Elasticitetslära, teknisk mekanik (60.2) @sv
alternative label: Elastisuus, tekniikka (60.2)
alternative label: Fasta kroppars mekanik, teknik (60.2) @sv
alternative label: Flöde, teknisk mekanik (60.2) @sv
alternative label: Gaser, teknisk mekanik (60.2) @sv
alternative label: Hydrodynamiikka, tekniikka (60.2)
alternative label: Hydrodynamik, teknik (60.2) @sv
alternative label: Hydromekaniikka, tekniikka (60.2)
alternative label: Hydromekanik, teknik (60.2) @sv
alternative label: Hydrostatiikka, tekniikka (60.2)
alternative label: Hydrostatik, teknik (60.2) @sv
alternative label: Hållfasthetsberäkningar, teknik (60.2) @sv
alternative label: Hållfasthetslära (60.2) @sv
alternative label: Hållfasthetsprov, teknik (60.2) @sv
alternative label: Kaasut, tekninen mekaniikka (60.2)
alternative label: Kapillariteetti, tekninen mekaniikka (60.2)
alternative label: Kapillaritet, teknisk mekanik (60.2) @sv
alternative label: Kiinteiden kappaleiden mekaniikka, tekniikka (60.2)
alternative label: Kimmo-oppi, tekninen mekaniikka (60.2)
alternative label: Kinetiikka, tekniikka (60.2)
alternative label: Kinetik, teknik (60.2) @sv
alternative label: Korroosio, aineoppi (60.2)
alternative label: Korrosion, materiallära (60.2) @sv
alternative label: Korrosion, materialskydd (60.2) @sv
alternative label: Lujuuskokeet, tekniikka (60.2)
alternative label: Lujuuslaskelmat, tekniikka (60.2)
alternative label: Lujuusoppi, tekniikka (60.2)
alternative label: Materiaalitekniikka (60.2)
alternative label: Materialfel, allm. (60.2) @sv
alternative label: Materiallära, allm. (60.2) @sv
alternative label: Materialprovning, allm. (60.2) @sv
alternative label: Materialskydd, allm. (60.2) @sv
alternative label: Materialteknik (60.2) @sv
alternative label: Mekaniikka, tekniikka (60.2)
alternative label: Mekanik, teknik (60.2) @sv
alternative label: Nesteet, tekninen mekaniikka (60.2)
alternative label: Osmoosi, tekninen mekaniikka (60.2)
alternative label: Osmos, teknisk mekanik (60.2) @sv
alternative label: Pintaviat (60.2)
alternative label: Plasticitet, teknisk mekanik (60.2) @sv
alternative label: Plastisuus, tekninen mekaniikka (60.2)
alternative label: Statiikka, tekniikka (60.2)
alternative label: Statik, teknik (60.2) @sv
alternative label: Syöpyminen, aineensuojelu (60.2)
alternative label: Tekninen kimmo-oppi (60.2)
alternative label: Tekninen lujuusoppi (60.2)
alternative label: Tekninen mekaniikka (60.2)
alternative label: Teknisk elasticitetslära (60.2) @sv
alternative label: Teknisk hållfasthetslära (60.2) @sv
alternative label: Teknisk mekanik (60.2) @sv
alternative label: Virtaus, tekninen mekaniikka (60.2)
alternative label: Vätskor, teknisk mekanik (60.2) @sv
alternative label: Ytskador (60.2) @sv
broader: SOVELLETUT TIETEET
in scheme: YKL - Yleisten kirjastojen luokitusjärjestelmä
notation: 60.2
preferred label: Materiallära. Materialprovning. Teknisk mekanik @sv
preferred label: Materials engineering. Material testing. Technical mechanics @en
scope note: Hit allmänna verk om materiallära, materialprovning och teknisk mekanik Testning och undersökning av materialens mekaniska egenskaper och struktur Hållfasthetsprov. Hållfasthetsberäkning Teknisk hållfasthets- och elasticitetslära Materialskydd. Materialfel. Ytskador. Korrosion och förhindrande av korrosion Materiallära, materialprovning och teknisk mekanik inom specialområden klassificeras enligt område @sv
scope note: Tähän aineopin, aineenkoetuksen ja teknisen mekaniikan yleisteokset Aineiden mekaanisten ominaisuuksien ja rakenteen tutkimus ja testaus Lujuuskokeet. Lujuuslaskelmat Tekninen lujuus- ja kimmo-oppi Aineensuojelu. Aineviat. Pintaviat. Korroosio ja sen esto Erikoisalojen aineoppi, aineenkoetus ja tekninen mekaniikka luokitetaan alan mukaan

Standardit. Normit. Mittayksiköt
type: Concept
References: Raha. Valuutta
References: Rahatiede. Mitalitiede
type: YKL-luokka
alternative label: Metersystemet (60.3) @sv
alternative label: Metrijärjestelmä (60.3)
alternative label: Metrologi (60.3) @sv
alternative label: Metrologia (60.3)
alternative label: Mitat (60.3)
alternative label: Mittayksikköjärjestelmät (60.3)
alternative label: Mittayksiköt (60.3)
alternative label: Mått (60.3) @sv
alternative label: Måttenheter (60.3) @sv
alternative label: Måttenhetssystem (60.3) @sv
alternative label: Normer, teknik (60.3) @sv
alternative label: Normit, tekniikka (60.3)
alternative label: Painomitat (60.3)
alternative label: SI-järjestelmä (60.3)
alternative label: SI-systemet (60.3) @sv
alternative label: Standarder (60.3) @sv
alternative label: Standardit (60.3)
alternative label: Viktenheter (60.3) @sv
broader: SOVELLETUT TIETEET
in scheme: YKL - Yleisten kirjastojen luokitusjärjestelmä
notation: 60.3
preferred label: Standarder. Normer. Måttenheter @sv
preferred label: Standards. Norms. Units of measurement @en
scope note: Hit allmänna verk om standarden, normer, måttenheter eller måttenhetssystem SI-systemet. Metrologi Standarder, normer och måttenheter inom specialområden klassificeras enligt område Formtillägget 081 används inte i samband med klassen 60.3 @sv
scope note: Tähän standardeja, normeja, mittayksiköitä tai mittayksikköjärjestelmiä koskevat yleisteokset SI-järjestelmä. Metrologia Erikoisalojen standardit, normit ja mittayksiköt luokitetaan alan mukaan Muotoluokkaa 081 ei käytetä luokan 60.3 yhteydessä

Innovaatiot. Keksinnöt. Patentit
type: Concept
References: TIETOTEORIA. TIEDEOPPI
References: URN:NBN:fi:au:ykl:16.09
References: Immateriaalioikeudet
References: URN:NBN:fi:au:ykl:50.09
References: Tuotannon organisointi ja suunnittelu
References: Mainonta
type: YKL-luokka
alternative label: Innovaatiopolitiikka (60.4)
alternative label: Innovaatiot (60.4)
alternative label: Innovaatiotoiminta (60.4)
alternative label: Innovationer (60.4) @sv
alternative label: Innovationspolitik (60.4) @sv
alternative label: Innovationsverksamhet (60.4) @sv
alternative label: Keksinnöt (60.4)
alternative label: Mallit, tekniikka (60.4)
alternative label: Modeller, teknik (60.4) @sv
alternative label: Patent (60.4) @sv
alternative label: Patentit (60.4)
alternative label: Prototyper, teknik (60.4) @sv
alternative label: Prototyypit, tekniikka (60.4)
alternative label: Uppfinningar (60.4) @sv
broader: SOVELLETUT TIETEET
in scheme: YKL - Yleisten kirjastojen luokitusjärjestelmä
notation: 60.4
preferred label: Innovationer. Uppfinningar. Patent @sv
preferred label: Innovations. Inventions. Patents @en
scope note: Hit allmänna verk om uppfinningar, patent, modeller och prototyper Hit också innovationer och utveckling av tekniska förbättringar i allmänhet Innovationspolitik i allmänhet Uppfinningar, patent, modeller och prototyper samt innovationer och innovationspolitik för specialområden klassificeras enligt område Uppfinningarnas historia i allmänhet 60.409 @sv
scope note: Tähän keksintöjä, patentteja, malleja ja prototyyppejä koskevat yleisteokset Tähän myös innovaatiot ja teknisten parannusten kehittely yleensä Innovaatiopolitiikka yleensä Erikoisalojen keksinnöt, patentit, mallit ja prototyypit sekä innovaatiot ja innovaatiopolitiikka luokitetaan alan mukaan Yleinen keksintöjen historia 60.409

Tekniikka ja sovelletut tieteet harrasteena
type: Concept
References: Matematiikka harrasteena ja ajanvietteenä
References: Tähtitieteelliset kojeet
References: Fysiikka harrasteena ja ajanvietteenä
References: Kemia harrasteena ja ajanvietteenä
References: Äänitekniikka. Radiotekniikka
References: Sähkötekniikka
References: Elektroniikka
References: KÄSITYÖ. KOTITEOLLISUUS
References: Pelit. Leikit. Keräily
type: YKL-luokka
alternative label: Ajanviete, sovelletut tieteet (60.7)
alternative label: Ajanviete, tekniikka ja pienoismallit (60.7)
alternative label: Askartelu, tekniikka ja pienoismallit (60.7)
alternative label: Harrastukset, sovelletut tieteet (60.7)
alternative label: Harrastukset, tekniikka ja pienoismallit (60.7)
alternative label: Hobbyarbete, teknik och miniatyrmodeller (60.7) @sv
alternative label: Hobbyer, teknik och miniatyrmodeller (60.7) @sv
alternative label: Hobbyer, tillämpade vetenskaper (60.7) @sv
alternative label: Miniatyrmodeller, teknisk hobbyverksamhet (60.7) @sv
alternative label: Pienoismallit, tekninen askartelu (60.7)
alternative label: Sovelletut tieteet harrasteena (60.7)
alternative label: Tekniikka, harrasteena (60.7)
alternative label: Teknik, som hobby (60.7) @sv
alternative label: Tekninen ajanviete (60.7)
alternative label: Tekninen askartelu (60.7)
alternative label: Teknisk pyssel (60.7) @sv
alternative label: Teknisk tidsfördriv (60.7) @sv
alternative label: Tidsfördriv, teknik och miniatyrmodeller (60.7) @sv
alternative label: Tidsfördriv, tillämpade vetenskaper (60.7) @sv
alternative label: Tillämpade vetenskaper som hobby (60.7) @sv
broader: SOVELLETUT TIETEET
in scheme: YKL - Yleisten kirjastojen luokitusjärjestelmä
notation: 60.7
preferred label: Technology and applied sciences as a pastime @en
preferred label: Teknik och tillämpade vetenskaper som hobby @sv
scope note: Hit allmänna verk om tekniska hobbyer och tidsfördriv Byggande av miniatyrmodeller Tekniska hobbyer, tekniska anläggningar och miniatyrmodeller för specialområden klassificeras enligt område @sv
scope note: Tähän teknisen askartelun yleisteokset Teknisten laitteiden ja kojeiden rakentelu Pienoismallit ja niiden rakentelu Erikoisalojen tekninen askartelu, tekniset laitteet ja pienoismallit luokitetaan alan mukaan

Energia
type: Concept
References: Pääoma. Luonnonvarat
References: Ympäristönsuojelu. Luonnonsuojelu
References: Sähköenergian tuottaminen
References: Lämmitys
alternative label: Aaltoenergia, energialähteet (60.8)
alternative label: Aaltoenergia, energiapolitiikka (60.8)
alternative label: Aurinkoenergia, energialähteet (60.8)
alternative label: Aurinkoenergia, energiapolitiikka (60.8)
alternative label: Aurinkovoimalat (60.8)
alternative label: Elbesparing, energipolitik (60.8+) @sv
alternative label: Elenergi, energipolitik (60.8+) @sv
alternative label: Elförbrukning, energipolitik (60.8+) @sv
alternative label: Elproduktion, energipolitik (60.8) @sv
alternative label: Energiahuolto (60.8+)
alternative label: Energialternativ, energipolitik (60.8+) @sv
alternative label: Energialähteet (60.8+)
alternative label: Energiankulutus, energiapolitiikka (60.8+)
alternative label: Energiansäästö, energiapolitiikka (60.8+)
alternative label: Energiapolitiikka (60.8+)
alternative label: Energiatalous (60.8+)
alternative label: Energiateknologia (60.8+)
alternative label: Energiavaihtoehdot, energiapolitiikka (60.8+)
alternative label: Energiavarat (60.8+)
alternative label: Energibesparing, energipolitik (60.8+) @sv
alternative label: Energiekonomi (60.8+) @sv
alternative label: Energiförbrukning, energipolitik (60.8+) @sv
alternative label: Energiförsörjning (60.8+) @sv
alternative label: Energikällor (60.8+) @sv
alternative label: Energipolitik (60.8+) @sv
alternative label: Energiteknologi (60.8+) @sv
alternative label: Energitillgångar (60.8+) @sv
alternative label: Forsar, energikällor (60.8) @sv
alternative label: Forsar, energipolitik (60.8) @sv
alternative label: Geoterminen energia (60.8)
alternative label: Geotermisk energi (60.8) @sv
alternative label: Höyryvoima (60.8)
alternative label: Jordvärme, energikällor (60.8) @sv
alternative label: Jordvärme, energipolitik (60.8) @sv
alternative label: Jordvärme, kraftverk (60.8) @sv
alternative label: Kosket, energialähteet (60.8)
alternative label: Kosket, energiapolitiikka (60.8)
alternative label: Kraftverk (60.8) @sv
alternative label: Kraftverk, kraftvärmeverk (60.8+) @sv
alternative label: Lämmitys, energiapolitiikka (60.8+)
alternative label: Lämmitys, voimalatekniikka (60.8+)
alternative label: Lämmitysvoimalat (60.8+)
alternative label: Lämmitysvoimalatekniikka (60.8+)
alternative label: Maalämpö, energialähteet (60.8)
alternative label: Maalämpö, energiapolitiikka (60.8)
alternative label: Maalämpö, voimalat (60.8)
alternative label: Solenergi, energikällor (60.8) @sv
alternative label: Solenergi, energipolitik (60.8) @sv
alternative label: Solkraftverk (60.8) @sv
alternative label: Sähköenergia, energiapolitiikka (60.8+)
alternative label: Sähkönkulutus, energiapolitiikka (60.8+)
alternative label: Sähkönsäästö, energiapolitiikka (60.8+)
alternative label: Sähköntuotanto, energiapolitiikka (60.8)
alternative label: Tidvattenenergi, energikällor (60.8) @sv
alternative label: Tidvattenenergi, energipolitik (60.8) @sv
alternative label: Tuulienergia, energialähteet (60.8)
alternative label: Tuulienergia, energiapolitiikka (60.8)
alternative label: Uppvärmning, energipolitik (60.8+) @sv
alternative label: Uppvärmning, kraftverksteknik (60.8+) @sv
alternative label: Vattenenergi, energikällor (60.8) @sv
alternative label: Vesienergia, energialähteet (60.8)
alternative label: Vesienergia, energiapolitiikka (60.8)
alternative label: Vesivoima, energialähteet (60.8)
alternative label: Vesivoima, energiapolitiikka (60.8)
alternative label: Voimalat (60.8)
alternative label: Voimalat, lämpövoimalat (60.8+)
alternative label: Vuorovesienergia, energialähteet (60.8)
alternative label: Vuorovesienergia, energiapolitiikka (60.8)
broader: SOVELLETUT TIETEET
in scheme: YKL - Yleisten kirjastojen luokitusjärjestelmä
narrower: Orgaaniset ja fossiiliset polttoaineet
narrower: Ydinenergia
notation: 60.8
scope note: Hit och till underklasserna energiförsörjning, energipolitik och energikällor samt val av energikällor, deras egenskaper och användningen av dem i energiproduktionen Hit vattenkraft, tidvattenkraft, ångkraft, vindkraft, solenergi och geotermisk energi Hit och till underklasserna också energiförbrukning, energireglering och energihushållning ur energipolitisk synvinkel Hit och till underklasserna också kraftvärmeverk och deras teknik Hit och till underklasserna också verk som behandlar både kraftvärme- och elkraftverk @sv
scope note: Tähän ja alaluokkiin energiahuolto, energiapolitiikka sekä energialähteet ja niiden valinta, ominaisuudet ja käyttö energiantuotannossa Tähän vesivoima, vuorovesivoima, höyryvoima, tuulivoima, auringon energia ja geoterminen energia Tähän ja alaluokkiin myös energian kulutus, säännöstely ja säästö energiapolitiikan kannalta Tähän ja alaluokkiin myös lämmitysvoimalat ja niiden tekniikka Tähän ja alaluokkiin myös teokset, jotka koskevat sekä lämmitys- että sähkövoimaloita Tähän energia- ja voimalatekniikan yleisteokset

Orgaaniset ja fossiiliset polttoaineet
type: Concept
References: Ilmansuojelu
References: Sähköenergian tuottaminen
References: Lämmitys
References: Maaliikenne
alternative label: Avolouhokset, kivi- ja ruskohiilen louhinta (60.82)
alternative label: Bensiinit, öljynjalostusteollisuus (60.82)
alternative label: Bioenergia, energiatalous (60.82)
alternative label: Biopolttoaineet (60.82)
alternative label: Dieselöljy, öljynjalostusteollisuus (60.82)
alternative label: Fossiiliset polttoaineet (60.82)
alternative label: Fossiiliset polttoaineet, energiapolitiikka (60.82)
alternative label: Fossiiliset polttoaineet, etsintä, louhinta ja poraus (60.82)
alternative label: Fossiiliset polttoaineet, jalostustekniikka (60.82)
alternative label: Geologia, fossiiliset polttoaineet (60.82)
alternative label: Geotekniikka, fossiiliset polttoaineet (60.82)
alternative label: Hake, energialähteet (60.82)
alternative label: Halot, energialähteet (60.82)
alternative label: Jalostus, fossiiliset polttoaineet (60.82)
alternative label: Kaasumaiset polttoaineet (60.82)
alternative label: Kaasut, polttoaineteknologia (60.82)
alternative label: Kaasut, öljynjalostusteollisuus (60.82)
alternative label: Kaasuvoimalat (60.82)
alternative label: Kaivannaiset, fossiiliset polttoaineet (60.82)
alternative label: Kaivokset, kivi- ja ruskohiili (60.82)
alternative label: Kaivuutekniikka, kivi- ja ruskohiili (60.82)
alternative label: Kansainvälinen öljykauppa (60.82)
alternative label: Kiinteät polttoaineet (60.82)
alternative label: Kivihiili, energialähteet (60.82)
alternative label: Kivihiili, energiapolitiikka (60.82)
alternative label: Kivihiili, etsintä ja louhinta (60.82)
alternative label: Kivihiili, geologia (60.82)
alternative label: Kivihiili, polttoaineteollisuus (60.82)
alternative label: Kivihiili, teknologia (60.82)
alternative label: Kivihiili, voimalat (60.82)
alternative label: Koksi, polttoaineteollisuus (60.82)
alternative label: Louhinta, fossiiliset polttoaineet (60.82)
alternative label: Maakaasu, energialähteet (60.82)
alternative label: Maakaasu, energiapolitiikka (60.82)
alternative label: Maakaasu, etsintä ja poraus (60.82)
alternative label: Maakaasu, geologia (60.82)
alternative label: Maakaasuteknologia (60.82)
alternative label: Maakaasuvoimalat (60.82)
alternative label: Nestekaasu, öljynjalostusteollisuus (60.82)
alternative label: Nestemäiset polttoaineet, öljynjalostusteollisuus (60.82)
alternative label: OPEC (60.82)
alternative label: Orgaaniset polttoaineet, energiapolitiikka (60.82)
alternative label: Petrokemianteollisuus (60.82)
alternative label: Polttoainebriketit, polttoaineteollisuus (60.82)
alternative label: Polttoaineet (60.82)
alternative label: Polttoaineteknologia (60.82)
alternative label: Polttoaineteollisuus (60.82)
alternative label: Polttohake (60.82)
alternative label: Polttopuu (60.82)
alternative label: Polttoturve (60.82)
alternative label: Polttoöljyt (60.82)
alternative label: Poraus, öljyn ja maakaasun poraus (60.82)
alternative label: Puu, energialähteet (60.82)
alternative label: Puu, polttoaineet (60.82)
alternative label: Puuhake, energialähteet (60.82)
alternative label: Raakaöljy, öljynjalostusteollisuus (60.82)
alternative label: Rasvat, öljynjalostusteollisuus (60.82)
alternative label: Ruskohiili, energiapolitiikka (60.82)
alternative label: Ruskohiili, etsintä ja louhinta (60.82)
alternative label: Ruskohiili, teknologia (60.82)
alternative label: Taloudellinen geologia, fossiiliset polttoaineet (60.82)
alternative label: Turpeennosto (60.82)
alternative label: Turve, energialähteet (60.82)
alternative label: Turve, energiapolitiikka (60.82)
alternative label: Turve, polttoaineet (60.82)
alternative label: Turve, teknologia ja teollisuus (60.82)
alternative label: Turve, turpeennosto (60.82)
alternative label: Turve, voimalat (60.82)
alternative label: Vedenalainen poraus, öljy ja maakaasu (60.82)
alternative label: Vuoriteollisuus, fossiiliset polttoaineet (60.82)
broader: Energia
in scheme: YKL - Yleisten kirjastojen luokitusjärjestelmä
notation: 60.82
scope note: Orgaaniset ja fossiiliset polttoaineet. Biopolttoaineet Puu, turve, kivihiili, ruskohiili, öljy ja maakaasu energiapolitiikan ja energiahuollon sekä energia- ja voimalatekniikan kannalta Fossiilisia polttoaineita koskeva geologia Fossiilisten polttoaineiden etsintä, louhinta, poraus, kuljetus ja jalostus Fossiilisten polttoaineiden kauppa Polttoaineteollisuus ja -teknologia Kiinteiden, nestemäisten ja kaasumaisten polttoaineiden valmistus ja teknologia Kivi- ja ruskohiilen teknologia Puuhiili. Koksi. Polttoainebriketit Öljynjalostusteollisuus. Petrokemianteollisuus Raakaöljy. Polttoöljyt. Bensiinit. Dieselöljy Öljypohjaiset rasvat ja kaasut Maakaasuteknologia Turpeen teknologia. Turpeennosto Energiametsät energiapolitiikan kannalta
scope note: Organiska och fossila bränslen. Biobränslen Ved, torv, stenkol, brunkol, olja och naturgas med hänsyn till energipolitik, energiförsörjning samt energi- och kraftverksteknik Geologi som rör fossila bränslen Prospektering, utvinning, transport och raffinering av fossila bränslen Handel med fossila bränslen Bränsleindustri och bränsleteknologi Framställning av fasta, flytande och gasformiga bränslen Teknik som rör fasta, flytande och gasformiga bränslen Sten- och brunkolsteknologi Träkol. Koks. Bränslebriketter Oljeindustri. Petrokemisk industri Råolja. Brännoljor. Bensiner. Dieselolja Oljebaserade fetter och gaser Naturgasteknik Torvteknik. Torvtäkt Energiskogar ur energipolitisk synvinkel @sv

Ydinenergia
type: Concept
References: Palo- ja pelastustoimi
References: Aseistus. Asevarustelu. Asekauppa
References: Ympäristönsuojelu. Luonnonsuojelu
References: Ydinfysiikka. Atomifysiikka. Molekyylifysiikka
References: Teoreettinen ja fysikaalinen kemia
References: Sosiaalilääketiede. Ympäristölääketiede
References: Syöpätaudit
References: Voimakoneet. Moottorit
References: Laivat
alternative label: Atomenergi, användning (60.85) @sv
alternative label: Atomenergi, energikällor (60.85) @sv
alternative label: Atomenergi, energipolitik (60.85) @sv
alternative label: Atomienergia, energialähteet (60.85)
alternative label: Atomienergia, energiapolitiikka (60.85)
alternative label: Atomienergia, käyttö (60.85)
alternative label: Atomireaktorit, ydintekniikka (60.85)
alternative label: Atomitekniikka (60.85)
alternative label: Atomivoimalat (60.85)
alternative label: Atomkraftverk (60.85) @sv
alternative label: Atomreaktorer, kärnteknik (60.85) @sv
alternative label: Atomteknik (60.85) @sv
alternative label: Avfall, kärnavfall (60.85) @sv
alternative label: Fissionsreaktorer, kärnteknik (60.85) @sv
alternative label: Fissioreaktorit, ydintekniikka (60.85)
alternative label: Fusionsreaktorer, kärnteknik (60.85) @sv
alternative label: Fuusioreaktorit, ydintekniikka (60.85)
alternative label: Isotoopit, ydintekniikka (60.85)
alternative label: Isotooppitekniikka (60.85)
alternative label: Isotoper, kärnteknik (60.85) @sv
alternative label: Isotopteknik (60.85) @sv
alternative label: Jätteet, ydinjätteet (60.85)
alternative label: Katastrofer, kärnkraftsolyckor (60.85) @sv
alternative label: Katastrofit, ydinonnettomuudet (60.85)
alternative label: Kedjereaktion, kärnteknik (60.85) @sv
alternative label: Ketjureaktio, ydintekniikka (60.85)
alternative label: Kondensteknik, kärnkraftverk (60.85) @sv
alternative label: Kraftverk, kärnkraftverk (60.85) @sv
alternative label: Kärnavfall, hanteringsteknik (60.85) @sv
alternative label: Kärnenergi, användning (60.85) @sv
alternative label: Kärnenergi, energikällor (60.85) @sv
alternative label: Kärnenergi, energipolitik (60.85) @sv
alternative label: Kärnenergi, kärnkraftverk (60.85) @sv
alternative label: Kärnkraft, användning (60.85) @sv
alternative label: Kärnkraft, energikällor (60.85) @sv
alternative label: Kärnkraft, energipolitik (60.85) @sv
alternative label: Kärnkraft, kärnkraftverk (60.85) @sv
alternative label: Kärnkraftsolyckor (60.85) @sv
alternative label: Kärnkraftsolyckor, kraftverksteknik (60.85) @sv
alternative label: Kärnkraftverk (60.85) @sv
alternative label: Kärnreaktioner, kärnteknik (60.85) @sv
alternative label: Kärnsäkerhet (60.85) @sv
alternative label: Lauhdutustekniikka, ydinvoimalat (60.85)
alternative label: Ongelmajätteet, ydinjätteet (60.85)
alternative label: Onnettumuudet, ydinonnettomuudet (60.85)
alternative label: Radioaktiivisuus, ydintekniikka (60.85)
alternative label: Reaktoritekniikka (60.85)
alternative label: Säteily, ydintekniikka (60.85)
alternative label: Turvallisuusjärjestelyt, ydinvoima (60.85)
alternative label: Voimalat, ydinvoimalat (60.85)
alternative label: Ydinenergia, energialähteet (60.85)
alternative label: Ydinenergia, energiapolitiikka (60.85)
alternative label: Ydinenergia, käyttö (60.85)
alternative label: Ydinenergia, ydinvoimalat (60.85)
alternative label: Ydinjätteet, käsittelytekniikka (60.85)
alternative label: Ydinonnettomuudet (60.85)
alternative label: Ydinonnettomuudet, voimalatekniikka (60.85)
alternative label: Ydinreaktiot, ydintekniikka (60.85)
alternative label: Ydintekniikka (60.85)
alternative label: Ydinturvallisuus (60.85)
alternative label: Ydinvoima, energialähteet (60.85)
alternative label: Ydinvoima, energiapolitiikka (60.85)
alternative label: Ydinvoima, käyttö (60.85)
alternative label: Ydinvoima, ydinvoimalat (60.85)
alternative label: Ydinvoimalat (60.85)
broader: Energia
in scheme: YKL - Yleisten kirjastojen luokitusjärjestelmä
notation: 60.85
scope note: Hit allmänna verk om kärnenergi Fredlig användning av kärnkraft och radioaktiva isotoper Kärnenergi i energiproduktionen Kärnkraftverk. Fissionsreaktorer. Fusionsreaktorer Övervaknings-, skydds- och nedkylningssystem Hantering av kärnavfall. Säkerhetsarrangemang Kärnkraft och kärnteknik som energi- och samhällspolitisk fråga Användning av kärnteknik och radioaktiva isotoper inom olika områden klassificeras enligt område @sv
scope note: Tähän ydintekniikan yleisteokset Ydinvoiman ja radioaktiivisten isotooppien rauhanomainen hyväksikäyttö Ydinenergian käyttö energiantuotannossa Ydinvoimalat. Fissioreaktorit. Fuusioreaktorit Valvonta-, suojaus- ja jäähdytysjärjestelmät Ydinjätteiden käsittely. Turvallisuusjärjestelyt Ydinvoiman ja ydintekniikan hyväksikäyttö energia- ja yhteiskuntapoliittisena kysymyksenä Ydintekniikan ja radioaktiivisten isotooppien hyväksikäyttö eri aloilla luokitetaan alan mukaan

TIETOTEKNIIKKA. TIETOLIIKENNE. VIESTINTÄTEKNIIKKA. TEKOÄLY
type: Concept
References: Kirjastoautomaatio
References: Kommunikaatioteoria
References: Sosiaaliset järjestelmät
References: Kriminologia. Kriminaalisosiologia
References: Julkis- ja hallinto-oikeus
References: Tietotekniikan käyttö opetuksessa
References: Tietoliikenne. Viestintätekniikka. Multimedia
References: Toimistotyö. Toimistotekniikka
References: UUDET TAIDEMUODOT
References: Pelit. Leikit. Keräily
alternative label: Asiantuntijajärjestelmät, tietotekniikka (61+)
alternative label: Automaatio (61+)
alternative label: Automaatio, vaikutukset yhteiskuntaan (61)
alternative label: Automaatiojärjestelmät (61+)
alternative label: Automaattinen tietojenkäsittely (61+)
alternative label: Automatisointi (61+)
alternative label: CAD (61+)
alternative label: Digitaalinen kuva (61+)
alternative label: Digitaalinen tallennus (61+)
alternative label: Digitalisaatio (61+)
alternative label: Editointi, tietotekniikka (61+)
alternative label: Erilliskäsittely, tietotekniikka (61+)
alternative label: Grafiikka, tietokonegrafiikka (61+)
alternative label: Hahmontunnistus, tietotekniikka (61+)
alternative label: Hakkerointi, tietotekniikka (61+)
alternative label: Hermoverkkomallit, tietotekniikka (61+)
alternative label: ICT-ala (61+)
alternative label: IT-ala (61+)
alternative label: Informaatiosodankäynti, tietotekniikka ja tietoliikenne (61+)
alternative label: Kaupunkikortit (61+)
alternative label: Kognitiotiede, tietotekniikka (61+)
alternative label: Kompressio, tietotekniikka (61+)
alternative label: Konenäkö, tietotekniikka (61+)
alternative label: Koneoppiminen (61+)
alternative label: Konvertointi, tietotekniikka (61+)
alternative label: Kopiosuojaus, tietotekniikka (61+)
alternative label: Krakkerointi, tietotekniikka (61+)
alternative label: Kuvankäsittely, tietotekniikka (61+)
alternative label: Kuvantallennus, tietotekniikka (61+)
alternative label: Kuvantaminen, tietotekniikka (61+)
alternative label: Kyberavaruus (61+)
alternative label: Kyberteksti (61+)
alternative label: Kyberturvallisuus, tietotekniikka ja tietoliikenne (61+)
alternative label: Käyttöliittymät, tietotekniikka (61+)
alternative label: Lisätty todellisuus, yl. (61+)
alternative label: Loppukäyttäjät, tietotekniikka (61+)
alternative label: MP3, tiedostomuodot (61+)
alternative label: Maksujärjestelmät, tietotekniikka (61+)
alternative label: Mikrotuki (61+)
alternative label: Neuraalilaskenta, tietotekniikka (61+)
alternative label: Neuroverkot, tietotekniikka (61+)
alternative label: Operaattorit, tietotekniikka (61+)
alternative label: Optinen tallennus, tietotekniikka (61+)
alternative label: Puheentunnistus, tietotekniikka (61+)
alternative label: Puhesyntetisaattorit, tietotekniikka (61+)
alternative label: Puheteknologia, tietotekniikka (61+)
alternative label: Päätetyö, tietotekniikka (61+)
alternative label: Rajapinnat, tietotekniikka (61+)
alternative label: Rinnakkaiskäsittely, tietotekniikka (61+)
alternative label: Skannaus, tietotekniikka (61+)
alternative label: Sulautettu tietotekniikka (61+)
alternative label: Suorakäsittely, tietotekniikka (61+)
alternative label: Sähköinen kuva (61+)
alternative label: Tekoäly (61+)
alternative label: Tekoäly, etiikka (61+)
alternative label: Tekoäly, tietotekniikka (61+)
alternative label: Tekstintunnistus, tietotekniikka (61+)
alternative label: Teollinen muotoilu, aloittain (60 ... 64+)
alternative label: Tiedontallennus, tietotekniikka (61+)
broader: TEKNIIKKA. TEOLLISUUS. KÄSITYÖ. MAA- JA METSÄTALOUS KOTITALOUS. LIIKETALOUS. LIIKENNE
in scheme: YKL - Yleisten kirjastojen luokitusjärjestelmä
narrower: Systeemityö. Tiedonhallinta
narrower: Ohjelmointi. Ohjelmointikielet
narrower: Tietokoneet
narrower: Säätö- ja systeemitekniikka. Teollinen automaatio
narrower: Tietoliikenne. Viestintätekniikka. Multimedia
notation: 61
scope note: Hit och till underklasserna allmänna verk om datateknik, databehandlingslära, informationsarbete automation och artificiell intelligens. Grunderna i informationsteknik i allmänhet Kunskapsteknik, artificiell intelligens, virtuell verklighet, mönsteridentifiering och datorstödd konstruktion i allmänhet Datasekretess och dataskydd ur teknisk synpunkt Allmänna verk om hur informationsteknik, automation och artificiell intelligens inverkar på samhället Tillämpningar av informationsteknik, automation och artificiell intelligens på specialområden klassificeras enligt område @sv
scope note: Tähän ja alaluokkiin tietotekniikka, tietojenkäsittelyoppi, tietotyö, automaatio ja tekoäly yleensä. Tietotekniikan perusteet yleensä. Tietämystekniikka, tekoälytutkimus, virtuaalitodellisuus, hahmontunnistus ja tietokoneavusteinen suunnittelu yleensä. Tietoturva ja tietosuoja yleensä. Tietotekniikan, automaation ja tekoälyn vaikutukset yhteiskuntaan yleensä. Tietotekniikan, automaation ja tekoälyn sovellukset eri aloille luokitetaan alan mukaan

Systeemityö. Tiedonhallinta
type: Concept
modified: 2026-05-06T13:20:08
References: TIEDONHAKU. YLEISET TIETOTEOKSET
References: Ohjelmointi. Ohjelmointikielet
References: Tietokoneet
References: Säätö- ja systeemitekniikka. Teollinen automaatio
References: Verkkojulkaiseminen
alternative label: Anteckningar, informationshantering (61.2) @sv
alternative label: Big data, informationshantering (61.2) @sv
alternative label: Big data, tiedonhallinta (61.2)
alternative label: Dataarkiv, systemarbete (61.2) @sv
alternative label: Databanker, systemarbete (61.2) @sv
alternative label: Databaser, systemarbete (61.2) @sv
alternative label: Databasprogram (61.2) @sv
alternative label: Databehandlingssystem, program (61.2) @sv
alternative label: Databehandlingssystem, systemarbete (61.2) @sv
alternative label: Datahanteringssystem, systemarbete (61.2) @sv
alternative label: Datalager, systemarbete (61.2) @sv
alternative label: Datalagringssystem, systemarbete (61.2) @sv
alternative label: Datapolicy, informationshantering (61.2) @sv
alternative label: Datapolitiikka, tiedonhallinta (61.2)
alternative label: Dataregister, systemarbete (61.2) @sv
alternative label: Dokumentation, systemarbete (61.2) @sv
alternative label: Dokumentointi, systeemityö (61.2)
alternative label: Faktadatabaser, systemarbete (61.2) @sv
alternative label: Faktatietokannat, systeemityö (61.2)
alternative label: Fulltextdatabaser, systemarbete (61.2) @sv
alternative label: Hierarkiska databehandlingssystem, systemarbete (61.2) @sv
alternative label: Hierarkkiset tietojärjestelmät, systeemityö (61.2)
alternative label: Informationshantering, informationsteknik (61.2)
alternative label: Informationssökningssystem, systemarbete (61.2) @sv
alternative label: Innehållsbesittning, systemarbete (61.2) @sv
alternative label: Integrerade datasystem, systemarbete (61.2) @sv
alternative label: Integroidut tietojärjestelmät, systeemityö (61.2)
alternative label: Järjestelmäkaaviot, systeemityö (61.2)
alternative label: Kunskapsdatabaser, systemarbete (61.2) @sv
alternative label: Modulaariset tietojärjestelmät, systeemityö (61.2)
alternative label: Modulära datasystem, systemarbete (61.2) @sv
alternative label: Muistiinpanot, tiedonhallinta (61.2)
alternative label: Numeeriset tietokannat, systeemityö (61.2)
alternative label: Numeriska databaser, systemarbete (61.2) @sv
alternative label: Ohjelmistokehitys (61.2)
alternative label: Ohjelmistonsuunnittelu, tietotekniikka (61.2)
alternative label: Operaatioanalyysi, systeemityö (61.2)
alternative label: Operationsanalys, systemarbete (61.2) @sv
alternative label: Programplanering, adb (61.2) @sv
alternative label: Programutveckling (61.2) @sv
alternative label: Referensdatabaser, systemarbete (61.2) @sv
alternative label: Register, systemarbete (61.2) @sv
alternative label: Relaatiotietokannat, systeemityö (61.2)
alternative label: Relationsdatabaser, systemarbete (61.2) @sv
alternative label: SQL, kyselykieli ja tietokantaohjelma (61.2)
alternative label: SQL, sökspråk och databasprogram (61.2) @sv
alternative label: Sisällönhallinta, systeemityö (61.2)
alternative label: Systeeminsuunnittelu, tietotekniikka (61.2)
alternative label: Systeemisuunnittelu, tietotekniikka (61.2)
alternative label: Systeemityö, tietotekniikka (61.2)
alternative label: Systemarbete, informationsteknik (61.2) @sv
alternative label: Systemplanering, informationsteknik (61.2) @sv
alternative label: Tekstitietokannat, systeemityö (61.2)
alternative label: Tiedonhakujärjestelmät, systeemityö (61.2)
alternative label: Tiedonhallinta, tietotekniikka (61.2)
alternative label: Tiedonhallintajärjestelmät, systeemityö (61.2)
alternative label: Tiedontallennusjärjestelmät, systeemityö (61.2)
alternative label: Tiedostot, systeemityö (61.2)
alternative label: Tietoarkistot, systeemityö (61.2)
alternative label: Tietojärjestelmät, ohjelmistot (61.2)
alternative label: Tietojärjestelmät, systeemityö (61.2)
alternative label: Tietokannat, systeemityö (61.2)
alternative label: Tietokantaohjelmat (61.2)
alternative label: Tietopankit, systeemityö (61.2)
alternative label: Tietorekisterit, systeemityö (61.2)
alternative label: Tietovarastot, systeemityö (61.2)
alternative label: Tietämystietokannat, systeemityö (61.2)
alternative label: Viitetietokannat, systeemityö (61.2)
broader: TIETOTEKNIIKKA. TIETOLIIKENNE. VIESTINTÄTEKNIIKKA. TEKOÄLY
in scheme: YKL - Yleisten kirjastojen luokitusjärjestelmä
notation: 61.2
scope note: Hit allmänna verk om systemarbete och systemplanering Planering, konstruktion och underhåll av datasystem, program, register, databaser och söksystem i allmänhet Data- och informationshantering i allmänhet. Databasprogram Organisation, fasindelning och dokumentation av systemarbete i allmänhet Integrerade, hierarkiska och modulära databehandlingssystem samt planering, konstruktion och underhåll av dem i allmänhet Systemscheman och utarbetandet av dem i allmänhet Om verket innehåller både systemarbete och programmering ges företräde åt klass 61.2 Databehandlingssystem, register och databaser inom specialområden samt planering, konstruktion och underhåll av dem klassificeras enligt område @sv
scope note: Tähän systeemityön ja systeeminsuunnittelun yleisteokset Tietojärjestelmien, ohjelmistojen, tiedostojen, tietokantojen ja tiedonhakujärjestelmien suunnittelu, rakentaminen ja ylläpito yleensä Tiedonhallinta yleensä. Tietokantaohjelmat Systeemityön organisointi, vaiheistus ja dokumentointi yleensä Integroidut, hierarkkiset ja modulaariset tietojärjestelmät sekä niiden suunnittelu, toteutus ja ylläpito yleensä Järjestelmäkaaviot ja niiden laadinta yleensä Jos teoksessa on sekä systeemityötä että ohjelmointia, annetaan etusija luokalle 61.2 Erikoisalojen tietojärjestelmät, tiedostot ja tietokannat sekä niiden suunnittelu, rakentaminen ja ylläpito luokitetaan alan mukaan

Ohjelmointi. Ohjelmointikielet
type: Concept
References: TILASTOTIEDE
References: Erityiset laskentamenetelmät
References: TIETOTEKNIIKKA. TIETOLIIKENNE. VIESTINTÄTEKNIIKKA. TEKOÄLY
References: Systeemityö. Tiedonhallinta
References: Tietokoneet
References: Tietoliikenne. Viestintätekniikka. Multimedia
References: Konekirjoitus. Tekstinkäsittely. Pikakirjoitus
alternative label: Agentprogram, allm. (61.3) @sv
alternative label: Agenttiohjelmat, yl. (61.3)
alternative label: Algoritmer, programmering (61.3) @sv
alternative label: Algoritmiikka, ohjelmointi (61.3)
alternative label: Algoritmik, programmering (61.3) @sv
alternative label: Algoritmit, ohjelmointi (61.3)
alternative label: Antivirusohjelmat (61.3)
alternative label: Antivirusprogram (61.3) @sv
alternative label: Applikationsgeneratorer (61.3) @sv
alternative label: Asiakasohjelmat (61.3)
alternative label: Avoin lähdekoodi (61.3)
alternative label: Bildbehandling, grafikprogram (61.3) @sv
alternative label: Datalingvistik, informationsteknik (61.3) @sv
alternative label: Dataprogram (61.3) @sv
alternative label: Dataprogrammering (61.3) @sv
alternative label: Dataspråk (61.3) @sv
alternative label: Datavirus, programmering (61.3) @sv
alternative label: Flödesscheman, programmering (61.3) @sv
alternative label: Fortran, ohjelmointikielet (61.3)
alternative label: Fortran, programmeringsspråk (61.3) @sv
alternative label: Freeware (61.3)
alternative label: Fri datorprogram (61.3) @sv
alternative label: Fri kod, informationsteknik (61.3) @sv
alternative label: Fri källkod (61.3) @sv
alternative label: Geneettiset algoritmit, ohjelmointi (61.3)
alternative label: Genetiska algoritmer, programmering (61.3) @sv
alternative label: Grafiikkaohjelmat (61.3)
alternative label: Grafikprogram (61.3) @sv
alternative label: Gratisprogram (61.3) @sv
alternative label: Gruppvara (61.3) @sv
alternative label: Haittaohjelmat, ohjelmointi (61.3)
alternative label: Högnivåspråk, programmeringsspråk (61.3) @sv
alternative label: Ilmaiset tietokoneohjelmat (61.3)
alternative label: Kieliteknologia, ohjelmointi (61.3)
alternative label: Klientprogram (61.3) @sv
alternative label: Kodning, programmering (61.3) @sv
alternative label: Konekielet, ohjelmointikielet (61.3)
alternative label: Koodaus, ohjelmointi (61.3)
alternative label: Kuvankäsittely, grafiikkaohjelmat (61.3)
alternative label: Kyselykielet (61.3)
alternative label: Lausekielet, ohjelmointikielet (61.3)
alternative label: Lähdekoodit (61.3)
alternative label: Metakielet, ohjelmointikielet (61.3)
alternative label: Ohjelmat, tietotekniikka (61.3)
alternative label: Ohjelmistotekniikka (61.3)
alternative label: Ohjelmistoteollisuus (61.3)
alternative label: Ohjelmointi, tietotekniikka (61.3)
alternative label: Ohjelmointikielet (61.3)
alternative label: Ohjelmointiympäristöt (61.3)
alternative label: Oliokeskeinen ohjelmointi (61.3)
alternative label: Open source, avoin lähdekoodi (61.3)
alternative label: Piirto-ohjelmat (61.3)
alternative label: Sovelluskehittimet (61.3)
alternative label: Sovellusohjelmat (61.3)
alternative label: Tietokonekielet (61.3)
alternative label: Tietokonelingvistiikka, tietotekniikka (61.3)
alternative label: Tietokoneohjelmat (61.3)
alternative label: Tietokoneohjelmointi (61.3)
alternative label: Tietokonevirukset, ohjelmointi (61.3)
alternative label: Työryhmäohjelmistot (61.3)
alternative label: Vapaa koodi, tietotekniikka (61.3)
alternative label: Vapaa lähdekoodi, tietotekniikka (61.3)
alternative label: Vapaat ohjelmistot, tietotekniikka (61.3)
alternative label: Varusohjelmat (61.3)
alternative label: Virusohjelmat (61.3)
alternative label: Virustentorjuntaohjelmat (61.3)
alternative label: Vuokaaviot, ohjelmointi (61.3)
broader: TIETOTEKNIIKKA. TIETOLIIKENNE. VIESTINTÄTEKNIIKKA. TEKOÄLY
in scheme: YKL - Yleisten kirjastojen luokitusjärjestelmä
notation: 61.3
scope note: Hit allmänna verk om programmering och grunderna för programmering samt läromedel för programmering Hit också allmänna verk om dataprogram. Grafikprogram i allmänhet Dataprogram och programpaket som inte kan klassificeras enligt område Flödesplaner i allmänhet. Testning och underhåll av program i allmänhet Objektorientering och objektorienterad programmering i allmänhet Hit också antivirusprogram och bekämpning av virus Hit också allmänna verk om programmeringsspråk Maskinspråk i allmänhet. Högnivåspråk i allmänhet Om verket innehåller både programmering och systemarbete ges företräde åt klass 61.2 Dataprogram för specialområden samt användning av dataprogram och programmeringsspråk på specialområden klassificeras enligt område @sv
scope note: Tähän ohjelmoinnin yleisteokset sekä ohjelmoinnin perusteet ja ohjelmoinnin opiskelu Tähän myös tietokoneohjelmia koskevat yleisteokset. Grafiikkaohjelmat yleensä Tietokoneohjelmat ja ohjelmistopaketit, joita ei voi sijoittaa alan mukaiseen luokkaan Vuokaaviot yleensä. Ohjelmien testaus ja ylläpito yleensä Oliokeskeisyys ja olio-ohjelmointi yleensä Tähän myös virusohjelmat sekä virusten torjunta Tähän myös ohjelmointikieliä koskevat yleisteokset Kone- ja lausekielet yleensä Jos teoksessa on sekä ohjelmointia että systeeminsuunnittelua, annetaan etusija luokalle 61.2 Erikoisalojen tietokoneohjelmat sekä tietokoneohjelmien ja ohjelmointikielten käyttö erikoisalojen sovelluksiin luokitetaan alan mukaan

Tietokoneet
type: Concept
References: Ohjelmointi. Ohjelmointikielet
References: Säätö- ja systeemitekniikka. Teollinen automaatio
References: Tietoliikenne. Viestintätekniikka. Multimedia
References: Internet. Intranet. Ekstranet
References: Matkaviestinpalvelut. Puhelinliikenne
References: Elektroniikka
References: Toimistotyö. Toimistotekniikka
References: Pelit. Leikit. Keräily
alternative label: Ajurit, atk (61.4+)
alternative label: Analoga maskiner, datorer (61.4) @sv
alternative label: Analogiakoneet, tietokoneet (61.4)
alternative label: Arbetsstationer, datorer och kringutrustning, alm. (61.4+) @sv
alternative label: Bärbara datorer (61.4) @sv
alternative label: Centralenheter, datorer (61.4) @sv
alternative label: DOS, käyttöjärjestelmät (61.4)
alternative label: Digitaalikoneet, tietokoneet (61.4)
alternative label: Eräkäyttö, tietokoneet (61.4)
alternative label: Etäkäyttö (61.4)
alternative label: Hybridikoneet, tietokoneet (61.4)
alternative label: Itsenäiskäyttö, tietokoneet (61.4)
alternative label: Kannettavat tietokoneet (61.4)
alternative label: Keskusmuistit, tietokoneet (61.4)
alternative label: Keskusyksiköt, tietokoneet (61.4)
alternative label: Kiintolevyt (61.4)
alternative label: Kodintekniikka, tietokoneet ja lisälaitteet (61.4+)
alternative label: Konttorikoneteollisuus, tietokoneet ja lisälaitteet (61.4+)
alternative label: Kotimikrot (61.4)
alternative label: Kämmentietokoneet (61.4)
alternative label: Käyttöjärjestelmät, tietokoneet (61.4)
alternative label: Lehtiötietokoneet (61.4)
alternative label: Linux, käyttöjärjestelmät (61.4)
alternative label: MS-DOS, käyttöjärjestelmät (61.4)
alternative label: Mac OS X, käyttöjärjestelmät (61.4)
alternative label: Mikroprosessorit, atk (61.4)
alternative label: Mikrotietokoneet (61.4)
alternative label: Mikrotietokoneteollisuus (61.4)
alternative label: NetWare, käyttöjärjestelmät (61.4)
alternative label: Nettilaudat (61.4)
alternative label: Neurotietokoneet (61.4)
alternative label: Näytönohjaimet, atk (61.4+)
alternative label: OS/2, käyttöjärjestelmät (61.4)
alternative label: Ohjaimet, atk (61.4+)
alternative label: Osituskäyttö, tietokoneet (61.4)
alternative label: PDA, taskutietokoneet (61.4)
alternative label: Palm OS, käyttöjärjestelmät (61.4)
alternative label: Palvelimet, atk (61.4)
alternative label: Paneelitietokoneet (61.4)
alternative label: Pientietokoneet (61.4)
alternative label: Pocket PC (61.4)
alternative label: Prosessorit, tietokoneet (61.4)
alternative label: Pädit (61.4)
alternative label: Salkkumikrot (61.4)
alternative label: Sormitietokoneet (61.4)
alternative label: Suorakäyttö, tietokoneet (61.4)
alternative label: Suurtietokoneet (61.4)
alternative label: Sylimikrot (61.4)
alternative label: Tabletit, tietokoneet (61.4)
alternative label: Tablettitietokoneet (61.4)
alternative label: Taskutietokoneet (61.4)
alternative label: Taulutietokoneet (61.4)
alternative label: Tietojärjestelmät, laitteistot (61.4)
alternative label: Tietokone-elektroniikka (61.4+)
alternative label: Tietokoneet (61.4)
alternative label: Tietokonemallit (61.4)
alternative label: Tietokonetekniikka (61.4)
alternative label: Tietokoneteollisuus (61.4)
alternative label: Tietokonetyypit (61.4)
alternative label: Työasemat, tietokoneet ja lisälaitteet (61.4+)
alternative label: UNIX, käyttöjärjestelmät (61.4)
alternative label: Windows, käyttöjärjestelmät (61.4)
alternative label: iPad (61.4)
alternative label: kvanttitietokoneet yl. (61.4)
alternative label: Älykellot (61.4)
broader: TIETOTEKNIIKKA. TIETOLIIKENNE. VIESTINTÄTEKNIIKKA. TEKOÄLY
in scheme: YKL - Yleisten kirjastojen luokitusjärjestelmä
narrower: Tietokoneiden lisälaitteet
notation: 61.4
scope note: Datorer och användning av datorer i allmänhet Elektronik och teknik i datorer. Datortyper. Datorindustri Persondatorer. Neurondatorer. Bärbara datorer. Fickdatorer. Handdatorer. Pekdatorer Konstruktion av datorer. Datorns sammansättning. Datorinstallation Centralenhet. Centralminne. Processor. Operativsystem Olika sätt att använda datorn. Datorns kapacitet. Direkt anslutning. Satsvis bearbetning. Tidsdelning. Fjärranvändning Hit också allmänna verk om datasystemens maskinvara som behandlar både datorer och deras tilläggsutrustning Användning av datorer inom datatillämpningar på specialområden klassificeras enligt område @sv
scope note: Tähän tietokoneet ja tietokoneiden käyttö yleensä Tietokoneiden elektroniikka ja tekniikka. Tietokonetyypit. Tietokoneteollisuus Mikrotietokoneet. Neurotietokoneet. Kannettavat tietokoneet. Taskutietokoneet. Kämmentietokoneet. Taulutietokoneet Tietokoneen suunnittelu, rakenne ja osat. Tietokoneen asennus Keskusyksikkö. Keskusmuisti. Prosessori. Käyttöjärjestelmät Tietokoneen käyttötavat ja suorituskyky. Suorakäyttö. Eräkäyttö. Osituskäyttö. Etäkäyttö Tähän myös yleisteokset tietojärjestelmien laitteistoista, jotka sisältävät sekä tietokoneita että niiden lisälaitteita Tietokoneiden käyttö erikoisalojen atk-sovelluksissa luokitetaan alan mukaan

Tietokoneiden lisälaitteet
type: Concept
References: Matkaviestinpalvelut. Puhelinliikenne
References: Audiovisuaalinen tekniikka
References: Äänitekniikka. Radiotekniikka
References: Kuvantoistotekniikka. Televisiotekniikka
References: Elektroniikka
References: Hienomekaaninen teollisuus
References: Toimistotyö. Toimistotekniikka
alternative label: Arbetsminnen (61.44) @sv
alternative label: CD-ROM-asemat (61.44)
alternative label: CD-ROM-spelare (61.44) @sv
alternative label: DVD-ROM-asemat (61.44)
alternative label: DVD-ROM-spelare (61.44) @sv
alternative label: Dataterminaler (61.44) @sv
alternative label: Datautrustning (61.44) @sv
alternative label: Datorterminaler (61.44) @sv
alternative label: Elektroluminiscensskärmar (61.44) @sv
alternative label: Elektroluminisenssinäytöt (61.44)
alternative label: Expansionskort (61.44) @sv
alternative label: Flatskärmar (61.44) @sv
alternative label: Flytkristallskärmar (61.44) @sv
alternative label: Grafiikkatulostus (61.44)
alternative label: Grafikutskrift (61.44) @sv
alternative label: Hålkortsmaskiner (61.44) @sv
alternative label: Kirjoittimet (61.44)
alternative label: Kombiapparater, informationsteknik (61.44) @sv
alternative label: Kosketusnäyttö (61.44)
alternative label: Kurvritare, informationsteknik (61.44) @sv
alternative label: Käyttömuistit (61.44)
alternative label: Laajennuskortit (61.44)
alternative label: Laserkirjoittimet (61.44)
alternative label: Laserprinter (61.44) @sv
alternative label: Laserskrivare (61.44) @sv
alternative label: Lasertulostimet (61.44)
alternative label: Levyasemat (61.44)
alternative label: Levymuistit (61.44)
alternative label: Litteät näytöt (61.44)
alternative label: Ljudkort, informationsteknik (61.44) @sv
alternative label: Lukumuistit (61.44)
alternative label: Läsminnen (61.44) @sv
alternative label: Magneettilevyasemat (61.44)
alternative label: Magneettinauha-asemat (61.44)
alternative label: Magnetbandenheter (61.44) @sv
alternative label: Magnetskivstationer (61.44) @sv
alternative label: Matare, informationsteknik (61.44) @sv
alternative label: Memory stick (61.44) @sv
alternative label: Minnen, informationsteknik (61.44) @sv
alternative label: Minneskort (61.44) @sv
alternative label: Monitoimilaitteet, tietotekniikka (61.44)
alternative label: Monitorer, kringutrustning för datorer (61.44) @sv
alternative label: Monitorit, tietokoneiden lisälaitteet (61.44)
alternative label: Muistikortit (61.44)
alternative label: Muistit, tietotekniikka (61.44)
alternative label: Muistitikut (61.44)
alternative label: Nestekidenäytöt (61.44)
alternative label: Näppäimistöt, tietotekniikka (61.44)
alternative label: Näyttölaitteet (61.44)
alternative label: Oheislaitteet, tietotekniikka (61.44)
alternative label: Optiset lukijat, tietotekniikka (61.44)
alternative label: Optiska läsare, informationsteknik (61.44) @sv
alternative label: Pekskärm (61.44) @sv
alternative label: Periferenheter, informationsteknik (61.44) @sv
alternative label: Piirturit, tietotekniikka (61.44)
alternative label: Plasmanäytöt (61.44)
alternative label: Plasmaskärmar (61.44) @sv
alternative label: Projektorit, tietokoneiden lisälaitteet (61.44)
alternative label: Reikäkorttikoneet (61.44)
alternative label: Skannerit (61.44)
alternative label: Syöttölaitteet, tietotekniikka (61.44)
alternative label: Tietokonepäätteet (61.44)
alternative label: Tulostaminen, tulostimet (61.44)
alternative label: Tulostimet (61.44)
alternative label: Tulostus, tulostimet (61.44)
alternative label: USB-muistit (61.44)
alternative label: Äänikortit, tietotekniikka (61.44)
broader: Tietokoneet
in scheme: YKL - Yleisten kirjastojen luokitusjärjestelmä
notation: 61.44
scope note: Hit kringutrustning för datorer samt elektronik och teknik i den och industriell framställning av den Utrustning för inmatning, registrering och utskrift. Minnen Terminaler. Bildskärmar. Pekskärm. Flatskärmar. Tangentbord. Möss. Läsapparater Skrivare. Kurvritare. Skivstationer för CD- och DVD-skivor, disketter och magnetband Skrivare för text, grafik och mikrokort Användning av kringutrustning inom datatillämpningar på specialområden klassificeras enligt område @sv
scope note: Tähän tietokoneiden lisälaitteet sekä niiden elektroniikka, tekniikka ja teollinen valmistus Syöttö-, tallennus-, tulostus- ja muistilaitteet Päätteet. Näyttölaitteet. Kosketusnäytöt. Litteät näytöt. Näppäimistöt. Hiiret. Lukulaitteet Kirjoittimet. Piirturit. CD-, DVD-, levyke- ja nauha-asemat Tekstin, grafiikan ja mikrotallenteiden tulostuslaitteet Lisälaitteiden käyttö erikoisalojen sovelluksissa luokitetaan alan mukaan

Säätö- ja systeemitekniikka. Teollinen automaatio
type: Concept
References: Konetekniikka. Voitelutekniikka
References: Sähkötekniikka
References: Elektroniikka
alternative label: 3D-tulostus, yl. (61.6)
alternative label: Anturit, säätötekniikka (61.6)
alternative label: Automaatio, konetekninen (61.6)
alternative label: Automaatio, robotit (61.6)
alternative label: Automaatio, teollinen (61.6)
alternative label: Automaatit (61.6)
alternative label: Automater (61.6) @sv
alternative label: Automation, industriell (61.6) @sv
alternative label: Automation, maskinteknisk (61.6) @sv
alternative label: Automation, robotar (61.6) @sv
alternative label: CIM, datorintegrerad tillverkning (61.6) @sv
alternative label: CIM, tietokoneintegroitu tuotanto (61.6)
alternative label: Datorstödd tillverkning (61.6) @sv
alternative label: Drivdon, reglerteknik (61.6) @sv
alternative label: Esinetulostus (61.6)
alternative label: Fabbaus (61.6)
alternative label: Fjärreglering, regler- och systemteknik (61.6) @sv
alternative label: Fjärrstyrning, regler- och systemteknik (61.6) @sv
alternative label: Flexibel automation (61.6) @sv
alternative label: Friformsframställning (61.6) @sv
alternative label: Förstärkare, reglerteknik (61.6) @sv
alternative label: Givare, reglerteknik (61.6) @sv
alternative label: Industriautomation (61.6) @sv
alternative label: Industriell automation (61.6) @sv
alternative label: Industriella processer, kontroll (61.6) @sv
alternative label: Instrumentering (61.6) @sv
alternative label: Instrumentointi (61.6)
alternative label: Joustava automaatio (61.6)
alternative label: Kappaletulostus (61.6)
alternative label: Kauko-ohjaus, säätö- ja systeemitekniikka (61.6)
alternative label: Kaukosäätö, säätö- ja systeemitekniikka (61.6)
alternative label: Kolmiulotteinen tulostus (61.6)
alternative label: Kurvritare, regler- och systemteknik (61.6) @sv
alternative label: Materiaalitulostus (61.6)
alternative label: Mekatroniikka (61.6)
alternative label: Mekatronik (61.6) @sv
alternative label: Mittaustekniikka (61.6)
alternative label: Monitorer, regler- och systemteknik (61.6) @sv
alternative label: Monitorit, säätö- ja systeemitekniikka (61.6)
alternative label: Mätningsteknik (61.6) @sv
alternative label: Optiset anturit (61.6)
alternative label: Optiska givare (61.6) @sv
alternative label: Piirturit, säätö- ja systeemitekniikka (61.6)
alternative label: Pikavalmistus (61.6)
alternative label: Processanalys (61.6) @sv
alternative label: Processteknisk automation (61.6) @sv
alternative label: Processtyrning (61.6) @sv
alternative label: Produktionsprocesser, kontroll (61.6) @sv
alternative label: Prosessianalyysi (61.6)
alternative label: Prosessinohjaus (61.6)
alternative label: Prosessitekninen automaatio (61.6)
alternative label: Reglersystem (61.6) @sv
alternative label: Reglerteknik (61.6) @sv
alternative label: Releet, säätötekniikka (61.6)
alternative label: Robotiikka (61.6)
alternative label: Robotit (61.6)
alternative label: Robottitekniikka (61.6)
alternative label: Servokojeet (61.6)
alternative label: Servotekniikka (61.6)
alternative label: Simulointi (61.6)
alternative label: Simulointitekniikka (61.6)
alternative label: Systeemitekniikka (61.6)
alternative label: Säätöjärjestelmät (61.6)
alternative label: Säätötekniikka (61.6)
alternative label: Teollinen automaatio (61.6)
alternative label: Teolliset prosessit, valvonta (61.6)
alternative label: Teollisuusautomaatio (61.6)
alternative label: Tietokoneavusteinen valmistus (61.6)
alternative label: Toimilaitteet, säätötekniikka (61.6)
alternative label: Tuotantoprosessit, valvonta (61.6)
alternative label: Vahvistimet, säätötekniikka (61.6)
broader: TIETOTEKNIIKKA. TIETOLIIKENNE. VIESTINTÄTEKNIIKKA. TEKOÄLY
in scheme: YKL - Yleisten kirjastojen luokitusjärjestelmä
notation: 61.6
scope note: Hit allmänna verk om regler- och systemteknik samt allmänna verk om industriell, processteknisk och maskinteknisk automation Instrumentering och mätteknik i allmänhet Reglersystem och deras delar i allmänhet Servoteknik och servoanordningar i allmänhet. Simuleringsteknik i allmänhet Förstärkare, reläer, givare och motsvarande utrustning ur den allmänna reglerteknikens synpunkt Övervakning och reglering av industriella processer och produktionsprocesser i allmänhet Robotar och robotteknik i allmänhet Användning av datorer inom processteknik i allmänhet Tillämpningar av regler- och processteknisk samt industriell, processteknisk och maskinteknisk automation inom specialområden klassificeras enligt område @sv
scope note: Tähän säätö- ja systeemitekniikan sekä teollisen, prosessiteknisen ja koneteknisen automaation yleisteokset Instrumentointi ja mittaustekniikka yleensä Säätöjärjestelmät ja niiden osat yleensä Servotekniikka ja servokojeet yleensä. Simulointitekniikka yleensä Vahvistimet, releet, anturit ja toimilaitteet yleisen säätötekniikan kannalta Teollisten ja tuotannollisten prosessien valvonta ja säätö yleensä Robotit ja robottitekniikka yleensä Tietokoneen käyttö prosessitekniikassa yleensä Säätö- ja systeemitekniikan sekä teollisen, prosessiteknisen ja koneteknisen automaation sovellukset eri aloille luokitetaan alan mukaan

Tietoliikenne. Viestintätekniikka. Multimedia
type: Concept
References: VIESTINTÄ. JOUKKOVIESTINTÄ
References: Lehdistöoppi
References: Radiotoiminta
References: Televisiotoiminta
References: Sosiaaliset järjestelmät
References: Julkis- ja hallinto-oikeus
References: Elektroniikka
References: Toimistotyö. Toimistotekniikka
References: Posti
alternative label: 4G-tekniikka (61.7+)
alternative label: 5G-tekniikka (61.7+)
alternative label: ADSL, tiedonsiirto, yl. (61.7+)
alternative label: ATM-tietoliikennetekniikka (61.7+)
alternative label: Alueverkot (61.7+)
alternative label: Antennijärjestelmät (61.7+)
alternative label: Antennit (61.7+)
alternative label: Bluetooth (61.7+)
alternative label: Dataliikenne (61.7+)
alternative label: Datansiirtotekniikka (61.7+)
alternative label: Datasähkö (61.7+)
alternative label: Digitaaliset tallenteet, tekniikka (61.7+)
alternative label: Elektroninen tiedonsiirto (61.7+)
alternative label: Ethernet, lähiverkko (61.7+)
alternative label: FTP, tiedonsiirto (61.7+)
alternative label: Faksi (61.7)
alternative label: Funet, tietoverkko (61.7+)
alternative label: Hakkerointi, tietoliikenne (61.7+)
alternative label: Heikkovirtatekniikka (61.7+)
alternative label: Huojunta, tietoliikennetekniikka (61.7+)
alternative label: Hypermedia (61.7+)
alternative label: Hyperteksti (61.7+)
alternative label: ISDN, monipalveluverkko (61.7+)
alternative label: Infrapunasiirto (61.7+)
alternative label: Kaapelit, tietoliikennetekniikka (61.7+)
alternative label: Kaapeliverkot, tietoliikennetekniikka (61.7+)
alternative label: Kaapeliviestintä, tietoliikennetekniikka (61.7+)
alternative label: Kansalaisen tietoverkot (61.7+)
alternative label: Kauko-ohjaus, tietoliikennetekniikka (61.7+)
alternative label: Kaukokirjoittimet (61.7)
alternative label: Kaukosäätö, tietoliikennetekniikka (61.7+)
alternative label: Kohina, tietoliikennetekniikka (61.7+)
alternative label: Krakkerointi, tietoliikenne (61.7+)
alternative label: Kuvansiirtotekniikka, tietoliikenne (61.7+)
alternative label: LAN, lähiverkko (61.7+)
alternative label: Laajakaistatekniikka (61.7+)
alternative label: Laajakaistaverkot (61.7+)
alternative label: Langaton tekniikka (61.7+)
alternative label: Langaton tiedonsiirto (61.7+)
alternative label: Langaton viestintä (61.7+)
alternative label: Lennätin (61.7)
alternative label: Lennätinlaitokset (61.7)
alternative label: Lennätinliikenne (61.7)
alternative label: Lennätintekniikka (61.7)
alternative label: Liittymät, tietoliikenne (61.7+)
alternative label: Loppukäyttäjät, tietoliikenne (61.7+)
alternative label: Lähettimet, tietoliikennetekniikka (61.7+)
alternative label: Lähiverkot, (61.7+)
alternative label: Mediakulttuuri, tietoliikenne (61.7+)
alternative label: Modeemit (61.7+)
alternative label: Monipalveluverkot (61.7+)
alternative label: Multimedia (61.7+)
alternative label: Multimedia, tekniikka (61.7+)
alternative label: Operaattorit, tietoliikenne (61.7+)
alternative label: Paikallisverkot, (61.7+)
alternative label: Palomuurit, tietoturva (61.7+)
alternative label: Pilvipalvelut, yl. (61.7)
alternative label: Protokollat, tietoliikennetekniikka (61.7+)
alternative label: Pääsynvalvonta, tietoliikenne (61.7+)
alternative label: Reitittimet, tietoliikennetekniikka (61.7+)
alternative label: Salaus, tietoliikenne (61.7+)
alternative label: Satelliitit, tietoliikenne (61.7+)
broader: TIETOTEKNIIKKA. TIETOLIIKENNE. VIESTINTÄTEKNIIKKA. TEKOÄLY
in scheme: YKL - Yleisten kirjastojen luokitusjärjestelmä
narrower: Internet. Intranet. Ekstranet
narrower: Matkaviestinpalvelut. Puhelinliikenne
narrower: Audiovisuaalinen tekniikka
notation: 61.7
scope note: Datakommunikation i allmänhet. Kommunikations- och telekommunikationsteknik i allmänhet Hit och till underklasserna allmänna verk om multimedia, hypermedia och hypertext Hit och till underklasserna allmänna verk om datanät, telekommunikationsnät, nättjänster och nätkommunikation samt teknik i dem Hit och till underklasserna allmänna verk om analog och digital data-, text-, bild- och ljudöverföringsteknik Hit och till underklasserna allmänna verk om kommunikationsprogram och länkprotokoll Hit och till underklasserna allmänna verk om sändar-, överförings- och mottagaranordningar samt industri som tillverkar dem Hit och till underklasserna allmänna verk om modem-, bredbands- och trådlös teknik samt allmänna verk om kablar, modem, antenner och telekommunikationssatelliter Datakommunikation samt kommunikations- och telekommunikationsteknik inom specialområden klassificeras enligt område Om verket behandlar både data- och masskommunikation ges företräde åt klassen 07+ @sv
scope note: Tietoliikenne yleensä. Tietoliikenne- ja viestintätekniikka yleensä Tähän ja alaluokkiin multimedia, hypermedia ja hyperteksti yleensä Tähän ja alaluokkiin tietoverkot, tietoliikenneverkot, verkkopalvelut ja verkkoviestintä sekä niiden tekniikka yleensä Tähän ja alaluokkiin analogisen ja digitaalisen tiedon-, tekstin-, kuvan- ja äänensiirron tekniikka yleensä Tähän ja alaluokkiin tietoliikenneohjelmat ja tietoliikenneprotokollat yleensä Tähän ja alaluokkiin tietoliikenteen lähetys-, siirto- ja vastaanottolaitteet sekä niiden tekniikka ja teollinen valmistus yleensä Tähän ja alaluokkiin modeemi-, laajakaista- ja langaton tekniikka sekä kaapeleiden, modeemien, antennien ja tietoliikennesatelliittien tekniikka yleensä Erikoisaloihin liittyvä tietoliikenne sekä viestintä- ja tietoliikennetekniikka luokitetaan alan mukaan Jos teos koskee sekä tietoliikennettä että joukkoviestintää, annetaan etusija luokalle 07+

Internet. Intranet. Ekstranet
type: Concept
References: Tietotekniikan käyttö opetuksessa
References: Verkkojulkaiseminen
References: Matkaviestinpalvelut. Puhelinliikenne
References: Liiketalous
References: Markkinointi. Kauppa
alternative label: Anonyymiverkot (61.72)
alternative label: Asioiden Internet (61.72+)
alternative label: Avoin verkkojulkaiseminen (61.72+)
alternative label: Blogit, Internet (61.72+)
alternative label: CGI, standardi ja rajapinta (61.72+)
alternative label: Cookiet (61.72+)
alternative label: E-kirjat, Internet (61.72+)
alternative label: E-lehdet, Internet (61.72+)
alternative label: Ekstranet (61.72+)
alternative label: Elektroniset julkaisut, Internet (61.72+)
alternative label: Esineiden Internet (61.72+)
alternative label: Esineiden ja asioiden Internet (61.72+)
alternative label: Evästeet, atk (61.72+)
alternative label: Hakukoneet, Internet (61.72)
alternative label: Hakuohjelmat, Internet (61.72)
alternative label: Hakupalvelut, Internet (61.72)
alternative label: Hakurobotit, Internet (61.72)
alternative label: IE, selainohjelma (61.72+)
alternative label: Internet (61.72+)
alternative label: Internet Explorer, selainohjelma (61.72+)
alternative label: Internet-osoitteet (61.72+)
alternative label: Internet-puhelut (61.72)
alternative label: Internet-sivut (61.72+)
alternative label: Intranet (61.72+)
alternative label: JSP, www-sivut (61.72+)
alternative label: Kotisivut, Internet (61.72+)
alternative label: Mosaic, selainohjelma (61.72+)
alternative label: Mozilla, selainohjelma (61.72+)
alternative label: Netiketti (61.72+)
alternative label: Netscape, selainohjelma (61.72+)
alternative label: Nettipäiväkirjat, Internet (61.72+)
alternative label: Nörtit, Internet (61.72+)
alternative label: OA, Internet (61.72+)
alternative label: Open Access, Internet (61.72+)
alternative label: Portaalit (61.72+)
alternative label: Semanttinen web (61.72+)
alternative label: Sisällönhallinta, Internet (61.72+)
alternative label: Sisältötuotanto, Internet (61.72+)
alternative label: Skype (61.72)
alternative label: Sähköinen allekirjoitus (61.72+)
alternative label: Sähköiset julkaisut, Internet (61.72+)
alternative label: Sähköiset lomakkeet, Internet (61.72+)
alternative label: Sähkökirjat, Internet (61.72+)
alternative label: Tiedonhaku, Internet (61.72+)
alternative label: Tiedonhallinta, Internet (61.72+)
alternative label: Tiedonhallintajärjestelmät, Internet (61.72+)
alternative label: Tubettaminen (61.72)
alternative label: Tubetus (61.72)
alternative label: URI, Internet-osoitteet (61.72+)
alternative label: URL-osoitteet (61.72+)
alternative label: Uusmedia, Internet (61.72+)
alternative label: Vapaa verkkojulkaiseminen (61.72+)
alternative label: Verkko-osoitteet (61.72+)
alternative label: Verkkoasiointi (61.72+)
alternative label: Verkkojulkaisut, Internet (61.72+)
alternative label: Verkkokirjat, Internet (61.72+)
alternative label: Verkkolehdet, Internet (61.72+)
alternative label: Verkkopalvelut (61.72+)
alternative label: Verkkopäiväkirjat, Internet (61.72+)
alternative label: Verkkosivut, Internet (61.72+)
alternative label: Verkkotunnukset, Internet (61.72+)
alternative label: Verkkoviestintä, Internet (61.72+)
alternative label: Vloggaaminen (61.72)
alternative label: Vloggaus (61.72)
alternative label: WWW (61.72+)
alternative label: WWW-osoitteet (61.72+)
alternative label: WWW-sivustot, Internet (61.72+)
broader: Tietoliikenne. Viestintätekniikka. Multimedia
in scheme: YKL - Yleisten kirjastojen luokitusjärjestelmä
narrower: Verkkoyhteisöt. Sähköposti. Verkkojuttelu
narrower: Verkkojulkaiseminen
notation: 61.72
scope note: Hit allmänna verk om Internet, intranät och extranät Allmänna verk om hur Internet inverkar på samhället och informationsförmedling Allmänna verk om innehåll på Internet, intranät eller extranät Allmänna verk om Internets, intranäts eller extranäts uppbyggnad Allmänna handledningar i användning av Internet. Internet-anslutningar. Internet-operatörer World Wide Web, portaler och webbläsare i allmänhet Dataöverföring via Internet, intranät och extranät Internet-, intranät- och extranätadresser och kontroll av dem i allmänhet URI. URL Tillämpningar av Internet, intranät och extranät inom specialområden klassificeras enligt område @sv
scope note: Tähän Internetiä, intranetiä tai ekstranetiä koskevat yleisteokset Internetin vaikutukset yhteiskuntaan ja tiedonvälitykseen yleensä Internetin, intranetin ja ekstranetin sisältö ja rakenne yleensä Internetin käyttöoppaat yleensä. Internet-liittymät. Internet-operaattorit World Wide Web yleensä. Portaalit yleensä. Selaimet yleensä Tiedonsiirto Internetissä, intranetissä ja ekstranetissä Internet-, intranet- ja ekstranet-osoitteet ja niiden hallinta yleensä. URI. URL Internetin, intranetin ja ekstranetin sovellukset erikoisaloille luokitetaan alan mukaan

Verkkoyhteisöt. Sähköposti. Verkkojuttelu
type: Concept
References: Posti
References: Suomen kieli
References: Ruotsin kieli
type: YKL-luokka
alternative label: Chatt (61.721) @sv
alternative label: Chattailu (61.721)
alternative label: Diskussionsgrupper, Internet (61.721) @sv
alternative label: E-post (61.721) @sv
alternative label: E-postmeddelanden (61.721) @sv
alternative label: Elektroninen posti (61.721)
alternative label: Elektronisk post (61.721) @sv
alternative label: Facebook (61.721)
alternative label: IRC (61.721)
alternative label: IRC, chatt (61.721) @sv
alternative label: Irkkaus (61.721)
alternative label: Keskusteluryhmät, Internet (61.721)
alternative label: MySpace (61.721)
alternative label: Newsgroup, diskussionsgrupper, Internet (61.721) @sv
alternative label: Newsgroup, keskusteluryhmät, Internet (61.721)
alternative label: Nätgemenskaper (61.721) @sv
alternative label: Outlook, e-post (61.721) @sv
alternative label: Outlook, sähköposti (61.721)
alternative label: Roskaposti (61.721)
alternative label: Skräppost (61.721) @sv
alternative label: Socialt medium (61.721) @sv
alternative label: Sosiaalinen media (61.721)
alternative label: Spam, roskaposti (61.721)
alternative label: Spam, skräppost (61.721) @sv
alternative label: Sähköposti (61.721)
alternative label: Sähköpostiviestit (61.721)
alternative label: Twitter (61.721)
alternative label: Verkkojuttelu (61.721)
alternative label: Verkkoyhteisöt (61.721)
alternative label: Virtuaaliyhteisöt (61.721)
alternative label: Virtuella samfund (61.721) @sv
alternative label: Webbchatt (61.721) @sv
alternative label: Wikier (61.721) @sv
alternative label: Wikit (61.721)
broader: Internet. Intranet. Ekstranet
in scheme: YKL - Yleisten kirjastojen luokitusjärjestelmä
notation: 61.721
preferred label: Nätgemenskaper. E-post. Chatt @sv
preferred label: Virtual communities. E-mail. Chat @en
scope note: Nätgemenskaper, e-post, chatt, socialt medium och telekommunikationsteknik i dem i allmänhet E-postsystem och -program. Handledningar i användning av e-post Chattsidor på Internet, intranät och extranät i allmänhet E-post, chatt och IRC inom specialområden klassificeras enligt område @sv
scope note: Verkkoyhteisöt, sähköposti, verkkojuttelu, chattailu ja sosiaalinen media sekä niihin liittyvä tietoliikennetekniikka yleensä Sähköpostijärjestelmät ja -ohjelmat. Sähköpostin käyttöoppaat Internetin, intranetin ja ekstranetin keskustelupalstat yleensä Erikoisaloihin liittyvä sähköposti, verkkojuttelu, chattailu ja irkkaus luokitetaan alan mukaan

Verkkojulkaiseminen
type: Concept
References: Kirjapainotaito. Graafinen teollisuus
References: Kustannustoiminta. Kirjakauppa
References: BIBLIOGRAFIA
References: Ohjelmointi. Ohjelmointikielet
References: Suomen kieli
References: Ruotsin kieli
alternative label: ASP, ohjelmointikielet (61.722)
alternative label: ASP, programmeringsspråk (61.722) @sv
alternative label: ASP.NET, ohjelmointiympäristöt (61.722)
alternative label: ASP.NET, programmeringsmiljöer (61.722) @sv
alternative label: Ajax, verkkojulkaiseminen (61.722)
alternative label: Ajax, webbpublicering (61.722) @sv
alternative label: Apache, atk-ohjelmat (61.722)
alternative label: Apache, dataprogram (61.722) @sv
alternative label: Appleter (61.722) @sv
alternative label: Appletit (61.722)
alternative label: Beskrivningsspråk (61.722) @sv
alternative label: CSS, stilfiler (61.722) @sv
alternative label: CSS, tyylitiedostot (61.722)
alternative label: Datalagring, webbpublicering (61.722) @sv
alternative label: Dreamweaver, editor (61.722) @sv
alternative label: Dreamweaver, editori (61.722)
alternative label: Editering, webbpublicering (61.722) @sv
alternative label: Editointi, verkkojulkaiseminen (61.722)
alternative label: Emacs, editor (61.722) @sv
alternative label: Emacs, editori (61.722)
alternative label: Filformat, webbpublicering (61.722) @sv
alternative label: Flash, atk-ohjelmat (61.722)
alternative label: Flash, dataprogram (61.722) @sv
alternative label: FrontPage, editor (61.722) @sv
alternative label: FrontPage, editori (61.722)
alternative label: HTML, beskrivningsspråk (61.722) @sv
alternative label: HTML, kuvauskielet (61.722)
alternative label: Hemsidor, planering och utarbetning (61.722) @sv
alternative label: Internet-ohjelmointi (61.722)
alternative label: Internet-programmering (61.722) @sv
alternative label: Internet-sidor, planering och utarbetning (61.722) @sv
alternative label: Internet-sivut, suunnittelu ja laadinta (61.722)
alternative label: J2EE, ohjelmointiympäristöt (61.722)
alternative label: J2EE, programmeringsmiljöer (61.722) @sv
alternative label: J2ME, ohjelmointiympäristöt (61.722)
alternative label: J2ME, programmeringsmiljöer (61.722) @sv
alternative label: J2SE, ohjelmointiympäristöt (61.722)
alternative label: J2SE, programmeringsmiljöer (61.722) @sv
alternative label: Java, ohjelmointikielet (61.722)
alternative label: Java, programmeringsspråk (61.722) @sv
alternative label: Java-appleter (61.722) @sv
alternative label: Java-appletit (61.722)
alternative label: JavaScript, ohjelmointikielet (61.722)
alternative label: Jbuilder, ohjelmointikielet (61.722)
alternative label: Julkaisujärjestelmät, verkkojulkaiseminen (61.722)
alternative label: Kotisivut, laadinta (61.722)
alternative label: Kuvauskielet (61.722)
alternative label: Metadata, verkkojulkaiseminen (61.722)
alternative label: Metakielet, verkkojulkaiseminen (61.722)
alternative label: Microsoft.NET, ohjelmointiympäristöt (61.722)
alternative label: MySql, tietokantaohjelmat, verkkojulkaiseminen (61.722)
alternative label: Ohjelmointiympäristöt, Internet-ohjelmointi (61.722)
alternative label: PHP, ohjelmointikielet, verkkojulkaiseminen (61.722)
alternative label: Podcasting (61.722)
alternative label: SGML, kuvauskielet (61.722)
alternative label: Saavutettavuus, verkkopalvelut (61.722)
alternative label: Tiedontallennus, verkkojulkaiseminen (61.722)
alternative label: Tiedostomuodot, verkkojulkaseminen (61.722)
alternative label: UML, kuvauskielet (61.722)
alternative label: VRML, kuvauskielet (61.722)
alternative label: Verkkojulkaiseminen (61.722)
alternative label: Verkkojulkaisut, laatiminen (61.722)
alternative label: Verkkokirjoittaminen (61.722)
alternative label: Verkkosivut, suunnittelu ja laadinta (61.722)
alternative label: WWW-sivustot, suunnittelu ja laadinta (61.722)
alternative label: WWW-sivut, suunnittelu ja laadinta (61.722)
alternative label: XHTML, kuvauskielet (61.722)
alternative label: XML, kuvauskielet (61.722)
broader: Internet. Intranet. Ekstranet
in scheme: YKL - Yleisten kirjastojen luokitusjärjestelmä
notation: 61.722
scope note: Internet-, intranet- ja ekstranet-julkaiseminen yleensä WWW-sivujen, -sivustojen ja portaalien suunnittelu ja laadinta yleensä Verkkopalvelujen saavutettavuus Verkkojulkaisemiseen liittyvät julkaisujärjestelmät, ohjelmointi, atk-ohjelmat sekä ohjelmointi- ja kuvauskielet yleensä Erikoisaloihin liittyvä verkkojulkaiseminen ja erikoisalojen verkkojulkaisut luokitetaan alan mukaan
scope note: Publicering på Internet, intranät och extranät i allmänhet Planering och utarbetning av webbsidor, webbplatser och portaler i allmänhet Webbtjänsternas åtkomlighet Publiceringssystem, dataprogram, programmering, programmeringsspråk och beskrivningsspråk ur webbpubliceringens synpunkt i allmänhet Webbpublicering och webbpublikationer inom specialområden klassificeras enligt område @sv

Matkaviestinpalvelut. Puhelinliikenne
type: Concept
References: Internet. Intranet. Ekstranet
References: Elektroniikka
References: Toimistotyö. Toimistotekniikka
References: Valokuvauksen tekniikka. Valokuvausoppaat
References: Video- ja kaitafilmauksen tekniikka
alternative label: 3G-tekniikka (61.73)
alternative label: 3G-teknik (61.73) @sv
alternative label: Automaattiset puhelinvastaajat (61.73)
alternative label: Automatiska telefonsvarare (61.73) @sv
alternative label: Autopuhelimet (61.73)
alternative label: Bildtelefoner (61.73) @sv
alternative label: Biltelefoner (61.73) @sv
alternative label: Båttelefoner (61.73) @sv
alternative label: Fjärrsamtal (61.73) @sv
alternative label: GPRS, puhelinverkko (61.73)
alternative label: GPRS, telefonnät (61.73) @sv
alternative label: GSM, puhelinverkko (61.73)
alternative label: GSM, telefonnät (61.73) @sv
alternative label: Hakulaitteet (61.73)
alternative label: Handsfree (61.73) @sv
alternative label: Handsfree-toiminto (61.73)
alternative label: Henkilöhakujärjestelmät (61.73)
alternative label: Hörbarhetsområden, telefontrafik (61.73) @sv
alternative label: Kamerapuhelimet (61.73)
alternative label: Kameratelefoner (61.73) @sv
alternative label: Kaukopuhelut (61.73)
alternative label: Kuuluvuusalueet, puhelinliikenne (61.73)
alternative label: Kuvapuhelimet (61.73)
alternative label: Ljudöverföring, telefonteknik (61.73) @sv
alternative label: Lokalsamtal (61.73) @sv
alternative label: MMS, multimediameddelanden (61.73) @sv
alternative label: MMS, multimediaviestit (61.73)
alternative label: Mastot, puhelintekniikka (61.73)
alternative label: Matkapuhelimet (61.73)
alternative label: Matkapuhelinjärjestelmät (61.73)
alternative label: Matkaviestimet (61.73)
alternative label: Matkaviestinpalvelut (61.73)
alternative label: Matkaviestinverkot (61.73)
alternative label: Meri-VHF (61.73)
alternative label: Mobiilipalvelut (61.73)
alternative label: Multimediaviestit (61.73)
alternative label: NMT, puhelinverkko (61.73)
alternative label: Paikallispuhelut (61.73)
alternative label: Puheensiirto, puhelintekniikka (61.73)
alternative label: Puhelimet (61.73)
alternative label: Puhelinasennus (61.73)
alternative label: Puhelinjärjestelmät (61.73)
alternative label: Puhelinkaapelit (61.73)
alternative label: Puhelinkeskukset (61.73)
alternative label: Puhelinkäyttäytyminen, puhelinliikenne (61.73)
alternative label: Puhelinlaitokset (61.73)
alternative label: Puhelinlaitteet (61.73)
alternative label: Puhelinliikenne (61.73)
alternative label: Puhelinlinjat (61.73)
alternative label: Puhelinpalvelut (61.73)
alternative label: Puhelintekniikka (61.73)
alternative label: Puhelinvaihteet (61.73)
alternative label: Puhelinvastaajat (61.73)
alternative label: Puhelinverkot (61.73)
alternative label: Puhelinyhdistykset (61.73)
alternative label: Puhelukortit (61.73)
alternative label: Puhelumaksut (61.73)
alternative label: SIM-kortit (61.73)
alternative label: SMS, tekstiviestit (61.73)
alternative label: Sisäpuhelimet (61.73)
alternative label: Tekstipuhelimet (61.73)
alternative label: Tekstiviestit (61.73)
alternative label: Turvapuhelimet, tekniikka (61.73)
alternative label: UMTS, puhelinverkko (61.73)
alternative label: VHF-puhelimet (61.73)
alternative label: Venepuhelimet (61.73)
alternative label: WAP (61.73)
alternative label: iPhone (61.73)
alternative label: Älypuhelimet (61.73)
broader: Tietoliikenne. Viestintätekniikka. Multimedia
in scheme: YKL - Yleisten kirjastojen luokitusjärjestelmä
notation: 61.73
scope note: Allmänna verk om mobilkommunikationstjänster och telefontrafik Mobiltelefontrafik samt text- och multimediameddelanden och teknik i dem Telefonteknik. Teknik i mobilkommunikationstjänster i allmänhet Telefonoperatörer. Telefonverk. Telefoncentraler Telefonnumersystem i allmänhet. Telefonnät. Telefonväxlar Länkstationer. Hörbarhetsområden Telekommunikations- och telefonapparater samt teknik i dem och industriell framställning av dem Mobilteleapparater. Telefoner. Mobiltelefoner. Smarttelefoner. Telefonsvarare Personsökare. Interna telefonsystem Mobilkommunikations- och telefontjänster inom specialområden klassificeras enligt område Telefonkataloger i allmänhet 61.7303 @sv
scope note: Matkaviestinpalveluja ja puhelinliikennettä koskevat yleisteokset Matkapuhelinliikenne sekä teksti- ja multimediaviestit ja niiden tekniikka Puhelintekniikka. Matkaviestinpalvelujen tekniikka yleensä Puhelinoperaattorit. Puhelinlaitokset. Puhelinkeskukset Puhelinnumerojärjestelmät yleensä. Puhelinverkot. Puhelinvaihteet. Linkkiasemat. Kuuluvuusalueet Matkaviestin- ja puhelinlaitteet sekä niiden tekniikka ja teollinen valmistus Matkaviestimet. Puhelimet. Matkapuhelimet. Älypuhelimet. Puhelinvastaajat Hakulaitteet. Sisäpuhelinjärjestelmät Erikoisaloihin liittyvät matkaviestin- ja puhelinpalvelut luokitetaan alan mukaan Puhelinluettelot yleensä 61.7303

Audiovisuaalinen tekniikka
type: Concept
References: Kustannustoiminta. Kirjakauppa
References: Kirjastonhoito. Kirjastotekniikka
References: VIESTINTÄ. JOUKKOVIESTINTÄ
References: Radio- ja televisiotoiminta
References: Oppimateriaalit. Opetusvälineet
References: Tietokoneet
alternative label: AV-aineisto, tekniikka (61.74+)
alternative label: AV-ala (61.74+)
alternative label: AV-apparatur, teknik (61.74+) @sv
alternative label: AV-branschen (61.74+) @sv
alternative label: AV-laitteisto, tekniikka (61.74+)
alternative label: AV-material, teknik (61.74+) @sv
alternative label: AV-tekniikka (61.74+)
alternative label: AV-teknik (61.74+) @sv
alternative label: AV-utrustning, teknik (61.74+) @sv
alternative label: AV-välineet, tekniikka (61.74+)
alternative label: Analog lagring, AV-teknik (61.74+) @sv
alternative label: Analoginen tallennus, audiovisuaalinen tekniikka (61.74+)
alternative label: Audiovisuaalinen aineisto, tekniikka (61.74+)
alternative label: Audiovisuaalinen ala (61.74+)
alternative label: Audiovisuaalinen laitteisto, tekniikka (61.74+)
alternative label: Audiovisuaalinen tekniikka (61.74+)
alternative label: Audiovisuaaliset välineet, tekniikka (61.74+)
alternative label: Audiovisuell apparatur, teknik (61.74+) @sv
alternative label: Audiovisuell teknik (61.74+) @sv
alternative label: Audiovisuell utrustning, teknik (61.74+) @sv
alternative label: Audiovisuella branschen (61.74+) @sv
alternative label: Audiovisuella material, teknik (61.74+) @sv
alternative label: Bandinspelning (61.74+) @sv
alternative label: Bandspelare (61.74+) @sv
alternative label: Brus, AV-teknik (61.74+) @sv
alternative label: CD-R-levyt, tekniikka (61.74+)
alternative label: CD-ROM-levyt, tekniikka (61.74+)
alternative label: CD-levyt, tekniikka (61.74+)
alternative label: DVD-R-levyt, tekniikka (61.74+)
alternative label: DVD-ROM-levyt, tekniikka (61.74+)
alternative label: DVD-laitteet (61.74+)
alternative label: DVD-levyt, tekniikka (61.74+)
alternative label: DVD-soittimet (61.74+)
alternative label: Disketit, tekniikka (61.74+)
alternative label: E-kirjat, audiovisuaalinen tekniikka (61.74+)
alternative label: Elektroniset julkaisut, audiovisuaalinen tekniikka (61.74+)
alternative label: Huojunta, audiovisuaalinen tekniikka (61.74+)
alternative label: Kaapelit, audiovisuaalinen tekniikka (61.74+)
alternative label: Kaapeliverkot, audiovisuaalinen tekniikka (61.74+)
alternative label: Kaapeliviestintä, audiovisuaalinen tekniikka (61.74+)
alternative label: Kodintekniikka, audiovisuaaliset laitteet (61.74+)
alternative label: Kohina, audiovisuaalinen tekniikka (61.74+)
alternative label: Kotiteatterit (61.74+)
alternative label: Laserlevyt, tekniikka (61.74+)
alternative label: Levykkeet, tekniikka (61.74+)
alternative label: Levyt, audiovisuaalinen tekniikka (61.74+)
alternative label: Magneettilevyt, tekniikka (61.74+)
alternative label: Magneettinauhat, tekniikka (61.74+)
alternative label: Magneettiset tallenteet, tekniikka (61.74+)
alternative label: Mastot, audiovisuaalinen tekniikka (61.74+)
alternative label: Nauhoitus (61.74+)
alternative label: Nauhurit (61.74+)
alternative label: Optinen tallennus, audiovisuaalinen tekniikka (61.74+)
alternative label: Optiset levyt, tekniikka (61.74+)
alternative label: Optiset tallenteet, tekniikka (61.74+)
alternative label: SACD-levyt, tekniikka (61.74+)
alternative label: Satelliitit, audiovisuaalinen tekniikka (61.74+)
alternative label: Satelliittiantennit (61.74+)
alternative label: Sähköinen viestintä, audiovisuaalinen tekniikka (61.74+)
alternative label: Sähköiset julkaisut, audiovisuaalinen tekniikka (61.74+)
alternative label: Sähkökirjat, audiovisuaalinen tekniikka (61.74+)
alternative label: Tallenteet, tekniikka (61.74+)
alternative label: Tietoliikennesatelliitit, audiovisuaalinen tekniikka (61.74+)
alternative label: Vakavuus, audiovisuaalinen tekniikka (61.74+)
alternative label: Verkkoviestintä, audiovisuaalinen tekniikka (61.74+)
alternative label: Värähtelyt, audiovisuaalinen tekniikka (61.74+)
broader: Tietoliikenne. Viestintätekniikka. Multimedia
in scheme: YKL - Yleisten kirjastojen luokitusjärjestelmä
narrower: Äänitekniikka. Radiotekniikka
narrower: Kuvantoistotekniikka. Televisiotekniikka
notation: 61.74
scope note: Hit allmänna verk om audiovisuell teknik Hit verk som rör både ljudteknik och bildåtergivningsteknik Hit verk som rör både ljudupptagningar och videogram ur teknikens synpunkt Hit verk som rör både radio- och TV-teknik @sv
scope note: Tähän audiovisuaalisen tekniikan yleisteokset Tähän teokset, jotka koskevat sekä äänitekniikkaa että kuvantoistotekniikkaa Tähän teokset, jotka koskevat sekä ääni- että kuvatallenteita tekniikan kannalta Tähän teokset, jotka koskevat sekä radio- että televisiotekniikkaa

Äänitekniikka. Radiotekniikka
type: Concept
References: Kustannustoiminta. Kirjakauppa
References: Taiteet. Liikunta
References: Kirjastonhoito. Kirjastotekniikka
References: Radiotoiminta
References: Oppimateriaalit. Opetusvälineet
References: Tietokoneet
References: Kuvantoistotekniikka. Televisiotekniikka
References: Soitinrakennus
References: Elokuvatekniikka
alternative label: Antennit, radiotekniikka (61.741)
alternative label: Autoradiot (61.741)
alternative label: CD-soittimet (61.741)
alternative label: CD-äänilevyt, tekniikka (61.741)
alternative label: DVD-äänilevyt, tekniikka (61.741)
alternative label: DX-kuuntelu (61.741)
alternative label: DX-kuuntelulaitteet (61.741)
alternative label: Digitaaliradio (61.741)
alternative label: Editointi, äänitekniikka (61.741)
alternative label: Gramofonit (61.741)
alternative label: Hifi-laitteet (61.741)
alternative label: Jälkiäänitys, äänitekniikka (61.741)
alternative label: Kaapeliradio, tekniikka (61.741)
alternative label: Kaiuttimet (61.741)
alternative label: Kasetit, äänentoistotekniikka (61.741)
alternative label: Kasettinauhurit (61.741)
alternative label: Kasettisoittimet (61.741)
alternative label: Keskusradiojärjestelmät (61.741)
alternative label: Korvalappustereot (61.741)
alternative label: Kuulokkeet (61.741)
alternative label: Lasersoittimet (61.741)
alternative label: Levyautomaatit (61.741)
alternative label: Levysoittimet (61.741)
alternative label: Levytys (61.741)
alternative label: Lyhyaaltopuhelimet (61.741)
alternative label: Lyhytaaltokuuntelu (61.741)
alternative label: Lyhytaaltotekniikka (61.741)
alternative label: MIDI, äänitekniikka (61.741)
alternative label: MP3-soittimet (61.741)
alternative label: Magnetofonit (61.741)
alternative label: Matkaradiot (61.741)
alternative label: Mikrofonit (61.741)
alternative label: Miksaus, äänitekniikka (61.741)
alternative label: Nauhurit, äänitekniikka (61.741)
alternative label: Puheensiirto, audiovisuaalinen tekniikka (61.741)
alternative label: Puheteknologia, audiovisuaalinen tekniikka (61.741)
alternative label: Radio, tekniikka (61.741)
alternative label: Radio-ohjaus (61.741)
alternative label: Radioaallot, ääni- ja radiotekniikka (61.741)
alternative label: Radioamatööritoiminta (61.741)
alternative label: Radioantennit (61.741)
alternative label: Radioasemat, tekniikka (61.741)
alternative label: Radiokanavat, tekniikka (61.741)
alternative label: Radiolaitteet (61.741)
alternative label: Radiolennätin (61.741)
alternative label: Radiolähettimet (61.741)
alternative label: Radionavigointi, tekniikka (61.741)
alternative label: Radiopuhelimet (61.741)
alternative label: Radiosatelliitit, tekniikka (61.741)
alternative label: Radiosähkötys (61.741)
alternative label: Radiot (61.741)
alternative label: Radiot, rakentaminen (61.741)
alternative label: Radiotekniikka (61.741)
alternative label: Radioteollisuus (61.741)
alternative label: Radiovastaanottimet (61.741)
alternative label: Radioverkot (61.741)
alternative label: Sampling, äänitekniikka (61.741)
alternative label: Stereofonia (61.741)
alternative label: Stereolaitteet (61.741)
alternative label: Studiot, ääni- ja radiotekniikka (61.741)
alternative label: Sähkötys, radiosähkötys (61.741)
alternative label: Transistoriradiot (61.741)
alternative label: Tutkat (61.741)
alternative label: Vahvistimet, äänitekniikka (61.741)
alternative label: Vaimennus, äänitekniikka (61.741)
broader: Audiovisuaalinen tekniikka
in scheme: YKL - Yleisten kirjastojen luokitusjärjestelmä
notation: 61.741
scope note: Ljudinspelningsteknik. Mikrofoner. Inspelningsstudior. Skivinspelning Ljudåtergivningsteknik. Ljudåtergivningsanläggningar. Hifi-anläggningar. Stereoanläggningar Skivspelare. Kasettspelare. Högtalare. Bandspelare Ljudupptagningar ur ljudinspelnings- och ljudåtergivningsteknikens synpunkt Industriell framställning av ljudtekniska apparater och ljudupptagningar Användning av ADB i ljudteknik Radioapparater. Radioteknik. Kabelradio. Digital radio. Radioindustri Sändar- och mottagarstationer. Radiosatelliter. Radioantenner Radioapparater i trafikmedel. Bilradio Radiotelefon. Radiotelegraf. Radioamatörverksamhet. DX Radar i allmänhet Om verket innehåller både radioteknik och programverksamhet i radio ges företräde åt klass 07.21 @sv
scope note: Äänitystekniikka. Mikrofonit. Äänitysstudiot. Levytys Äänentoistotekniikka. Äänentoistolaitteet. Hifi-laitteet. Stereolaitteet Levysoittimet. Kasettisoittimet. Kaiuttimet. Nauhurit Äänitteet äänitys- ja äänentoistotekniikan kannalta Ääniteknisten laitteiden ja tallennusvälineiden teollinen valmistus Atk:n käyttö äänitekniikassa Radiot. Radiotekniikka. Kaapeliradio. Digitaaliradio. Radioteollisuus Radion lähetys- ja vastaanottoasemat. Radiosatelliitit. Radioantennit Liikennevälineiden radiolaitteet. Autoradiot Radiopuhelin. Radiolennätin. Radioamatööritoiminta. DX-kuuntelu Tutkat Jos teos koskee sekä radiotekniikkaa että radion ohjelmatoimintaa, annetaan etusija luokalle 07.21

Kuvantoistotekniikka. Televisiotekniikka
type: Concept
References: Kustannustoiminta. Kirjakauppa
References: Taiteet. Liikunta
References: Kirjastonhoito. Kirjastotekniikka
References: Televisiotoiminta
References: Oppimateriaalit. Opetusvälineet
References: Ohjelmointi. Ohjelmointikielet
References: Tietokoneet
References: Äänitekniikka. Radiotekniikka
References: Optiset ja lääketieteelliset laitteet
References: Valokuvauksen tekniikka. Valokuvausoppaat
References: Elokuvatekniikka
References: Video- ja kaitafilmauksen tekniikka
alternative label: Antenner, TV-teknik (61.742) @sv
alternative label: Antennit, TV-tekniikka (61.742)
alternative label: Arbetsprojektorer, bildåtergivningsteknik (61.742) @sv
alternative label: Bandspelare, bildåtergivningsteknik (61.742) @sv
alternative label: Bandspelare, video (61.742) @sv
alternative label: Bildinspelning, bildåtergivningsteknik (61.742) @sv
alternative label: Bildkassetter, teknik (61.742) @sv
alternative label: Bildrör (61.742) @sv
alternative label: Bildskivor, teknik (61.742) @sv
alternative label: Bildskivspelare (61.742) @sv
alternative label: Bildåtergivningsapparater (61.742) @sv
alternative label: CD-kuvalevyt, tekniikka (61.742)
alternative label: DVD-videolaitteet (61.742)
alternative label: DVD-videolevyt, tekniikka (61.742)
alternative label: Digisovittimet (61.742)
alternative label: Digitaalitelevisio (61.742)
alternative label: Kaapelitelevisio, tekniikka (61.742)
alternative label: Kameranauhurit, kuvantoistotekniikka (61.742)
alternative label: Kasetit, kuvantoistotekniikka (61.742)
alternative label: Kuvakasetit, tekniikka (61.742)
alternative label: Kuvalevysoittimet (61.742)
alternative label: Kuvalevyt, tekniikka (61.742)
alternative label: Kuvanauhat, audiovisuaalinen tekniikka (61.742)
alternative label: Kuvanauhoitusjärjestelmät (61.742)
alternative label: Kuvanauhurit (61.742)
alternative label: Kuvansiirto, kuvantoistotekniikka (61.742)
alternative label: Kuvantallennus, kuvantoistotekniikka (61.742)
alternative label: Kuvantoistolaitteet (61.742)
alternative label: Kuvantoistotekniikka (61.742)
alternative label: Kuvaputket (61.742)
alternative label: Kuvatallenteet, tekniikka (61.742)
alternative label: Matkatelevisiot (61.742)
alternative label: Mikrofilmit, lukulaitteet (61.742)
alternative label: Mikrokortit, lukulaitteet (61.742)
alternative label: Nauhurit, kuvantoistotekniikka (61.742)
alternative label: Piirtoheittimet, kuvantoistotekniikka (61.742)
alternative label: Projektorit, kuvantoistotekniikka (61.742)
alternative label: Satelliittitelevisio, tekniikka (61.742)
alternative label: Siirtoheittimet (61.742)
alternative label: Studiot, televisiotekniika (61.742)
alternative label: Tekstitelevisio (61.742)
alternative label: Tekstitys, televisiotekniikka (61.742)
alternative label: Televisio, tekniikka (61.742)
alternative label: Televisioantennit (61.742)
alternative label: Televisioasemat, tekniikka (61.742)
alternative label: Televisiojärjestelmät (61.742)
alternative label: Televisiokaapelit, tekniikka (61.742)
alternative label: Televisiokamerat, kuvantoisto- ja televisiotekniikka (61.742)
alternative label: Televisiokanavat, tekniikka (61.742)
alternative label: Televisiosatelliitit, tekniikka (61.742)
alternative label: Televisiot (61.742)
alternative label: Televisiotekniikka (61.742)
alternative label: Televisioteollisuus (61.742)
alternative label: Televisioverkot (61.742)
alternative label: Teräväpiirtotelevisiot (61.742)
alternative label: Videokamerat, tekniikka ja teollisuus (61.742)
alternative label: Videokasetit, tekniikka (61.742)
alternative label: Videolaitteet (61.742)
alternative label: Videolevyt, tekniikka (61.742)
alternative label: Videonauhurit (61.742)
alternative label: Videoprojektorit (61.742)
alternative label: Videotekniikka (61.742)
broader: Audiovisuaalinen tekniikka
in scheme: YKL - Yleisten kirjastojen luokitusjärjestelmä
notation: 61.742
scope note: Bildåtergivningsapparater. Videoapparater. DVD-videoapparater Projektorer. Episkop. Arbetsprojektorer Videogram ur bildåtergivningsteknikens synpunkt Industriell framställning av bildåtergivningsapparater och videogram Användning av ADB i bildåtergivningsteknik Televisionsapparater. TV-teknik. Televisionsindustri Kabel-TV. Text-TV. Digital-TV. Digibox Mottagar- och sändarstationer. TV-antenner. TV-satelliter Om verket innehåller både televisions- eller videoteknik och programverksamhet i TV ges företräde åt klass 07.22 @sv
scope note: Kuvantoistolaitteet. Videokamerat. Videolaitteet. DVD-videolaitteet Projektorit. Kuvanheittimet. Piirtoheittimet Kuvatallenteet kuvantoistotekniikan kannalta Kuvantoistolaitteiden ja tallennusvälineiden teollinen valmistus Atk:n käyttö kuvantoistotekniikassa Televisiot. Televisiotekniikka. Televisioteollisuus Kaapelitelevisio. Tekstitelevisio. Digitaalitelevisio. Digisovittimet Television lähetys- ja vastaanottoasemat. Televisioantennit. Televisiosatellitit Jos teos koskee sekä televisiotekniikkaa että television ohjelmatoimintaa, annetaan etusija luokalle 07.22

METALLITEOLLISUUS. KONETEKNIIKKA. LIIKENNEVÄLINEET SÄHKÖTEKNIIKKA
type: Concept
References: Aseistus. Asevarustelu. Asekauppa
References: Tekniikka ja sovelletut tieteet harrasteena
References: Metallurgia
type: YKL-luokka
alternative label: Aseteollisuus (62)
alternative label: Industriell formgivning, resp. område (60 ... 64+) @sv
alternative label: Konepajatekniikka (62)
alternative label: Konepajateollisuus (62)
alternative label: Lukkoteollisuus (62)
alternative label: Låsindustri (62) @sv
alternative label: Maskinverkstadsindustri (62) @sv
alternative label: Maskinverkstadsteknik (62) @sv
alternative label: Metallindustri (62) @sv
alternative label: Metalliteollisuus (62)
alternative label: Metallituoteteollisuus (62)
alternative label: Metallituotteet (62)
alternative label: Metallprodukter (62) @sv
alternative label: Metallproduktindustri (62) @sv
alternative label: Teollinen muotoilu, aloittain (60 ... 64+)
alternative label: Vapenindustri (62) @sv
broader: TEKNIIKKA. TEOLLISUUS. KÄSITYÖ. MAA- JA METSÄTALOUS KOTITALOUS. LIIKETALOUS. LIIKENNE
in scheme: YKL - Yleisten kirjastojen luokitusjärjestelmä
narrower: Mekaaninen teknologia. Metallin työstö
narrower: Konetekniikka. Voitelutekniikka
narrower: Voimakoneet. Moottorit
narrower: Nosto- ja kuljetuslaitteet. Hydrauliikka
narrower: Liikennevälineet
narrower: Sähkötekniikka
notation: 62
preferred label: METAL INDUSTRY. MACHINE TECHNOLOGY. VEHICLES. ELECTRICAL ENGINEERING @en
preferred label: METALLINDUSTRI. MASKINTEKNIK. TRANSPORTMEDEL ELTEKNIK @sv
scope note: Hit allmänna verk om metallindustri och verkstadsindustri Hit och till underklasserna också företagsekonomi, produktionsmetoder, rationalisering och handel inom metallindustrin Hit också vapenindustri Hit också verk som rör både allmän maskinteknik och trafikmedel eller elektroteknik Om tyngdpunkten i verket ligger på ett specialområde inom teknik eller industri, ges företräde åt klassen för området i fråga @sv
scope note: Tähän metalliteollisuuden, metallituoteteollisuuden ja konepajateollisuuden yleisteokset Tähän ja alaluokkiin myös metalliteollisuuden liiketalous, tuotantomenetelmät, rationalisointi ja kauppa Tähän myös aseteollisuus Tähän myös teokset, jotka koskevat sekä yleistä konetekniikkaa että liikennevälineitä tai sähkötekniikkaa Jos teos painottuu johonkin tiettyyn tekniikan tai teollisuuden alaan, annetaan etusija ko. alan luokalle

Mekaaninen teknologia. Metallin työstö
type: Concept
References: Kaivannaisteollisuus
References: Metallurgia
References: Puuteollisuus
References: Metallityö
alternative label: Avskärning, bearbetning av metall (62.1) @sv
alternative label: Bearbetning, metall (62.1) @sv
alternative label: Borrning, bearbetning av metall (62.1) @sv
alternative label: Drivning, industriell bearbetning av metall (62.1) @sv
alternative label: Filning, bearbetning av metall (62.1) @sv
alternative label: Fräsning, bearbetning av metall (62.1) @sv
alternative label: Gassvetsning (62.1) @sv
alternative label: Gjuteriteknik (62.1) @sv
alternative label: Gjutmetoder, metallindustri (62.1) @sv
alternative label: Hionta, metallin työstö (62.1)
alternative label: Hitsaus (62.1)
alternative label: Hyvling, bearbetning av metall (62.1) @sv
alternative label: Härdning, bearbetning av metall (62.1) @sv
alternative label: Höyläys, metallin työstö (62.1)
alternative label: Juottaminen, metallin työstö (62.1)
alternative label: Jyrsintä, metallin työstö (62.1)
alternative label: Kaasuhitsaus (62.1)
alternative label: Kallbearbetning, bearbetning av metall (62.1) @sv
alternative label: Karkaisu, metallin työstö (62.1)
alternative label: Katkaisu, metallin työstö (62.1)
alternative label: Kylmäkäsittely, metallin työstö (62.1)
alternative label: Lastuava työstö, metalli (62.1)
alternative label: Leikkaus, metallin työstö (62.1)
alternative label: Lämpökäsittely, metallin työstö (62.1)
alternative label: Lödning, bearbetning av metall (62.1) @sv
alternative label: Mekaaninen teknologia (62.1)
alternative label: Mekaaninen teknologia, metalliteollisuus (62.1)
alternative label: Mekanisk teknologi (62.1) @sv
alternative label: Mekanisk teknologi, metallindustri (62.1) @sv
alternative label: Metallbearbetning (62.1) @sv
alternative label: Metallbearbetningsmaskiner (62.1) @sv
alternative label: Metallbearbetningsmetoder (62.1) @sv
alternative label: Metallbearbetningsverk (62.1) @sv
alternative label: Metaller, bearbetning, industriell (62.1) @sv
alternative label: Metallilangat, valmistus (62.1)
alternative label: Metallilevyt, valmistus (62.1)
alternative label: Metallin työstö (62.1)
alternative label: Metallindustri, halvfabrikat (62.1) @sv
alternative label: Metallintyöstökoneet (62.1)
alternative label: Metallintyöstölaitokset (62.1)
alternative label: Metallintyöstömenetelmät (62.1)
alternative label: Metalliputket, valmistus (62.1)
alternative label: Metallisering (62.1) @sv
alternative label: Metallit, työstö, teollinen (62.1)
alternative label: Metalliteollisuus, puolivalmisteet (62.1)
alternative label: Metallointi (62.1)
alternative label: Metallrör, tillverkning (62.1) @sv
alternative label: Metallskivor, tillverkning (62.1) @sv
alternative label: Metalltråd, tillverkning (62.1) @sv
alternative label: Pakotus, metallin teollinen työstö (62.1)
alternative label: Pintakäsittely, metallin työstö (62.1)
alternative label: Poraus, metallin työstö (62.1)
alternative label: Sahaus, metallin työstö (62.1)
alternative label: Skärning, bearbetning av metall (62.1) @sv
alternative label: Slipning, bearbetning av metall (62.1) @sv
alternative label: Smide, industriell bearbetning av metall (62.1) @sv
alternative label: Smidesteknik (62.1) @sv
alternative label: Sorvaus, metalliteollisuus (62.1)
alternative label: Spånskärande bearbetning, metall (62.1) @sv
alternative label: Svarvning, metallindustri (62.1) @sv
alternative label: Svetsning (62.1) @sv
alternative label: Sågning, bearbetning av metall (62.1) @sv
alternative label: Takomotekniikka (62.1)
alternative label: Taonta, metallin teollinen työstö (62.1)
alternative label: Tribologia, tekniikka (62.1)
alternative label: Työstö, metalli (62.1)
alternative label: Valimotekniikka (62.1)
alternative label: Valssaustekniikka, metalliteollisuus (62.1)
alternative label: Valumenetelmät, metalliteollisuus (62.1)
alternative label: Viilaus, metallin työstö (62.1)
broader: METALLITEOLLISUUS. KONETEKNIIKKA. LIIKENNEVÄLINEET SÄHKÖTEKNIIKKA
in scheme: YKL - Yleisten kirjastojen luokitusjärjestelmä
notation: 62.1
scope note: Hit allmänna verk om metoder, medel, produktionsanläggningar eller produkter inom området mekanisk teknik Halvfabrikat inom metallindustrin Metoder att bearbeta metaller, bearbetningsmaskiner, bearbetningsmedel och bearbetningsanläggningar Smedjor. Gjuterier. Valsverk Spånskärande och styckskärande bearbetning, formning och gjutning av metall Hyvling, slipning, fräsning och filning av metall Smide, valsning, varm- och kallbehandling, härdning, kapning, sågning och borrning av metall Svetsning och lödning av metall Ytbehandling av metall. Metallöverdrag Bearbetning och tillverkning av plåt, metallrör och metalltråd Mekanisk teknik inom specialområden klassificeras enligt område @sv
scope note: Tähän mekaanisen teknologian menetelmiä, välineitä, tuotantolaitoksia tai tuotteita koskevat yleisteokset Metalliteollisuuden puolivalmisteet Metallin työstö, työstömenetelmät, työstökoneet, työstövälineet ja työstölaitokset Takomot. Valimot. Valssaamot Metallin lastuava työstö, muovaus, leikkaus ja valu Metallin höyläys, hionta, jyrsintä ja viilaus Metallin taonta, valssaus, lämpö- ja kylmäkäsittely, karkaisu, katkaisu, sahaus ja poraus Metallin hitsaus ja juotto Metallin pintakäsittely. Metallointi Metallilevyjen, -putkien ja -lankojen työstö ja valmistus Erikoisalojen mekaaninen teknologia luokitetaan alan mukaan

Konetekniikka. Voitelutekniikka
type: Concept
References: Tekninen piirustus
References: Säätö- ja systeemitekniikka. Teollinen automaatio
References: METALLITEOLLISUUS. KONETEKNIIKKA. LIIKENNEVÄLINEET SÄHKÖTEKNIIKKA
References: Mekaaninen teknologia. Metallin työstö
References: Voimakoneet. Moottorit
References: Nosto- ja kuljetuslaitteet. Hydrauliikka
References: Liikennevälineet
type: YKL-luokka
alternative label: Asennustekniikka, koneet (62.2+)
alternative label: Fetter, smörjteknik (62.2+) @sv
alternative label: Installationsteknik, maskiner (62.2+) @sv
alternative label: Koneenasennus (62.2+)
alternative label: Koneenpiirustus (62.2+)
alternative label: Koneenrakennus (62.2+)
alternative label: Koneensuunnittelu (62.2+)
alternative label: Koneet (62.2+)
alternative label: Koneet, korjaus (62.2+)
alternative label: Koneoppi (62.2+)
alternative label: Konetekniikka (62.2+)
alternative label: Konetekninen automaatio (62.2+)
alternative label: Koneteollisuus (62.2+)
alternative label: Konstruktion, maskinbyggnad (62.2+) @sv
alternative label: Konstruointi, koneenrakennus (62.2+)
alternative label: Maskinbyggnad (62.2+) @sv
alternative label: Maskiner (62.2+) @sv
alternative label: Maskiner, reparation (62.2+) @sv
alternative label: Maskinindustri (62.2+) @sv
alternative label: Maskinlära (62.2+) @sv
alternative label: Maskinmontering (62.2+) @sv
alternative label: Maskinplanering (62.2+) @sv
alternative label: Maskinritning (62.2+) @sv
alternative label: Maskinteknik (62.2+) @sv
alternative label: Maskinteknisk automation (62.2+) @sv
alternative label: Piirustus, konetekniikka (62.2+)
alternative label: Rasvat, voitelutekniikka (62.2+)
alternative label: Ritning, maskinteknik (62.2+) @sv
alternative label: Smörjmedel, maskinunderhåll (62.2+) @sv
alternative label: Smörjteknik (62.2+) @sv
alternative label: Voiteluaineet, koneiden kunnossapito (62.2+)
alternative label: Voitelutekniikka (62.2+)
broader: METALLITEOLLISUUS. KONETEKNIIKKA. LIIKENNEVÄLINEET SÄHKÖTEKNIIKKA
in scheme: YKL - Yleisten kirjastojen luokitusjärjestelmä
narrower: Kone-elimet. Koneen osat
narrower: Paineilmatekniikka. Tyhjötekniikka. Kylmätekniikka
notation: 62.2
preferred label: Machine technology Lubrication technology @en
preferred label: Maskinteknik. Smörjteknik @sv
scope note: Hit och till underklasserna allmän maskin- och smörjteknik Maskiner och maskinritning i allmänhet Konstruktion, tillverkning, montering, service, underhåll och reparation av maskiner i allmänhet Maskiner och apparater för specialområden samt konstruktion och tillverkning av sådana maskiner och apparater klassificeras enligt område @sv
scope note: Tähän ja alaluokkiin yleinen kone- ja voitelutekniikka Koneet, koneenpiirustus, koneiden suunnittelu, rakentaminen, teollinen valmistus, asennus, huolto, kunnossapito ja korjaus yleensä Erikoisalojen koneet ja laitteet sekä niiden suunnittelu, rakentaminen ja teollinen valmistus luokitetaan alan mukaan

Kone-elimet. Koneen osat
type: Concept
References: Aineoppi. Aineenkoetus. Tekninen mekaniikka
References: Säätö- ja systeemitekniikka. Teollinen automaatio
type: YKL-luokka
alternative label: Akselit (62.21)
alternative label: Axlar (62.21) @sv
alternative label: Bromsar (62.21) @sv
alternative label: Cylindrar (62.21) @sv
alternative label: Delningselement, maskinteknik (62.21) @sv
alternative label: Fjädrar (62.21) @sv
alternative label: Fästningsapparater, maskindelar (62.21) @sv
alternative label: Hammaspyörät (62.21)
alternative label: Hihnat, koneen osat (62.21)
alternative label: Hjul, maskindelar (62.21) @sv
alternative label: Hävstångar (62.21) @sv
alternative label: Jakoelimet, konetekniikka (62.21)
alternative label: Jarrut (62.21)
alternative label: Johteet, koneen osat (62.21)
alternative label: Jouset (62.21)
alternative label: Kammar, maskindelar (62.21) @sv
alternative label: Kampiakselit (62.21)
alternative label: Kiinnityslaitteet, koneen osat (62.21)
alternative label: Kolvar (62.21) @sv
alternative label: Kone-elimet (62.21)
alternative label: Koneenelinoppi (62.21)
alternative label: Koneet, osat ja rakenne (62.21)
alternative label: Kopplingar (62.21) @sv
alternative label: Koukut, koneen osat (62.21)
alternative label: Kraftöverföring, maskindelar (62.21) @sv
alternative label: Krokar, maskindelar (62.21) @sv
alternative label: Kugghjul (62.21) @sv
alternative label: Kytkimet (62.21)
alternative label: Laakerit (62.21)
alternative label: Lager, maskinkomponenter (62.21) @sv
alternative label: Ledare, maskindelar (62.21) @sv
alternative label: Liike-elimet, koneen osat (62.21)
alternative label: Maskinelementlära (62.21) @sv
alternative label: Maskiner, delar och konstruktion (62.21) @sv
alternative label: Maskinkomponenter (62.21) @sv
alternative label: Mutterit (62.21)
alternative label: Muttrar (62.21) @sv
alternative label: Männät (62.21)
alternative label: Nastat (62.21)
alternative label: Naulat (62.21)
alternative label: Niitit (62.21)
alternative label: Nitar (62.21) @sv
alternative label: Nokat, koneen osat (62.21)
alternative label: Pliggar, maskindelar (62.21) @sv
alternative label: Pyörät, koneen osat (62.21)
alternative label: Ramar, maskindelar (62.21) @sv
alternative label: Remmar, maskindelar (62.21) @sv
alternative label: Rummut, koneen osat (62.21)
alternative label: Rungot, koneen osat (62.21)
alternative label: Ruuvit (62.21)
alternative label: Rörliga element, maskindelar (62.21) @sv
alternative label: Skruvar (62.21) @sv
alternative label: Spikar (62.21) @sv
alternative label: Svänghjul (62.21) @sv
alternative label: Sylinterit (62.21)
alternative label: Tapit, koneen osat (62.21)
alternative label: Tappar, maskindelar (62.21) @sv
alternative label: Trummor, maskindelar (62.21) @sv
alternative label: Vaihteet (62.21)
alternative label: Vauhtipyörät (62.21)
alternative label: Vevaxlar (62.21) @sv
alternative label: Vivut (62.21)
alternative label: Voimansiirtolaitteet, koneen osat (62.21)
alternative label: Växlar, teknik (62.21) @sv
broader: Konetekniikka. Voitelutekniikka
in scheme: YKL - Yleisten kirjastojen luokitusjärjestelmä
notation: 62.21
preferred label: Machine elements. Machine parts @en
preferred label: Maskinkomponenter. Maskindelar @sv
scope note: Hit allmänna verk om maskinkomponenter eller maskindelar Maskindelarnas teknik och tillverkning av dem Fasta delar. Rörliga delar. Kraftöverföringsutrustning Fästanordningar Maskinkomponenter för en viss maskin eller apparat förs till den ifrågavarande maskinens eller apparatens klass @sv
scope note: Tähän kone-elimiä tai koneen osia koskevat yleisteokset Koneen osien tekniikka ja valmistus Kiinteät osat. Liike-elimet. Voimansiirtolaitteet Kiinnityslaitteet Tietyn koneen tai laitteen osat ja kone-elimet luokitetaan ko. koneen tai laitteen luokkaan

Paineilmatekniikka. Tyhjötekniikka. Kylmätekniikka
type: Concept
References: Mekaniikka
References: Lämpöoppi
References: Mekaaninen teknologia. Metallin työstö
References: Säilöntä
type: YKL-luokka
alternative label: Frysar, livsmedelsindustri (62.22) @sv
alternative label: Frysteknik (62.22) @sv
alternative label: Förvaringsutrustning, kylteknik (62.22) @sv
alternative label: Hushållsmaskinindustri, kylskåp och frysar (62.22) @sv
alternative label: Ilmapumput (62.22)
alternative label: Jäähdytyskoneet (62.22)
alternative label: Jäähdytystekniikka (62.22)
alternative label: Jääkaapit, kylmätekniikka (62.22)
alternative label: Kodinkoneteollisuus, jääkaapit ja pakastimet (62.22)
alternative label: Kompressorer (62.22) @sv
alternative label: Kompressorit (62.22)
alternative label: Kotitalouskoneteollisuus, jääkaapit ja pakastimet (62.22)
alternative label: Kylmaskiner (62.22) @sv
alternative label: Kylmiöt, kylmätekniikka (62.22)
alternative label: Kylmätekniikka (62.22)
alternative label: Kylrum, kylteknik (62.22) @sv
alternative label: Kylskåp, kylteknik (62.22) @sv
alternative label: Kylteknik (62.22) @sv
alternative label: Luftpumpar (62.22) @sv
alternative label: Lämpöpumput (62.22)
alternative label: Paineilmamoottorit (62.22)
alternative label: Paineilmatekniikka (62.22)
alternative label: Paineilmatyökalut (62.22)
alternative label: Pakastimet, kylmätekniikka (62.22)
alternative label: Pneumaattiset koneet (62.22)
alternative label: Pneumatiikka, paineilmatekniikka (62.22)
alternative label: Pneumatik, tryckluftsteknik (62.22) @sv
alternative label: Pneumatiska maskiner (62.22) @sv
alternative label: Säilytyslaitteet, kylmätekniikka (62.22)
alternative label: Tryckluftsmotorer (62.22) @sv
alternative label: Tryckluftsredskap (62.22) @sv
alternative label: Tryckluftsteknik (62.22) @sv
alternative label: Tyhjöpumput (62.22)
alternative label: Tyhjötekniikka (62.22)
alternative label: Vakuumpumpar (62.22) @sv
alternative label: Vakuumteknik (62.22) @sv
alternative label: Värmepumpar (62.22) @sv
broader: Konetekniikka. Voitelutekniikka
in scheme: YKL - Yleisten kirjastojen luokitusjärjestelmä
notation: 62.22
preferred label: Pneumatic engineering. Vacuum engineering. Refrigeration engineering @en
preferred label: Tryckluftsteknik. Vakuumteknik. Köldteknik @sv
scope note: Pneumatiikka. Pneumaattiset koneet ja laitteet sekä niiden tekniikka ja valmistus yleensä Kompressorit. Tyhjöpumput. Ilmapumput. Lämpöpumput Paineilmamoottorit ja -työkalut Jäähdytystekniikka. Jäähdytyskoneet Jääkaapit. Pakastimet
scope note: Pneumatik. Pneumatiska maskiner och apparater samt deras teknik och tillverkning av dem i allmänhet Kompressorer. Vakuumpumpar. Luftpumpar. Värmepumpar Tryckluftsmotorer och tryckluftsredskap Kylteknik. Kylmaskiner Kylskåp. Frysar @sv

Voimakoneet. Moottorit
type: Concept
References: Kone-elimet. Koneen osat
References: Paineilmatekniikka. Tyhjötekniikka. Kylmätekniikka
References: Nosto- ja kuljetuslaitteet. Hydrauliikka
References: Liikennevälineet
References: Sähköenergian muuttaminen, muuntaminen, jakelu ja siirto
type: YKL-luokka
alternative label: Bensiinimoottorit (62.3)
alternative label: Bensinmotorer (62.3) @sv
alternative label: Dieselmoottorit (62.3)
alternative label: Dieselmotorer (62.3) @sv
alternative label: Förbränningsmotorer (62.3) @sv
alternative label: Gasmotorer (62.3) @sv
alternative label: Gasturbiner (62.3) @sv
alternative label: Hydrauliset koneet (62.3)
alternative label: Hydrauliset moottorit (62.3)
alternative label: Hydrauliset turpiinit (62.3)
alternative label: Hydrauliska maskiner (62.3) @sv
alternative label: Hydrauliska motorer (62.3) @sv
alternative label: Hydrauliska turbiner (62.3) @sv
alternative label: Höyrykattilat (62.3)
alternative label: Höyrykoneet (62.3)
alternative label: Höyrymoottorit (62.3)
alternative label: Höyryturpiinit (62.3)
alternative label: Jetmotorer (62.3) @sv
alternative label: Kaasumoottorit (62.3)
alternative label: Kaasuturpiinit (62.3)
alternative label: Lämpövoimakoneet (62.3)
alternative label: Moottorit (62.3)
alternative label: Moottoritekniikka (62.3)
alternative label: Motorer (62.3) @sv
alternative label: Motorteknik (62.3) @sv
alternative label: Painekattilat, höyrykattilat (62.3)
alternative label: Polttomoottorit (62.3)
alternative label: Primärmotorer (62.3) @sv
alternative label: Reaktiomoottorit (62.3)
alternative label: Reaktionsmotorer (62.3) @sv
alternative label: Suihkumoottorit (62.3)
alternative label: Tryckkokare, ångkokare (62.3) @sv
alternative label: Turbiner (62.3) @sv
alternative label: Turpiinit (62.3)
alternative label: Tuulimoottorit (62.3)
alternative label: Vattenmotorer (62.3) @sv
alternative label: Vattenturbiner (62.3) @sv
alternative label: Vesiturpiinit (62.3)
alternative label: Vesivoimakoneet (62.3)
alternative label: Vindmotorer (62.3) @sv
alternative label: Voimakoneet (62.3)
alternative label: Värmekraftmaskiner (62.3) @sv
alternative label: Ångmaskiner (62.3) @sv
alternative label: Ångmotorer (62.3) @sv
alternative label: Ångpannor (62.3) @sv
alternative label: Ångturbiner (62.3) @sv
broader: METALLITEOLLISUUS. KONETEKNIIKKA. LIIKENNEVÄLINEET SÄHKÖTEKNIIKKA
in scheme: YKL - Yleisten kirjastojen luokitusjärjestelmä
notation: 62.3
preferred label: Kraftmaskiner. Motorer @sv
preferred label: Prime movers. Motors @en
scope note: Kraftmaskiner och motorer samt deras teknik och tillverkning av dem i allmänhet Ångmaskiner. Ångmotorer. Ångpannor. Ångturbiner Hydrauliska maskiner, motorer och turbiner Vattenkraftmaskiner. Värmekraftmaskiner Förbränningsmotorer. Dieselmotorer Gasmotorer. Gasturbiner Vindmotorer. Reaktionsmotorer. Jetmotorer Tillämpningar av kraftmaskiner, motorer och motorteknik på olika områden klassificeras enligt område @sv
scope note: Voimakoneet ja moottorit sekä niiden tekniikka ja valmistus yleensä Höyrykoneet. Höyrymoottorit. Höyrykattilat. Höyryturpiinit Hydrauliset koneet, moottorit ja turpiinit Vesivoimakoneet. Lämpövoimakoneet Polttomoottorit. Dieselmoottorit Kaasumoottorit. Kaasuturpiinit Tuulimoottorit. Reaktiomoottorit. Suihkumoottorit Voimakoneiden, moottoreiden ja moottoritekniikan sovellukset eri aloille luokitetaan alan mukaan

Nosto- ja kuljetuslaitteet. Hydrauliikka
type: Concept
References: Paineilmatekniikka. Tyhjötekniikka. Kylmätekniikka
References: Voimakoneet. Moottorit
References: Materiaalitoiminnot
alternative label: Behållare (62.4) @sv
alternative label: Cisterner (62.4) @sv
alternative label: Containrar (62.4) @sv
alternative label: Förvaringsutrustning (62.4) @sv
alternative label: Gasbehållare (62.4) @sv
alternative label: Gasrör (62.4) @sv
alternative label: Grävmaskiner (62.4) @sv
alternative label: Hiihtohissit (62.4)
alternative label: Hissar (62.4) @sv
alternative label: Hissit (62.4)
alternative label: Hydrauliikka (62.4)
alternative label: Hydraulik (62.4) @sv
alternative label: Hydrauliset nostolaitteet (62.4)
alternative label: Hydrauliska lyftanordningar (62.4) @sv
alternative label: Jordbyggnadsmaskiner (62.4) @sv
alternative label: Jyrät (62.4)
alternative label: Kaasuputket (62.4)
alternative label: Kaasusäiliöt (62.4)
alternative label: Kaivinkoneet (62.4)
alternative label: Kontit (62.4)
alternative label: Kuljetuslaitteet (62.4)
alternative label: Kuljetussäiliöt (62.4)
alternative label: Köysiradat (62.4)
alternative label: Lagringsbehållare (62.4) @sv
alternative label: Linbanor (62.4) @sv
alternative label: Liukuhihnat (62.4)
alternative label: Liukuportaat (62.4)
alternative label: Lyftanordningar (62.4) @sv
alternative label: Lyftkranar (62.4) @sv
alternative label: Löpande band (62.4) @sv
alternative label: Maakaasuputket, tekniikka (62.4)
alternative label: Maanrakennuskoneet (62.4)
alternative label: Maansiirtokoneet, tekniikka ja teollisuus (62.4)
alternative label: Maarakennuskoneet (62.4)
alternative label: Mudderverk (62.4) @sv
alternative label: Naturgasrör, teknik (62.4) @sv
alternative label: Nestesäiliöt (62.4)
alternative label: Nostolaitteet (62.4)
alternative label: Nosturit (62.4)
alternative label: Oljecisterner, teknik (62.4) @sv
alternative label: Oljerör, teknik (62.4) @sv
alternative label: Pumpar (62.4) @sv
alternative label: Pumpputekniikka (62.4)
alternative label: Pumpteknik (62.4) @sv
alternative label: Pumput (62.4)
alternative label: Putket (62.4)
alternative label: Rulltrappor (62.4) @sv
alternative label: Ruoppaajat (62.4)
alternative label: Rör (62.4) @sv
alternative label: Schaktningsmaskiner, teknik och industri (62.4) @sv
alternative label: Siirtolaitteet, nosto- ja kuljetuslaitteet (62.4)
alternative label: Skidliftar (62.4) @sv
alternative label: Säiliöt (62.4)
alternative label: Säilytyslaitteet (62.4)
alternative label: Taljat, nostolaitteet (62.4)
alternative label: Taljor, lyftanordningar (62.4) @sv
alternative label: Tasauskoneet (62.4)
alternative label: Transportanordningar (62.4) @sv
alternative label: Transportbehållare (62.4) @sv
alternative label: Transportörer, lyft- och transportanordningar (62.4) @sv
alternative label: Truckar (62.4) @sv
alternative label: Trukit (62.4)
alternative label: Utjämningsmaskiner (62.4) @sv
alternative label: Varastointisäiliöt (62.4)
alternative label: Vindspel (62.4) @sv
alternative label: Vintturit (62.4)
alternative label: Vältar (62.4) @sv
alternative label: Öljyputket, tekniikka (62.4)
alternative label: Öljysäiliöt, tekniikka (62.4)
broader: METALLITEOLLISUUS. KONETEKNIIKKA. LIIKENNEVÄLINEET SÄHKÖTEKNIIKKA
in scheme: YKL - Yleisten kirjastojen luokitusjärjestelmä
notation: 62.4
preferred label: Lifting and transport equipment. Hydraulics @en
preferred label: Lyft- och transportanläggningar. Hydraulik @sv
scope note: Hit lyft-, transport- och förvaringsanläggningar för fasta ämnen, vätskor och gaser samt anläggningarnas teknik och tillverkningen av dem Lyftkranar. Hissar. Skidliftar. Linbanor Rulltrappor. Löpande band. Taljor. Vinschar Truckar. Grävmaskiner. Mudderverk. Vältar. Schaktningsmaskiner. Jordbyggnadsmaskiner Transportcisterner. Containrar. Lagercisterner Gas- och vätsketankar och gas- och vätskerör Pumpar och pumpteknik i allmänhet @sv
scope note: Tähän kiinteiden aineiden, nesteiden ja kaasujen nosto-, kuljetus- ja säilytyslaitteet sekä niiden tekniikka ja valmistus Nosturit. Hissit. Hiihtohissit. Köysiradat Liukuportaat. Liukuhihnat. Taljat. Vintturit Trukit. Kaivinkoneet. Ruoppaajat. Tasaus- ja maansiirtokoneet. Maarakennuskoneet Kuljetussäiliöt. Kontit. Varastointisäiliöt Kaasu- ja nestesäiliöt ja -putket Pumput ja pumpputekniikka yleensä

Liikennevälineet
type: Concept
References: Liikennelainsäädäntö
References: Liikennesuunnittelu
References: KANSATIEDE. KULTTUURIANTROPOLOGIA
References: Tienrakennus
References: Vesirakennus
References: Liikenne
type: YKL-luokka
alternative label: Ajo-ominaisuudet, liikennevälineet (62.5+)
alternative label: Barnvagnar (62.5) @sv
alternative label: Färdmedel (62.5+) @sv
alternative label: Hevosajoneuvot (62.5)
alternative label: Hästfordon (62.5) @sv
alternative label: Joukkoliikenne, liikennevälineet (62.5+)
alternative label: Julkinen liikenne, liikennevälineet (62.5+)
alternative label: Kelkat (62.5)
alternative label: Kollektivtrafik, trafikmedel (62.5+) @sv
alternative label: Kulkuneuvot (62.5+)
alternative label: Kälkar (62.5) @sv
alternative label: Kärror (62.5) @sv
alternative label: Köregenskaper, fordon (62.5+) @sv
alternative label: Landsvägsfordon (62.5+) @sv
alternative label: Landtrafikmedel (62.5+) @sv
alternative label: Lastenvaunut (62.5)
alternative label: Liikennevälineet (62.5+)
alternative label: Maakulkuneuvot (62.5+)
alternative label: Maaliikennevälineet (62.5+)
alternative label: Miehittämättömät ajoneuvot (62.5+)
alternative label: Obemannade fordon (62.5+) @sv
alternative label: Polkuautot (62.5)
alternative label: Pulkat (62.5)
alternative label: Pulkor (62.5) @sv
alternative label: Rattaat (62.5)
alternative label: Reet (62.5)
alternative label: Slädar (62.5) @sv
alternative label: Trafikmedel (62.5+) @sv
alternative label: Trampbilar (62.5) @sv
alternative label: Vagnar (62.5) @sv
alternative label: Vagnar, dragna av hästar (62.5) @sv
alternative label: Vankkurit (62.5)
alternative label: Vaunut, hevosten vetämät (62.5)
broader: METALLITEOLLISUUS. KONETEKNIIKKA. LIIKENNEVÄLINEET SÄHKÖTEKNIIKKA
in scheme: YKL - Yleisten kirjastojen luokitusjärjestelmä
narrower: Moottoriajoneuvot
narrower: Junat. Raitiovaunut. Metrovaunut
narrower: Polkupyörät
narrower: Vesikulkuneuvot
narrower: Ilmakulkuneuvot
narrower: Avaruusalukset. Avaruusteknologia
narrower: Liikennevälineiden pienoismallit
notation: 62.5
preferred label: Trafikmedel @sv
preferred label: Vehicles @en
scope note: Hit och till underklasserna trafikmedel, trafikmedlens teknik, konstruktion av trafikmedel samt handel och industri som rör trafikmedel Hit också landtrafikmedel som inte är motordrivna, t.ex. arbetsvagnar, vagnar, kärror, barnvagnar, trampbilar, kälkar och slädar Cyklar 62.53 Om verket behandlar både trafikmedel och trafik, ges företräde åt klass 69.6+ @sv
scope note: Tähän ja alaluokkiin liikennevälineet sekä niiden suunnittelu, tekniikka, teollisuus ja kauppa Tähän myös maaliikennevälineet, jotka eivät ole moottorikäyttöisiä, esim. vankkurit, vaunut, rattaat, lastenvaunut, polkuautot, kelkat ja reet Polkupyörät 62.53 Jos teos koskee sekä liikennevälineitä että liikennettä, annetaan etusija luokalle 69.6+

Moottoriajoneuvot
type: Concept
References: Liikennevälineiden pienoismallit
References: Tienrakennus
References: MAA- JA METSÄTALOUS. ELINTARVIKETEOLLISUUS. BIOTEKNIIKKA
References: Maaliikenne
References: Lentourheilu. Moottoriurheilu
type: YKL-luokka
alternative label: Ajoneuvot (62.51+)
alternative label: Fordon (62.51+) @sv
alternative label: Jordbruksmaskiner. teknik och industri (62.51) @sv
alternative label: Lantbruksmaskiner, teknik och industri (62.51) @sv
alternative label: Maanviljelyskoneet, tekniikka ja teollisuus (62.51)
alternative label: Maatalouskoneet, tekniikka ja teollisuus (62.51)
alternative label: Metsätalouskoneet, tekniikka ja teollisuus (62.51)
alternative label: Moottoriajoneuvot (62.51+)
alternative label: Motorfordon (62.51+) @sv
alternative label: Skogsbruksmaskiner, teknik och industri (62.51) @sv
alternative label: Traktorer, teknik och industri (62.51) @sv
alternative label: Traktorit, tekniikka ja teollisuus (62.51)
broader: Liikennevälineet
in scheme: YKL - Yleisten kirjastojen luokitusjärjestelmä
narrower: Autot
narrower: Moottoripyörät. Mopedit. Moottorikelkat. Mönkijät
notation: 62.51
preferred label: Motor vehicles @en
preferred label: Motorfordon @sv
scope note: Hit och till underklasserna motorfordon och deras teknik samt handel och industri som rör motorfordon Hit också formgivning, service och reparation av motorfordon Hit också traktorer samt lant- och skogsbruksmaskiner ur industriell och teknisk synvinkel Om verket handlar om både motorfordon och landtrafik, ges företräde åt klass 69.62 @sv
scope note: Tähän ja alaluokkiin moottoriajoneuvot sekä niiden suunnittelu, tekniikka, huolto, korjaus, teollisuus ja kauppa Tähän myös traktorit sekä maa- ja metsätalouskoneet teollisuuden ja tekniikan kannalta Jos teos koskee sekä moottoriajoneuvoja että maaliikennettä, annetaan etusija luokalle 69.62

Autot
type: Concept
References: Kirjastonhoito. Kirjastotekniikka
References: Vakuutuslainsäädäntö
References: Liikennelainsäädäntö
References: Liikennesuunnittelu
References: Palo- ja pelastustoimi
References: Tapaturmantorjunta. Ensiapu
References: Orgaaniset ja fossiiliset polttoaineet
References: Matkaviestinpalvelut. Puhelinliikenne
References: Äänitekniikka. Radiotekniikka
References: Liikennevälineiden pienoismallit
References: Tienrakennus
References: Markkinointi. Kauppa
References: Maaliikenne
References: Autourheilu
alternative label: Akselit, autotekniikka (62.511+)
alternative label: Akut, autotekniikka (62.511+)
alternative label: Ambulanser, bilteknik (62.511+) @sv
alternative label: Ambulanssit, autotekniikka (62.511+)
alternative label: Amfibiebilar (62.511+) @sv
alternative label: Amfibioautot (62.511+)
alternative label: Asennustekniikka, autot (62.511+)
alternative label: Asuntovaunut (62.511+)
alternative label: Autokauppa (62.511+)
alternative label: Autonasennus (62.511+)
alternative label: Autot (62.511+)
alternative label: Autot, ajo-ominaisuudet (62.511+)
alternative label: Autot, huolto, viat ja korjaus (62.511+)
alternative label: Autot, kauppa (62.511+)
alternative label: Autot, kori, sisustus ja varustelu (62.511+)
alternative label: Autot, moottori (62.511+)
alternative label: Autot, tekniikka ja teollisuus (62.511+)
alternative label: Axlar, bilteknik (62.511+) @sv
alternative label: Batterier, bilteknik (62.511+) @sv
alternative label: Bilar (62.511+) @sv
alternative label: Bilar, handel (62.511+) @sv
alternative label: Bilar, karosseri, inredning och utrustning (62.511+) @sv
alternative label: Bilar, köregenskaper (62.511+) @sv
alternative label: Bilar, motor (62.511+) @sv
alternative label: Bilar, service, fel och reparation (62.511+) @sv
alternative label: Bilar, teknik och industri (62.511+) @sv
alternative label: Bilhandel (62.511+) @sv
alternative label: Bilmontering (62.511+) @sv
alternative label: Bokbussar, bilteknik (62.511+) @sv
alternative label: Bussit (62.511+)
alternative label: Dieselautot (62.511+)
alternative label: Henkilöautot (62.511+)
alternative label: Hot rod (62.511+)
alternative label: Jarrut, autot (62.511+)
alternative label: Johdinautot (62.511+)
alternative label: Jouset, autotekniikka (62.511+)
alternative label: Kampiakselit, autotekniikka (62.511+)
alternative label: Katalysaattorit, autotekniikka (62.511+)
alternative label: Kilpa-autot (62.511+)
alternative label: Kirjastoautot, autotekniikka (62.511+)
alternative label: Kojelaudat, autot (62.511+)
alternative label: Kuorma-autot (62.511+)
alternative label: Kytkimet, autotekniikka (62.511+)
alternative label: Linja-autot (62.511+)
alternative label: Matkailuperävaunut (62.511+)
alternative label: Mikroautot (62.511+)
alternative label: Mopoautot (62.511+)
alternative label: Myymäläautot, autotekniikka (62.511+)
alternative label: Pakettiautot (62.511+)
alternative label: Paloautot, autotekniikka (62.511+)
alternative label: Perävaunut, autot (62.511+)
alternative label: Poliisiautot, autotekniikka (62.511+)
alternative label: Pyörät, autot (62.511+)
alternative label: Rekka-autot (62.511+)
alternative label: Sähköautot (62.511+)
alternative label: Säiliöautot (62.511+)
alternative label: Turvaistuimet (62.511+)
alternative label: Turvavyöt, autot, tekniikka (62.511+)
alternative label: Vaihteet, autotekniikka (62.511+)
broader: Moottoriajoneuvot
in scheme: YKL - Yleisten kirjastojen luokitusjärjestelmä
narrower: Yksittäiset automerkit ja -mallit
notation: 62.511
scope note: Autotekniikka. Autoteollisuus. Autokauppa Autojen suunnittelu. Autojen ajo-ominaisuudet Autonasennus. Autojen huolto, viat, korjaus ja varaosat Auton rakenne ja osat. Auton moottori ja sen osat Turvaistuimet. Turvavyöt Henkilöautot. Asunto- ja perävaunut. Linja-autot Pakettiautot. Kuorma-autot. Rekka-autot. Säiliöautot Kilpa-autot. Mikroautot. Sähköautot Tähän myös esim. ambulanssit sekä palo-, poliisi-, myymälä- ja kirjastoautot tekniikan ja teollisuuden kannalta Jos teos koskee sekä autoja että autoliikennettä, annetaan etusija luokalle 69.62 Jos teos koskee sekä autoja että autourheilua, annetaan etusija luokalle 79.52
scope note: Bilteknik. Bilindustri. Bilhandel Formgivning av bilar. Köregenskaper hos bilar Bilmontering. Service, fel, reparationer och reservdelar Hur bilar är konstruerade. Bildelar. Bilmotorn och dess delar Bilstolar. Bilbälten Personbilar. Hus- och släpvagnar. Bussar Paketbilar. Lastbilar. Långtradare. Tankbilar Tävlingsbilar. Go-karter. Elbilar Hit också t.ex. ambulansen samt brand-, polis- och butiksbilar och bokbussar ur teknisk och industriell synvinkel Om verket handlar om både bilar och biltrafik, ges företräde åt klass 69.62 Om verket handlar om både bilar och bilsport, ges företräde åt klass 79.52 @sv

Yksittäiset automerkit ja -mallit
type: Concept
References: Liikennevälineiden pienoismallit
type: YKL-luokka
alternative label: Automallit, yksittäiset (62.5112)
alternative label: Automerkit, yksittäiset (62.5112)
alternative label: Bilmodeller, enskilda (62.5112) @sv
alternative label: Bilmärken, enskilda (62.5112) @sv
broader: Autot
in scheme: YKL - Yleisten kirjastojen luokitusjärjestelmä
notation: 62.5112
preferred label: Enskilda bilmärken och bilmodeller @sv
preferred label: Individual car makes and models @en
scope note: Hit verk som behandlar enbart några speciella bilmärken eller några speciella bilmodeller Hit också reparationshandböcker och -guider för enskilda bilmärken och bilmodeller @sv
scope note: Tähän teokset, jotka koskevat vain tiettyjä automerkkejä tai -malleja Tähän tiettyjä automerkkiä tai -malleja koskevat korjauskäsikirjat ja -oppaat

Moottoripyörät. Mopedit. Moottorikelkat. Mönkijät
type: Concept
References: Liikennelainsäädäntö
References: Maaliikenne
References: Moottoripyöräurheilu
type: YKL-luokka
alternative label: Hjul, motorcyklar (62.512) @sv
alternative label: Kelkat, moottorikelkat (62.512)
alternative label: Moottorikelkat (62.512)
alternative label: Moottoripyörät (62.512)
alternative label: Moottoripyörät, ajo-ominaisuudet (62.512)
alternative label: Moottoripyörät, huolto, viat ja korjaus (62.512)
alternative label: Moottoripyörät, mallit ja merkit (62.512)
alternative label: Moottoripyörät, tekniikka ja teollisuus (62.512)
alternative label: Mopeder (62.512) @sv
alternative label: Mopedit (62.512)
alternative label: Mopot (62.512)
alternative label: Motocross-pyörät (62.512)
alternative label: Motocrosscyklar (62.512) @sv
alternative label: Motorcyklar (62.512) @sv
alternative label: Motorcyklar, köregenskaper (62.512) @sv
alternative label: Motorcyklar, modeller och märken (62.512) @sv
alternative label: Motorcyklar, service, fel och reparation (62.512) @sv
alternative label: Motorcyklar, teknik och industri (62.512) @sv
alternative label: Mönkijät (62.512)
alternative label: Pyörät, moottoripyörät (62.512)
alternative label: Sidovagnar, motorcyklar (62.512) @sv
alternative label: Sivuvaunut, moottoripyörät (62.512)
alternative label: Skootterit (62.512)
alternative label: Skotrar (62.512) @sv
alternative label: Snöskotrar (62.512) @sv
alternative label: Speedway-pyörät (62.512)
alternative label: Speedwaycyklar (62.512) @sv
alternative label: Terränghjulingar (62.512) @sv
alternative label: Trial-pyörät (62.512)
alternative label: Trialcyklar (62.512) @sv
broader: Moottoriajoneuvot
in scheme: YKL - Yleisten kirjastojen luokitusjärjestelmä
notation: 62.512
preferred label: Motorcycles. Mopeds. Snowmobiles. All-terrain vehicles @en
preferred label: Motorcyklar. Mopeder. Snöskotrar. Terränghjulingar @sv
scope note: Formgivning, teknik, konstruktion och delar, montering, service, fel, reparationer, reservdelar, köregenskaper, utrustning, industri, handel, märken och modeller av motorcyklar, mopeder, snöskotrar och terränghjulingar Hit också t.ex. trial- och motocrosscyklar, skotrar samt sido- och släpvagnar till motorcyklar Om verket behandlar både motorcyklar eller mopeder och trafik, ges företräde åt klass 69.62 Om verket behandlar både motorcyklar och motorsport, ges företräde åt klass 79.53 @sv
scope note: Moottoripyörien, mopedien, moottorikelkkojen ja mönkijöiden suunnittelu, tekniikka, rakenne ja osat, asennus, huolto, viat, korjaus, varaosat, ajo-ominaisuudet, varustelu, teollisuus, kauppa, merkit ja mallit Tähän myös esim. trial- ja motocross-pyörät, skootterit sekä moottoripyörien sivu- ja perävaunut Jos teos koskee sekä moottoripyöriä tai mopedeja että liikennettä, annetaan etusija luokalle 69.62 Jos teos koskee sekä moottoripyöriä että moottoripyöräurheilua, annetaan etusija luokalle 79.53

Junat. Raitiovaunut. Metrovaunut
type: Concept
References: Liikennelainsäädäntö
References: Liikennesuunnittelu
References: Liikennevälineiden pienoismallit
References: Tienrakennus
References: Maaliikenne
References: Rakennukset. Rakennustyypit
type: YKL-luokka
alternative label: Dieseljunat (62.52)
alternative label: Diesellokomotiv (62.52) @sv
alternative label: Dieseltåg (62.52) @sv
alternative label: Dieselveturit (62.52)
alternative label: Dressiner (62.52) @sv
alternative label: Ellok (62.52) @sv
alternative label: Eltåg (62.52) @sv
alternative label: Godsvagnar (62.52) @sv
alternative label: Henkilövaunut, junat (62.52)
alternative label: Höyryveturit (62.52)
alternative label: Junat, tekniikka ja teollisuus (62.52)
alternative label: Lokomotiv (62.52) @sv
alternative label: Makuuvaunut (62.52)
alternative label: Metro, tekniikka (62.52)
alternative label: Metro, teknik (62.52) @sv
alternative label: Metrovagnar, teknik och industri (62.52) @sv
alternative label: Metrovaunut, tekniikka ja teollisuus (62.52)
alternative label: Personvagnar, tåg (62.52) @sv
alternative label: Raideliikennevälineet (62.52)
alternative label: Raitiovaunut, tekniikka ja teollisuus (62.52)
alternative label: Resiinat (62.52)
alternative label: Sovvagnar (62.52) @sv
alternative label: Spårbunden trafik, trafikmedel (62.52) @sv
alternative label: Spårvagnar, teknik och industri (62.52) @sv
alternative label: Sähköjunat (62.52)
alternative label: Sähköveturit (62.52)
alternative label: Tavaravaunut (62.52)
alternative label: Tåg, teknik och industri (62.52) @sv
alternative label: Vagnar, järnvägsvagnar (62.52) @sv
alternative label: Vagnar, metrovagnar (62.52) @sv
alternative label: Vagnar, spårvagnar (62.52) @sv
alternative label: Vaunut, junavaunut (62.52)
alternative label: Vaunut, metrovaunut (62.52)
alternative label: Vaunut, raitiovaunut (62.52)
alternative label: Veturit (62.52)
alternative label: Ånglokomotiv (62.52) @sv
broader: Liikennevälineet
in scheme: YKL - Yleisten kirjastojen luokitusjärjestelmä
notation: 62.52
preferred label: Trains. Trams. Subway cars @en
preferred label: Tåg. Spårvagnar. Metrovagnar @sv
scope note: Formgivning, teknik, konstruktion och delar, montering, service, fel, reparationer, reservdelar, utrustning, inredning, industri och modeller Ånglok. Diesellok. Ellok Person- och godsvagnar. Dressiner Om verket behandlar både tåg, spårvagnar eller metrovagnar och spårtrafik, ges företräde åt klass 69.62 @sv
scope note: Junien, raitiovaunujen ja metrovaunujen suunnittelu, tekniikka, rakenne ja osat, asennus, huolto, viat, korjaus, varaosat, varustelu, sisustus, teollisuus ja mallit Höyryveturit. Dieselveturit. Sähköveturit Henkilö- ja tavaravaunut. Resiinat Jos teos koskee sekä junia, raitiovaunuja tai metrovaunuja että raideliikennettä, annetaan etusija luokalle 69.62

Polkupyörät
type: Concept
References: Liikennelainsäädäntö
References: Liikennesuunnittelu
References: Maaliikenne
References: Pyöräily
References: Kuntoliikunta. Kuntourheilu
type: YKL-luokka
alternative label: Barncyklar (62.53) @sv
alternative label: Cyklar (62.53) @sv
alternative label: Cyklar, modeller och märken (62.53) @sv
alternative label: Cyklar, service, fel och reparationer (62.53) @sv
alternative label: Cyklar, teknik, industri och handel (62.53) @sv
alternative label: Hjul, cyklar (62.53) @sv
alternative label: Kilpapyörät (62.53)
alternative label: Kuntopyörät (62.53)
alternative label: Lastenpyörät (62.53)
alternative label: Långfärdscyklar (62.53) @sv
alternative label: Maastopyörät (62.53)
alternative label: Motionscyklar (62.53) @sv
alternative label: Polkupyörät (62.53)
alternative label: Polkupyörät, huolto, viat ja korjaus (62.53)
alternative label: Polkupyörät, mallit ja merkit (62.53)
alternative label: Polkupyörät, tekniikka, teollisuus ja kauppa (62.53)
alternative label: Pyörät, polkupyörät (62.53)
alternative label: Retkipyörät (62.53)
alternative label: Tandem-pyörät (62.53)
alternative label: Tandemcyklar (62.53) @sv
alternative label: Terrängcyklar (62.53) @sv
alternative label: Tävlingscyklar (62.53) @sv
broader: Liikennevälineet
in scheme: YKL - Yleisten kirjastojen luokitusjärjestelmä
notation: 62.53
preferred label: Bicycles @en
preferred label: Cyklar @sv
scope note: Konstruktion, teknik, delar, service, fel, reservdelar, köregenskaper, industri, handel, märken och modeller Långfärdscyklar. Tävlingscyklar. Terrängcyklar Barncyklar. Tandemcyklar. Motionscyklar Om verket behandlar både cyklar och trafik ges företräde åt klass 69.62 Om verket behandlar både cyklar och cykeltävlingar eller cykelutfärder, ges företräde åt klass 79.19 @sv
scope note: Polkupyörien suunnittelu, tekniikka, rakenne ja osat, huolto, viat, korjaus, varaosat, ajo-ominaisuudet, teollisuus, kauppa, merkit ja mallit Retkipyörät. Kilpapyörät. Maastopyörät Lastenpyörät. Tandem-pyörät. Kuntopyörät Jos teos koskee sekä polkupyöriä että liikennettä, annetaan etusija luokalle 69.62 Jos teos koskee sekä polkupyöriä että kilpapyöräilyä tai pyöräretkeilyä, annetaan etusija luokalle 79.19

Vesikulkuneuvot
type: Concept
References: Liikennelainsäädäntö
References: Liikennesuunnittelu
References: Merivoimat. Merisodankäynti
References: Tienrakennus
References: Vesirakennus
References: Vesiliikenne
References: Soutu. Melonta. Purjehdus
References: Moottoriveneurheilu
References: Yleinen arkeologia
type: YKL-luokka
alternative label: Farkoster (62.54+) @sv
alternative label: Master, farkoster (62.54+) @sv
alternative label: Mastot, vesikulkuneuvot (62.54+)
alternative label: Meriliikennevälineet (62.54+)
alternative label: Sjötrafikmedel (62.54+) @sv
alternative label: Vesikulkuneuvot (62.54+)
broader: Liikennevälineet
in scheme: YKL - Yleisten kirjastojen luokitusjärjestelmä
narrower: Laivat
narrower: Veneet
notation: 62.54
preferred label: Vattenfarkoster @sv
preferred label: Watercrafts @en
scope note: Hit och till underklasserna vattenfarkoster, deras teknik samt konstruktion och tillverkning av dem Om verket behandlar både vattenfarkoster och sjöfart ges företräde åt klass 69.63 Om verket behandlar både vattenfarkoster och sport ges företräde åt klasserna @sv
scope note: Tähän ja alaluokkiin vesikulkuneuvot sekä niiden suunnittelu, tekniikka ja rakentaminen Jos teos koskee sekä vesikulkuneuvoja että vesiliikennettä, annetaan etusija luokalle 69.63 Jos teos koskee sekä vesikulkuneuvoja että urheilua, annetaan etusija luokille 79.14 ja 79.55

Laivat
type: Concept
References: Liikennelainsäädäntö
References: Liikennesuunnittelu
References: Merivoimat. Merisodankäynti
References: Liikennevälineiden pienoismallit
References: Vesirakennus
References: Vesiliikenne
References: Yleinen arkeologia
alternative label: Asuntolaivat (62.542)
alternative label: Atomubåtar (62.542) @sv
alternative label: Autolautat (62.542)
alternative label: Bilfärjor (62.542) @sv
alternative label: Bogserbåtar (62.542) @sv
alternative label: Bärplansbåtar (62.542) @sv
alternative label: Fartyg (62.542) @sv
alternative label: Fartyg, service, fel och reparationer (62.542) @sv
alternative label: Fartyg, teknik och industri (62.542) @sv
alternative label: Fiskefartyg (62.542) @sv
alternative label: Flotta, handelsflotta (62.542) @sv
alternative label: Fraktfartyg (62.542) @sv
alternative label: Färjor, bilfärjor (62.542) @sv
alternative label: Handelsfartyg (62.542) @sv
alternative label: Handelsflotta, fartyg (62.542) @sv
alternative label: Hinaajat (62.542)
alternative label: Hjulångare (62.542) @sv
alternative label: Husbåtar (62.542) @sv
alternative label: Höyrylaivat (62.542)
alternative label: Ilmatyynyalukset (62.542)
alternative label: Insjöbåtar (62.542) @sv
alternative label: Isbrytare (62.542) @sv
alternative label: Jaalat (62.542)
alternative label: Jäänmurtajat (62.542)
alternative label: Kalastuslaivat (62.542)
alternative label: Kantosiipialukset (62.542)
alternative label: Kauppalaivasto, laivat (62.542)
alternative label: Kauppalaivat (62.542)
alternative label: Komentosilta (62.542)
alternative label: Kommandobrygga (62.542) @sv
alternative label: Konehuoneet, laivat (62.542)
alternative label: Kärnenergidrivna fartyg (62.542) @sv
alternative label: Köysistö, purjelaivat (62.542)
alternative label: Laivanrakennus (62.542)
alternative label: Laivanvarustus (62.542)
alternative label: Laivasto, kauppalaivasto (62.542)
alternative label: Laivat (62.542)
alternative label: Laivat, huolto, viat ja korjaus (62.542)
alternative label: Laivat, tekniikka ja teollisuus (62.542)
alternative label: Lautat, autolautat (62.542)
alternative label: Maskinrum, fartyg (62.542) @sv
alternative label: Matkustajalaivat (62.542)
alternative label: Moottorilaivat (62.542)
alternative label: Motorfartyg (62.542) @sv
alternative label: Passagerarfartyg (62.542) @sv
alternative label: Proomut (62.542)
alternative label: Pråmar (62.542) @sv
alternative label: Purjeet, purjelaivat (62.542)
alternative label: Purjelaivat (62.542)
alternative label: Rahtilaivat (62.542)
alternative label: Segel, segelfartyg (62.542) @sv
alternative label: Segelfartyg (62.542) @sv
alternative label: Siipirataslaivat (62.542)
alternative label: Sisävesilaivat (62.542)
alternative label: Skeppsbyggnad (62.542) @sv
alternative label: Skeppsrederi (62.542) @sv
alternative label: Skutor (62.542) @sv
alternative label: Sukellusveneet (62.542)
alternative label: Säiliölaivat (62.542)
alternative label: Takila, purjelaivat (62.542)
alternative label: Tankkerit (62.542)
alternative label: Telakat, laivanrakennus (62.542)
alternative label: Telakkateollisuus (62.542)
alternative label: Troolarit (62.542)
alternative label: Vedenalaiset alukset (62.542)
alternative label: Ydinkäyttöiset laivat (62.542)
alternative label: Ydinsukellusveneet (62.542)
broader: Vesikulkuneuvot
in scheme: YKL - Yleisten kirjastojen luokitusjärjestelmä
notation: 62.542
scope note: Konstruktion av fartyg, fartygsteknik och skeppsbyggnad Skeppsbyggnadsindustri. Varvsindustri Skeppsrederier. Handelsflottor. Fartygstyper Underhåll, fel och reparationer Segelfartyg. Ångfartyg Kärn- och motordrivna fartyg Hjulångare. Bärplansbåtar. Svävare Passagerarfartyg. Husbåtar. Bilfärjor Lastfartyg. Tankfartyg. Pråmar. Bogserbåtar Fiskefartyg. Trålare. Isbrytare Ubåtar som inte är avsedda för militära ändamål Fartygets konstruktion och delar Om verket behandlar fartyg som avsatts både för civila ändamål och militärändamål, ges företräde åt klass 62.542 Om verket behandlar både fartyg och fartygstrafik, ges företräde åt klass 69.63 @sv
scope note: Laivojen suunnittelu, tekniikka ja rakentaminen Laivanrakennusteollisuus. Telakkateollisuus Laivanvarustamot. Kauppalaivastot. Laivatyypit Laivojen huolto, viat ja korjaus Purjelaivat. Höyrylaivat Ydin- ja moottorikäyttöiset laivat Siipirataslaivat. Kantosiipialukset. Ilmatyynyalukset Matkustajalaivat. Asuntolaivat. Autolautat Rahtilaivat. Säiliölaivat. Proomut. Hinaajat Kalastuslaivat. Troolarit. Jäänmurtajat Muut kuin sotilaskäyttöön tarkoitetut sukellusveneet Laivan rakenne ja osat Jos teos koskee sekä siviili- että sotilaskäyttöön tarkoitettuja laivoja, annetaan etusija luokalle 62.542 Jos teos koskee sekä laivoja että laivaliikennettä, annetaan etusija luokalle 69.63

Veneet
type: Concept
References: Kirjastonhoito. Kirjastotekniikka
References: Liikennelainsäädäntö
References: Liikennesuunnittelu
References: KANSATIEDE. KULTTUURIANTROPOLOGIA
References: Liikennevälineiden pienoismallit
References: Vesirakennus
References: Vesiliikenne
References: Uinti. Sukellus. Lainelautailu
References: Soutu. Melonta. Purjehdus
References: Moottoriveneurheilu
type: YKL-luokka
alternative label: Airot (62.544)
alternative label: Bokbåtar, teknik (62.544) @sv
alternative label: Båtar (62.544) @sv
alternative label: Båtar, modeller och typer (62.544) @sv
alternative label: Båtar, service, fel och reparationer (62.544) @sv
alternative label: Båtar, teknik, industri och handel (62.544) @sv
alternative label: Båtbyggnad (62.544) @sv
alternative label: Båtmotorer (62.544) @sv
alternative label: Fiskebåtar (62.544) @sv
alternative label: Jollar (62.544) @sv
alternative label: Jollat (62.544)
alternative label: Kalastusveneet (62.544)
alternative label: Kanootit (62.544)
alternative label: Kanoter (62.544) @sv
alternative label: Katamaraanit (62.544)
alternative label: Katamaraner (62.544) @sv
alternative label: Kilpaveneet (62.544)
alternative label: Kirjastoveneet, tekniikka (62.544)
alternative label: Köysistö, purjeveneet (62.544)
alternative label: Lotsbåtar (62.544) @sv
alternative label: Luotsiveneet (62.544)
alternative label: Melat (62.544)
alternative label: Moottoriveneet (62.544)
alternative label: Motorbåtar (62.544) @sv
alternative label: Paddlar (62.544) @sv
alternative label: Perämoottorit, veneet (62.544)
alternative label: Polkuveneet (62.544)
alternative label: Purjeet, purjeveneet (62.544)
alternative label: Purjeveneet (62.544)
alternative label: Roddbåtar (62.544) @sv
alternative label: Segel, segelbåtar (62.544) @sv
alternative label: Segelbåtar (62.544) @sv
alternative label: Soutuveneet (62.544)
alternative label: Tackling, segelbåtar (62.544) @sv
alternative label: Takila, purjeveneet (62.544)
alternative label: Trampbåtar (62.544) @sv
alternative label: Tävlingsbåtar (62.544) @sv
alternative label: Tågverk, segelbåtar (62.544) @sv
alternative label: Utombordsmotorer, båtar (62.544) @sv
alternative label: Vattenskotrar (62.544) @sv
alternative label: Veneenrakennus (62.544)
alternative label: Veneet (62.544)
alternative label: Veneet, huolto, viat ja korjaus (62.544)
alternative label: Veneet, mallit ja tyypit (62.544)
alternative label: Veneet, tekniikka, teollisuus ja kauppa (62.544)
alternative label: Venemoottorit (62.544)
alternative label: Vesiskootterit (62.544)
alternative label: Åror (62.544) @sv
broader: Vesikulkuneuvot
in scheme: YKL - Yleisten kirjastojen luokitusjärjestelmä
notation: 62.544
preferred label: Boats @en
preferred label: Småbåtar @sv
scope note: Konstruktion och byggande av småbåtar, båtteknik Båtbyggnadsindustri. Båtmodeller. Båttyper Service, fel och reparationer som har att göra med båtar Segelbåtar. Roddbåtar. Motorbåtar Fiskebåtar. Lotsbåtar. Tävlingsbåtar. Bokbåtar Kanoter. Vattenskotrar Båtens konstruktion och delar Om verket behandlar både båtar och båttrafik, ges företräde åt klass 69.63 Om verket behandlar både båtar och sport, ges företräde åt klasserna 79.14 och 79.55 @sv
scope note: Veneiden suunnittelu, tekniikka ja rakentaminen Veneenrakennusteollisuus. Venemallit. Venetyypit Veneiden huolto, viat ja korjaus Purjeveneet. Soutuveneet. Moottoriveneet Kalastusveneet. Luotsiveneet. Kilpaveneet. Kirjastoveneet Kanootit. Vesiskootterit Veneen rakenne ja osat Jos teos koskee sekä veneitä että veneliikennettä, annetaan etusija luokalle 69.63 Jos teos koskee sekä veneitä että urheilua, annetaan etusija luokille 79.14 ja 79.55

Ilmakulkuneuvot
type: Concept
References: Liikennelainsäädäntö
References: Liikennesuunnittelu
References: Ilmavoimat. Ilmasodankäynti
References: Liikennevälineiden pienoismallit
References: KÄSITYÖ. KOTITEOLLISUUS
References: Tienrakennus
References: Lentoliikenne
References: Lentourheilu
type: YKL-luokka
alternative label: Autogirot (62.55)
alternative label: Autogyron (62.55) @sv
alternative label: Flygegenskaper, flygplan (62.55) @sv
alternative label: Flygplan (62.55) @sv
alternative label: Flygplan, civila (62.55) @sv
alternative label: Flygplan, service, fel och reparationer (62.55) @sv
alternative label: Flygplan, teknik och industri (62.55) @sv
alternative label: Flygplansmotorer (62.55) @sv
alternative label: Flygskepp (62.55) @sv
alternative label: Glidflygplan (62.55) @sv
alternative label: Helikopterit (62.55)
alternative label: Helikoptrar (62.55) @sv
alternative label: Ilmailu, lentokoneet (62.55)
alternative label: Ilmakulkuneuvot (62.55)
alternative label: Ilmalaivat (62.55)
alternative label: Ilmapallot (62.55)
alternative label: Instrumentbrädor, flygplan (62.55) @sv
alternative label: Jetplan, flygplan (62.55) @sv
alternative label: Kojelaudat, lentokoneet (62.55)
alternative label: Kuumailmapallot (62.55)
alternative label: Landningsställ (62.55) @sv
alternative label: Laskutelineet (62.55)
alternative label: Lennokit, ilmakulkuneuvot (62.55)
alternative label: Lento-ominaisuudet, lentokoneet (62.55)
alternative label: Lentokoneet (62.55)
alternative label: Lentokoneet, huolto, viat ja korjaus (62.55)
alternative label: Lentokoneet, tekniikka ja teollisuus (62.55)
alternative label: Lentokonemoottorit (62.55)
alternative label: Liitolentokoneet (62.55)
alternative label: Luftballonger (62.55) @sv
alternative label: Luftfarkoster (62.55) @sv
alternative label: Luftfart, flygplan (62.55) @sv
alternative label: Matkustajakoneet (62.55)
alternative label: Miehittämättömät ilma-alukset (62.55)
alternative label: Moottorilentokoneet (62.55)
alternative label: Motorflygplan (62.55) @sv
alternative label: Obemannade luftfarkostar (62.55) @sv
alternative label: Passagerarplan (62.55) @sv
alternative label: Plan, flygplan (62.55) @sv
alternative label: Purjelentokoneet (62.55)
alternative label: Segelflygplan (62.55) @sv
alternative label: Siivet, lentokoneet (62.55)
alternative label: Siviililentokoneet (62.55)
alternative label: Sjöflygplan (62.55) @sv
alternative label: Suihkukoneet, lentokoneet (62.55)
alternative label: Säkerhetsbälten, flygplan, teknik (62.55) @sv
alternative label: Tasot, lentokoneet (62.55)
alternative label: Turvavyöt, lentokoneet, tekniikka (62.55)
alternative label: Varmluftsballonger (62.55) @sv
alternative label: Vesitasot (62.55)
alternative label: Vingar, flygplan (62.55) @sv
broader: Liikennevälineet
in scheme: YKL - Yleisten kirjastojen luokitusjärjestelmä
notation: 62.55
preferred label: Aircraft @en
preferred label: Luftfarkoster @sv
scope note: Konstruktion och tillverkning av flygplan. Flygplansteknik Flygplansindustri. Flygplansmodeller Flygegenskaper hos flygplan Service, fel, reparationer och reservdelar som har att göra med flyg Segelflygplan. Glidflygplan Motorflygplan. Jetplan Civilflygplan. Passagerarflyplan. Hydroplan Flygplanets konstruktion och delar Hit också helikoptrar, luftfartyg och luftballonger Om verket behandlar både civil- och militärflygplan, ges företräde åt klass 62.55 Om verket behandlar både luftfarkoster och lufttrafik ges företräde åt klass 69.64 Om verket behandlar både luftfarkoster och flyg- eller fallskärmssport ges företräde åt klass 79.51 @sv
scope note: Lentokoneiden suunnittelu, tekniikka ja rakentaminen Lentokoneteollisuus. Lentokonemallit Lentokoneiden lento-ominaisuudet Lentokoneiden huolto, viat, korjaus ja varaosat Purjelentokoneet. Liitolentokoneet Moottorilentokoneet. Suihkukoneet Siviililentokoneet. Matkustajakoneet. Vesitasot Lentokoneen rakenne ja osat Tähän myös helikopterit, ilmalaivat ja ilmapallot Jos teos koskee sekä siviili- että sotilaslentokoneita, annetaan etusija luokalle 62.55 Jos teos koskee sekä ilmakulkuneuvoja että ilmaliikennettä, annetaan etusija luokalle 69.64 Jos teos koskee sekä ilmakulkuneuvoja että lento- tai laskuvarjourheilua, annetaan etusija luokalle 79.51

Avaruusalukset. Avaruusteknologia
type: Concept
References: Aseistus. Asevarustelu. Asekauppa
References: Ilmavoimat. Ilmasodankäynti
References: TÄHTITIEDE. GEODESIA
References: Avaruustutkimus. Avaruustoiminta
References: Geodesia. Maanmittaus. Kartoitus
References: Meteorologia. Klimatologia
References: Liikennevälineiden pienoismallit
type: YKL-luokka
alternative label: Avaruusalukset, tekniikka (62.56)
alternative label: Avaruusasemat, tekniikka (62.56)
alternative label: Avaruuskeskukset, tekniikka (62.56)
alternative label: Avaruusluotaimet, tekniikka (62.56)
alternative label: Avaruusraketit, tekniikka (62.56)
alternative label: Avaruussukkulat, tekniikka (62.56)
alternative label: Avaruusteknologia (62.56)
alternative label: Avfyrningsramper, rymdteknologi (62.56) @sv
alternative label: Bärraketer, rymdteknologi (62.56) @sv
alternative label: Kantoraketit, avaruusteknologia (62.56)
alternative label: Laukaisualustat, avaruusteknologia (62.56)
alternative label: Raketer, teknik (62.56) @sv
alternative label: Raketit, tekniikka (62.56)
alternative label: Rymdcentraler, teknik (62.56) @sv
alternative label: Rymdfarkoster, teknik (62.56) @sv
alternative label: Rymdraketer, teknik (62.56) @sv
alternative label: Rymdskyttlar, teknik (62.56) @sv
alternative label: Rymdsonder, teknik (62.56) @sv
alternative label: Rymdstationer, teknik (62.56) @sv
alternative label: Rymdteknologi (62.56) @sv
alternative label: Satelliter, teknik (62.56) @sv
alternative label: Tekokuut, tekniikka (62.56)
broader: Liikennevälineet
in scheme: YKL - Yleisten kirjastojen luokitusjärjestelmä
notation: 62.56
preferred label: Rymdfarkoster. Rymdteknologi @sv
preferred label: Spacecraft. Space technology @en
scope note: Avaruusalusten suunnittelu, tekniikka, rakenne ja osat Avaruusteollisuus Laukaisualustat. Kantoraketit. Satelliitit Avaruusluotaimet. Avaruussukkulat. Avaruusasemat Satelliittien ja luotaimien käyttö erikoisalojen tutkimukseen luokitetaan alan mukaan Jos teos koskee sekä avaruusaluksia että avaruuslentoja, annetaan etusija luokalle 52.4
scope note: Planering av rymdfarkoster, deras teknik, konstruktion och delar Rymdindustri Avskjutningsramper. Bärraketer. Satelliter Rymdsonder. Rymdskyttlar. Rymdstationer Användning av satelliter och sonder inom speciella forskningsområden klassificeras enligt område Om verket behandlar både rymdfarkoster och rymdflygningar, ges företräde åt klass 52.4 @sv

Liikennevälineiden pienoismallit
type: Concept
References: Innovaatiot. Keksinnöt. Patentit
References: Tekniikka ja sovelletut tieteet harrasteena
References: KÄSITYÖ. KOTITEOLLISUUS
type: YKL-luokka
alternative label: Ajanviete, liikennevälineiden pienoismallit (62.58)
alternative label: Ajoneuvot, pienoismallit (62.58)
alternative label: Askartelu, liikennevälineiden pienoismallit (62.58)
alternative label: Autot, pienoismallit (62.58)
alternative label: Avaruusalukset, pienoismallit (62.58)
alternative label: Avaruusasemat, pienoismallit (62.58)
alternative label: Avaruusraketit, pienoismallit (62.58)
alternative label: Bilar, miniatyrmodeller (62.58) @sv
alternative label: Båtar, miniatyrmodeller (62.58) @sv
alternative label: Farkoster, miniatyrmodeller (62.58) @sv
alternative label: Fartyg, miniatyrmodeller (62.58) @sv
alternative label: Flygfält, miniatyrmodeller (62.58) @sv
alternative label: Flygplan, miniatyrmodeller (62.58) @sv
alternative label: Fordon, miniatyrmodeller (62.58) @sv
alternative label: Färdmedel, miniatyrer (62.58) @sv
alternative label: Hamnar, miniatyrmodeller (62.58) @sv
alternative label: Harrastukset, liikennevälineiden pienoismallit (62.58)
alternative label: Helikopterit, pienoismallit (62.58)
alternative label: Helikoptrar, miniatyrmodeller (62.58) @sv
alternative label: Hobbyarbete, miniatyrmodeller av fordon (62.58) @sv
alternative label: Hobbyer, miniatyrmodeller av fordon (62.58) @sv
alternative label: Höyryveturit, pienoismallit (62.58)
alternative label: Ilmakulkuneuvot, pienoismallit (62.58)
alternative label: Junat, pienoismallit (62.58)
alternative label: Järnvägar, miniatyrmodeller (62.58) @sv
alternative label: Kulkuneuvot, pienoismallit (62.58)
alternative label: Laivat, pienoismallit (62.58)
alternative label: Landsvägsfordon, miniatyrmodeller (62.58) @sv
alternative label: Landtrafikmedel, miniatyrmodeller (62.58) @sv
alternative label: Lennokit, pienoismallien rakentaminen (62.58)
alternative label: Lentokentät, pienoismallit (62.58)
alternative label: Lentokoneet, pienoismallit (62.58)
alternative label: Liidokit, rakentaminen (62.58)
alternative label: Liikennevälineet, pienoismallit (62.58)
alternative label: Lokomotiv, miniatyrmodeller (62.58) @sv
alternative label: Luftfarkoster, miniatyrmodeller (62.58) @sv
alternative label: Maakulkuneuvot, pienoismallit (62.58)
alternative label: Maaliikennevälineet, pienoismallit (62.58)
alternative label: Metro, miniatyrmodeller (62.58) @sv
alternative label: Metro, pienoismallit (62.58)
alternative label: Miniatyrjärnvägar (62.58) @sv
alternative label: Miniatyrmodeller, trafikmedel (62.58) @sv
alternative label: Modellglidplan, byggande (62.58) @sv
alternative label: Modellplan, byggande (62.58) @sv
alternative label: Moottoriajoneuvot, pienoismallit (62.58)
alternative label: Moottoripyörät, pienoismallit (62.58)
alternative label: Motorcyklar, miniatyrmodeller (62.58) @sv
alternative label: Motorfordon, miniatyrmodeller (62.58) @sv
alternative label: Pienoismallit, liikennevälineet (62.58)
alternative label: Pienoisrautatiet (62.58)
alternative label: Raitiovaunut, pienoismallit (62.58)
alternative label: Raketer, miniatyrmodeller (62.58) @sv
alternative label: Raketit, pienoismallit (62.58)
alternative label: Rautatiet, pienoismallit (62.58)
alternative label: Rymdfarkoster, miniatyrmodeller (62.58) @sv
alternative label: Rymdraketer, miniatyrmodeller (62.58) @sv
alternative label: Rymdstationer, miniatyrmodeller (62.58) @sv
alternative label: Satamat, pienoismallit (62.58)
alternative label: Spårvagnar, miniatyrmodeller (62.58) @sv
alternative label: Sukellusveneet, pienoismallit (62.58)
alternative label: Tidsfördriv, miniatyrmodeller av fordon (62.58) @sv
alternative label: Trafikmedel, miniatyrer (62.58) @sv
alternative label: Tåg, miniatyrmodeller (62.58) @sv
alternative label: Ubåtar, miniatyrmodeller (62.58) @sv
alternative label: Veneet, pienoismallit (62.58)
alternative label: Vesikulkuneuvot, pienoismallit (62.58)
alternative label: Veturit, pienoismallit (62.58)
alternative label: Ånglokomotiv, miniatyrmodeller (62.58) @sv
broader: Liikennevälineet
in scheme: YKL - Yleisten kirjastojen luokitusjärjestelmä
notation: 62.58
preferred label: Miniatyrmodeller av trafikmedel @sv
preferred label: Scale models of vehicles @en
scope note: Hit miniatyrmodeller av land-, vatten- och lufttrafikmedel och hur man bygger dem Hit t.ex. miniatyrmodeller av bilar, motorcyklar, tåg, fartyg, båtar, flygplan och rymdfarkoster och hur man bygger dem Hit också modellflygplan och modellglidplan och hur man bygger dem Hit också t.ex. miniatyrmodeller av järnvägar och rymdstationer och hur man bygger dem @sv
scope note: Tähän maa-, vesi- ja ilmakulkuneuvojen pienoismallit ja niiden rakentaminen Tähän esim. autojen, moottoripyörien, junien, laivojen, veneiden, lentokoneiden ja avaruusalusten pienoismallit ja niiden rakentaminen Tähän myös lennokit ja liidokit ja niiden rakentaminen Tähän myös esim. rautateiden ja avaruusasemien pienoismallit ja niiden rakentaminen

Sähkötekniikka
type: Concept
References: Sähköoppi. Magnetismi
References: Teoreettinen ja fysikaalinen kemia
References: Energia
References: Junat. Raitiovaunut. Metrovaunut
References: Hienomekaaninen teollisuus
References: LVI-työt. Sähkötyöt
References: Huonetilojen ja irtaimiston hoito
alternative label: Ackumulatorer, elektroteknik (62.6) @sv
alternative label: Akut, sähkötekniikka (62.6)
alternative label: Asennustekniikka, sähkötekniikka (62.6)
alternative label: Askartelu, sähkötekniikka (62.6)
alternative label: Batterier (62.6) @sv
alternative label: Belysningsanordningar, elektroteknik (62.6) @sv
alternative label: Bränsleceller (62.6) @sv
alternative label: Effekt, elektroteknik (62.6) @sv
alternative label: Elarbeten, elektroteknik (62.6) @sv
alternative label: Elektricitet, teknik (62.6) @sv
alternative label: Elektricitetslära, teknisk (62.6) @sv
alternative label: Elektrisk ström, elektroteknik (62.6) @sv
alternative label: Elektriskt fält, elektroteknik (62.6) @sv
alternative label: Elektrokemi, teknisk (62.6) @sv
alternative label: Elektrolysteknik (62.6) @sv
alternative label: Elektrolyysitekniikka (62.6)
alternative label: Elektromagnetism, elektroteknik (62.6) @sv
alternative label: Elektronik som hobby, teknisk (62.6) @sv
alternative label: Elektroteknik (62.6) @sv
alternative label: Elektroteknisk industri (62.6) @sv
alternative label: Elinstallation (62.6) @sv
alternative label: Elljus, elektroteknik (62.6) @sv
alternative label: Elmarknad (62.6) @sv
alternative label: Elmätare (62.6) @sv
alternative label: Elmätteknik (62.6) @sv
alternative label: Elpris (62.6) @sv
alternative label: Galvanotekniikka (62.6)
alternative label: Jännite, sähkötekniikka (62.6)
alternative label: Lamput, sähkötekniikka (62.6)
alternative label: Lämpösähköisyys, sähkötekniikka (62.6)
alternative label: Mittaustekniikka, sähkötekniikka (62.6)
alternative label: Oskillografia, sähkötekniikka (62.6)
alternative label: Oskilloskoopit, sähkötekniikka (62.6)
alternative label: Paristot (62.6)
alternative label: Pintakäsittely, galvanotekniikka (62.6)
alternative label: Polttokennot (62.6)
alternative label: Sähkö, tekniikka (62.6)
alternative label: Sähköasennus (62.6)
alternative label: Sähköaskartelu, tekninen (62.6)
alternative label: Sähkökemia, tekninen (62.6)
alternative label: Sähkökennot (62.6)
alternative label: Sähkökenttä, sähkötekniikka (62.6)
alternative label: Sähkölamput, sähkötekniikka (62.6)
alternative label: Sähkömagnetismi, sähkötekniikka (62.6)
alternative label: Sähkömarkkinat (62.6)
alternative label: Sähkömittarit (62.6)
alternative label: Sähkön hinta (62.6)
alternative label: Sähkönmittaustekniikka (62.6)
alternative label: Sähkönsäätötekniikka (62.6)
alternative label: Sähköoppi, tekninen (62.6)
alternative label: Sähkötekniikka (62.6)
alternative label: Sähkötekninen teollisuus (62.6)
alternative label: Sähköturvallisuus (62.6+)
alternative label: Sähkötyöt, sähkötekniikka (62.6)
alternative label: Sähkövalo, sähkötekniikka (62.6)
alternative label: Sähkövirta, sähkötekniikka (62.6)
alternative label: Taajuus, sähkötekniikka (62.6)
alternative label: Teho, sähkötekniikka (62.6)
alternative label: Tekninen sähkökemia (62.6)
alternative label: Tekninen sähköoppi (62.6)
alternative label: Vahvavirtatekniikka (62.6)
alternative label: Vaihtovirta, sähkötekniikka (62.6)
alternative label: Valaisimet, sähkötekniikka (62.6)
alternative label: Vastus, sähkötekniikka (62.6)
broader: METALLITEOLLISUUS. KONETEKNIIKKA. LIIKENNEVÄLINEET SÄHKÖTEKNIIKKA
in scheme: YKL - Yleisten kirjastojen luokitusjärjestelmä
narrower: Sähköenergian tuottaminen
narrower: Sähköenergian muuttaminen, muuntaminen, jakelu ja siirto
narrower: Elektroniikka
notation: 62.6
scope note: Hit allmänna verk om elektroteknik och starkströmsteknik samt om elektroteknisk industri Teknisk elektricitetslära. Elinstallation Elström, effekt, spänning, motstånd och frekvens ur elektroteknisk synvinkel Elmätteknik. Elreglerteknik Elmätare. Elektriska reläer och regulatorer Elljus, glödlampor och termoelektricitet ur elektroteknisk synvinkel Teknisk elektrokemi. Ackumulatorer. Batterier. Solceller Galvanoteknik. Elektrolysteknik Hit också allmänna verk om elektroteknik som hobby Tillämpningar av elektroteknik på olika områden samt eldrivna maskiner och apparater för specialområden klassificeras enligt område @sv
scope note: Tähän sähkötekniikan ja vahvavirtatekniikan sekä sähköteknisen teollisuuden yleisteokset Tekninen sähköoppi. Sähköasennus Sähkövirta, teho, jännite, vastus ja taajuus sähkötekniikan kannalta Sähkönmittaustekniikka. Sähkönsäätötekniikka Sähkömittarit. Sähkönsäätimet Sähkövalo, sähkölamput ja lämpösähköisyys sähkötekniikan kannalta Tekninen sähkökemia. Akut. Paristot. Sähkökennot Galvanotekniikka. Elektrolyysitekniikka Tähän myös teknisen sähköaskartelun yleisteokset Sähkötekniikan sovellukset eri aloille sekä erikoisalojen sähkökäyttöiset koneet ja laitteet luokitetaan alan mukaan

Sähköenergian tuottaminen
type: Concept
References: Energia
References: Orgaaniset ja fossiiliset polttoaineet
References: Ydinenergia
type: YKL-luokka
alternative label: Aaltoenergia, sähkövoimalat (62.61)
alternative label: Elektrifiering (62.61) @sv
alternative label: Elenergi, produktion (62.61) @sv
alternative label: Elkraftverk (62.61) @sv
alternative label: Elproduktion, teknik (62.61) @sv
alternative label: Elverk (62.61) @sv
alternative label: Forsar, kraftverksteknik (62.61) @sv
alternative label: Höyryvoimalat, sähkövoimalat (62.61)
alternative label: Kosket, voimalatekniikka (62.61)
alternative label: Kraftverk, elverk (62.61) @sv
alternative label: Sähköenergia, tuottaminen (62.61)
alternative label: Sähköistäminen (62.61)
alternative label: Sähkölaitokset (62.61)
alternative label: Sähköntuotanto, tekniikka (62.61)
alternative label: Sähkövoimalat (62.61)
alternative label: Tidvattenkraftverk, elkraftverk (62.61) @sv
alternative label: Tuulivoimalat, sähkövoimalat (62.61)
alternative label: Vattenenergi, kraftverk (62.61) @sv
alternative label: Vattenkraftverk, elkraftverk (62.61) @sv
alternative label: Vesienergia, sähkövoimalat (62.61)
alternative label: Vesivoimalat, sähkövoimalat (62.61)
alternative label: Vindkraftverk, elkraftverk (62.61) @sv
alternative label: Voimalat, sähkövoimalat (62.61)
alternative label: Vuorovesivesivoimalat, sähkövoimalat (62.61)
alternative label: Vågenergi, elkraftverk (62.61) @sv
alternative label: Ångkraftverk, elkraftverk (62.61) @sv
broader: Sähkötekniikka
in scheme: YKL - Yleisten kirjastojen luokitusjärjestelmä
notation: 62.61
preferred label: Production of electrical energy @en
preferred label: Produktion av elenergi @sv
scope note: Sähköenergian tuottamisen tekniikka. Eri energianlähteillä toimivat sähkövoimalat ja niiden tekniikka Tähän esim. sähköä tuottavat vesi-, höyry- ja tuulivoimalat Jos teos koskee sekä lämpö- että sähkövoimaloita, annetaan etusija luokalle 60.8+
scope note: Teknik för elproduktion. Elektrifiering Elkraftverk med olika energikällor och deras teknik Hit t.ex. elproducerande vatten-, ång- och vindkraftverk Om verket behandlar både värmeverk och elkraftverk, ges företräde åt klass 60.8+ @sv

Sähköenergian muuttaminen, muuntaminen, jakelu ja siirto
type: Concept
References: Sähköoppi. Magnetismi
References: Autot
References: Junat. Raitiovaunut. Metrovaunut
References: Hienomekaaninen teollisuus
References: LVI-työt. Sähkötyöt
type: YKL-luokka
alternative label: Blixtskydd (62.62) @sv
alternative label: Dynamor (62.62) @sv
alternative label: Dynamot (62.62)
alternative label: Elapparater (62.62) @sv
alternative label: Eldistribution (62.62) @sv
alternative label: Elektriska ledare, elektroteknik (62.62) @sv
alternative label: Elektriska maskiner (62.62) @sv
alternative label: Elektriska socklar (62.62) @sv
alternative label: Elenergi, distribution och överföring (62.62) @sv
alternative label: Elenergi, transformation (62.62) @sv
alternative label: Elgeneratorer (62.62) @sv
alternative label: Elkablar (62.62) @sv
alternative label: Elkopplingar (62.62) @sv
alternative label: Elledningar (62.62) @sv
alternative label: Elmotorer (62.62) @sv
alternative label: Elnät (62.62) @sv
alternative label: Eristys, sähkötekniikka (62.62)
alternative label: Generaattorit (62.62)
alternative label: Generatorer (62.62) @sv
alternative label: Isolatorer, elektroteknik (62.62) @sv
alternative label: Isolering, elektroteknik (62.62) @sv
alternative label: Johteet, sähkötekniikka (62.62)
alternative label: Jordning (62.62) @sv
alternative label: Kaapelit, sähkötekniikka (62.62)
alternative label: Kablar, elektroteknik (62.62) @sv
alternative label: Kondensaattorit, sähkötekniikka (62.62)
alternative label: Kondensatorer, elektroteknik (62.62) @sv
alternative label: Koppling, elektroteknik (62.62) @sv
alternative label: Kopplingar, elektroteknik (62.62) @sv
alternative label: Kraftdistributionsanläggningar, elektroteknik (62.62) @sv
alternative label: Kraftöverföringsnät, elektroteknik (62.62) @sv
alternative label: Kytkentä, sähkötekniikka (62.62)
alternative label: Kytkimet, sähkötekniikka (62.62)
alternative label: Ledare, elektroteknik (62.62) @sv
alternative label: Maadoitus (62.62)
alternative label: Magneetot (62.62)
alternative label: Magneter (62.62) @sv
alternative label: Muuntajat, sähkötekniikka (62.62)
alternative label: Muuttajat, sähkötekniikka (62.62)
alternative label: Omformare, elektroteknik (62.62) @sv
alternative label: Salamasuojaus (62.62)
alternative label: Strömbrytare (62.62) @sv
alternative label: Sulakkeet (62.62)
alternative label: Sähköenergia, jakelu ja siirto (62.62)
alternative label: Sähköenergia, muuntaminen (62.62)
alternative label: Sähköeristeet, sähkötekniikka (62.62)
alternative label: Sähkögeneraattorit (62.62)
alternative label: Sähköistukat (62.62)
alternative label: Sähköjohdot (62.62)
alternative label: Sähkökaapelit (62.62)
alternative label: Sähkökatkaisijat (62.62)
alternative label: Sähkökoneet (62.62)
alternative label: Sähkökytkennät (62.62)
alternative label: Sähkölaitteet (62.62)
alternative label: Sähkömoottorit (62.62)
alternative label: Sähkönjakelu (62.62)
alternative label: Sähkönjohtimet, sähkötekniikka (62.62)
alternative label: Sähköverkot (62.62)
alternative label: Säkringar (62.62) @sv
alternative label: Transformatorer, elektroteknik (62.62) @sv
alternative label: Ukkossuojaus (62.62)
alternative label: Voimanjakelulaitokset, sähkötekniikka (62.62)
alternative label: Voimansiirtoverkot, sähkötekniikka (62.62)
alternative label: Åskskydd (62.62) @sv
broader: Sähkötekniikka
in scheme: YKL - Yleisten kirjastojen luokitusjärjestelmä
notation: 62.62
preferred label: Conversion, transformation, distribution and transmission of electrical energy @en
preferred label: Omvandling, transformation, distribution och överföring av elenergi @sv
scope note: Elmaskiner, elmotorer och elektriska apparater i allmänhet Elgeneratorer. Elektromagneter. Omformare. Transformatorer Ledningar. Isolatorer. Strömskydd. Jordning. Säkringar Elledningar. Elkablar. Elnät Elkopplingar. Strömbrytare Kraftdistributionsanläggningar. Kraftdistributionsnät Tillämpningar av elteknik på olika områden samt eldrivna maskiner och apparater för specialområden klassificeras enligt område @sv
scope note: Sähkökoneet, sähkömoottorit ja sähkölaitteet yleensä Sähkögeneraattorit. Magneetot. Muuttajat. Muuntajat Johteet. Eristeet. Suojaus. Maadoitus. Sulakkeet Sähköjohdot. Sähkökaapelit. Sähköverkot Sähkökytkennät. Sähkökatkaisijat Voimanjakelulaitokset. Voimansiirtoverkko Sähkötekniikan sovellukset eri aloille sekä erikoisalojen sähkökäyttöiset koneet ja laitteet luokitetaan alan mukaan

Elektroniikka
type: Concept
References: Valo-oppi. Säteilyoppi
References: TIETOTEKNIIKKA. TIETOLIIKENNE. VIESTINTÄTEKNIIKKA. TEKOÄLY
References: Tietokoneet
References: Tietokoneiden lisälaitteet
References: Tietoliikenne. Viestintätekniikka. Multimedia
References: Matkaviestinpalvelut. Puhelinliikenne
References: Äänitekniikka. Radiotekniikka
References: Kuvantoistotekniikka. Televisiotekniikka
References: Hienomekaaninen teollisuus
alternative label: Aktiiviset komponentit, elektroniikka (62.67)
alternative label: Aktiva komponenter, elektronik (62.67) @sv
alternative label: Analoga kretsar, elektronik (62.67) @sv
alternative label: Analoga signaler, elektronik (62.67) @sv
alternative label: Analogiapiirit, elektroniikka (62.67)
alternative label: Analogiset signaalit, elektroniikka (62.67)
alternative label: Askartelu, elektroniikka (62.67)
alternative label: Digitaaliset signaalit, elektroniikka (62.67)
alternative label: Digitaalitekniikka (62.67)
alternative label: Digitala signaler, elektronik (62.67) @sv
alternative label: Digitalteknik (62.67) @sv
alternative label: Dioder (62.67) @sv
alternative label: Diodit (62.67)
alternative label: Elektromagnetism, elektronik (62.67) @sv
alternative label: Elektroniikka (62.67)
alternative label: Elektroniikka-askartelu (62.67)
alternative label: Elektroniikkapiirit (62.67)
alternative label: Elektroniikkateollisuus (62.67)
alternative label: Elektronik (62.67) @sv
alternative label: Elektronik som hobby (62.67) @sv
alternative label: Elektronikindustri (62.67) @sv
alternative label: Elektronikkretsar (62.67) @sv
alternative label: Elektronioptiikka (62.67)
alternative label: Elektroniputket (62.67)
alternative label: Elektroniset järjestelmät (62.67)
alternative label: Elektroniset komponentit (62.67)
alternative label: Elektroniset laitteet (62.67)
alternative label: Elektroniset lohkokaaviot (62.67)
alternative label: Elektroniset piirit (62.67)
alternative label: Elektroniset signaalit (62.67)
alternative label: Elektroniska anordningar (62.67) @sv
alternative label: Elektroniska blockscheman (62.67) @sv
alternative label: Elektroniska komponenter (62.67) @sv
alternative label: Elektroniska kretsar (62.67) @sv
alternative label: Elektroniska signaler (62.67) @sv
alternative label: Elektroniska system (62.67) @sv
alternative label: Elektronoptik (62.67) @sv
alternative label: Elektronrör (62.67) @sv
alternative label: Fiberoptik (62.67) @sv
alternative label: Huoltamot, viihde-elektroniikka (62.67)
alternative label: Integroidut piirit, elektroniikka (62.67)
alternative label: Kodintekniikka, elektroniikka (62.67)
alternative label: Komponenttitekniikka, elektroniikka (62.67)
alternative label: Kuituoptiikka (62.67)
alternative label: Kytkentä, elektroniikka (62.67)
alternative label: Lasertekniikka (62.67)
alternative label: Masertekniikka (62.67)
alternative label: Mikroaaltotekniikka (62.67)
alternative label: Mikroaaltouunit, tekniikka ja teollisuus (62.67)
alternative label: Mikroelektroniikka (62.67)
alternative label: Mikropiirit (62.67)
alternative label: Modulointi, elektroniikka (62.67)
alternative label: Optiset kuidut (62.67)
alternative label: Optoelektroniikka (62.67)
alternative label: Passiiviset komponentit, elektroniikka (62.67)
alternative label: Pulssipiirit, elektroniikka (62.67)
alternative label: Puolijohdekomponentit, elektroniikka (62.67)
alternative label: Purkausputket, elektroniikka (62.67)
alternative label: Röntgenputket, elektroniikka (62.67)
alternative label: Signaalit, elektroniikka (62.67)
alternative label: Sähkömagnetismi, elektroniikka (62.67)
alternative label: Transistorit, elektroniikka (62.67)
alternative label: Tyristorit (62.67)
alternative label: Valokennot (62.67)
alternative label: Viihde-elektroniikka (62.67)
broader: Sähkötekniikka
in scheme: YKL - Yleisten kirjastojen luokitusjärjestelmä
notation: 62.67
scope note: Elektroniikka yleensä. Elektroniikkateollisuus yleensä Elektroniikka-askartelu yleensä Elektroniset signaalit ja niiden vahvistaminen Elektroniset piirit ja niiden komponentit Elektroniset järjestelmät ja lohkokaaviot Elektroniikan kytkentäkaaviot. Painetut piirit Analogiset ja digitaaliset signaalit. Digitaalitekniikka yleensä Sähkömagneettisten aaltojen, värähtelyjen ja pulssien tekniikka Mikroaaltotekniikka yleensä Modulointi. Laser- ja masertekniikka yleensä Analogiapiirit. Pulssipiirit. Integroidut piirit Aktiiviset ja passiiviset komponentit Puolijohdekomponentit. Mikropiirit Elektroniputket. Purkausputket. Röntgenputket Transistorit. Tyristorit. Valokennot Elektronioptiikka eli optoelektroniikka Elektroniikan sovellukset eri aloille sekä erikoisalojen elektroniset laitteet luokitetaan alan mukaan
scope note: Elektronik i allmänhet. Elektronisk industri i allmänhet Hit också allmänna verk om elektronik som hobby Elektroniska signaler och förstärkning av dem Elektroniska kretsar och deras komponenter Elektroniska system och blockscheman Elektroniska kopplingsscheman. Tryckta kretsar Analoga och digitala signaler. Digitalteknik i allmänhet Elektromagnetiska vågors, svängningars och pulsers teknik Mikrovågsteknik i allmänhet Modulering. Laser- och maserteknik i allmänhet Analoga kretsar. Pulskretsar. Integrerade kretsar Aktiva och passiva komponenter Halvledarkomponenter. Mikrokretsar Elektronrör. Urladdningsrör. Röntgenrör. Transistorer. Tyristorer. Solceller Elektronoptik (optoelektronik) Tillämpningar av elektronik på olika områden samt elektroniska apparater för specialområden klassificeras enligt område @sv

KAIVANNAISTEOLLISUUS. KEMIANTEOLLISUUS
type: Concept
type: YKL-luokka
alternative label: Industriell formgivning, resp. område (60 ... 64+) @sv
alternative label: Teollinen muotoilu, aloittain (60 ... 64+)
broader: TEKNIIKKA. TEOLLISUUS. KÄSITYÖ. MAA- JA METSÄTALOUS KOTITALOUS. LIIKETALOUS. LIIKENNE
in scheme: YKL - Yleisten kirjastojen luokitusjärjestelmä
narrower: Kaivannaisteollisuus
narrower: Keraaminen teollisuus. Lasiteollisuus. Sementtiteollisuus
narrower: Kemianteollisuus
narrower: Muovi- ja kumiteollisuus
notation: 63
preferred label: GRUVINDUSTRI. KEMISK INDUSTRI @sv
preferred label: MINING INDUSTRY. CHEMICAL INDUSTRY @en
scope note: Hit verk som behandlar både gruvindustri och kemisk industri Hit och till underklasserna också företagsekonomi, produktionsmetoder, rationalisering och handel inom gruvindustri och kemisk industri @sv
scope note: Tähän teokset, jotka koskevat sekä kaivannaisteollisuutta että kemianteollisuutta Tähän ja alaluokkiin myös kaivannais- ja kemianteollisuuden liiketalous, tuotantomenetelmät, rationalisointi ja kauppa

Kaivannaisteollisuus
type: Concept
References: Pääoma. Luonnonvarat
References: Geologia. Geomorfologia
References: Mineralogia. Petrologia. Kristallografia
References: Orgaaniset ja fossiiliset polttoaineet
References: Geotekniikka. Maatyöt
alternative label: Alkutuotanto, kaivannaiset (63.1)
alternative label: Asfalt, gruvindustri (63.1) @sv
alternative label: Asfaltti, kaivannaisteollisuus (63.1)
alternative label: Avolouhokset, kaivostekniikka (63.1)
alternative label: Bearbetning, sten (63.1) @sv
alternative label: Bergsbruk (63.1) @sv
alternative label: Geologia, kaivannaiset (63.1)
alternative label: Geologia, malmit (63.1)
alternative label: Geologia, taloudellinen (63.1)
alternative label: Geotekniikka, kaivostekniikka (63.1)
alternative label: Hiekkakuopat, kaivannaisteollisuus (63.1)
alternative label: Hionta, kiven työstö (63.1)
alternative label: Hopekaivokset (63.1)
alternative label: Jalokivet, etsintä ja louhinta (63.1)
alternative label: Jalometallit, etsintä ja louhinta (63.1)
alternative label: Jyrsintä, kiven työstö (63.1)
alternative label: Järvimalmi, etsintä ja louhinta (63.1)
alternative label: Kaivannaiset (63.1)
alternative label: Kaivannaiset, louhinta ja poraus (63.1)
alternative label: Kaivannaiset, malmit (63.1)
alternative label: Kaivannaisteollisuus (63.1)
alternative label: Kaivokset (63.1)
alternative label: Kaivokset, malmit (63.1)
alternative label: Kaivostekniikka (63.1)
alternative label: Kaivosteollisuus (63.1)
alternative label: Kaivostyö (63.1)
alternative label: Kaivuutekniikka, kaivostekniikka (63.1)
alternative label: Kalkkikaivokset (63.1)
alternative label: Kevytmetallit, kaivostekniikka (63.1)
alternative label: Kiven työstö (63.1)
alternative label: Kivenhakkaus (63.1)
alternative label: Kivenmurskaamot (63.1)
alternative label: Kivi, työstö (63.1)
alternative label: Kivilajit, kaivostekniikka (63.1)
alternative label: Kivilouhokset (63.1)
alternative label: Kiviteollisuus (63.1)
alternative label: Kullanetsintä (63.1)
alternative label: Kullanhuuhdonta (63.1)
alternative label: Kultakaivokset (63.1)
alternative label: Kuparikaivokset (63.1)
alternative label: Leikkaus, kiven työstö (63.1)
alternative label: Louhinta, kaivostekniikka (63.1)
alternative label: Louhinta, malmit (63.1)
alternative label: Maalajit, kaivosteollisuus (63.1)
alternative label: Maatyöt, kaivostekniikka (63.1)
alternative label: Malmiesiintymät (63.1)
alternative label: Malmigeologia (63.1)
alternative label: Malmit, etsintä ja louhinta (63.1)
alternative label: Metallit, malmit (63.1)
alternative label: Mineraalit, etsintä ja louhinta (63.1)
alternative label: Pintakäsittely, kiven työstö (63.1)
alternative label: Poraus, kaivostekniikka (63.1)
alternative label: Poraus, kiven työstö (63.1)
alternative label: Puolijalokivet, etsintä ja louhinta (63.1)
alternative label: Raskasmetallit, kaivostekniikka (63.1)
alternative label: Rauta, kaivostekniikka (63.1)
alternative label: Rautakaivokset (63.1)
alternative label: Sorakuopat, kaivannaisteollisuus (63.1)
alternative label: Suolakaivokset (63.1)
alternative label: Taloudellinen geologia (63.1)
alternative label: Taloudellinen geologia, malmit (63.1)
alternative label: Tinakaivokset (63.1)
alternative label: Tukirakenteet, kaivostekniikka (63.1)
alternative label: Tunnelit, kaivostekniikka (63.1)
alternative label: Työstö, kivi (63.1)
alternative label: Vedenalainen louhinta (63.1)
alternative label: Vuoriteollisuus (63.1)
alternative label: Vuorityö (63.1)
broader: KAIVANNAISTEOLLISUUS. KEMIANTEOLLISUUS
in scheme: YKL - Yleisten kirjastojen luokitusjärjestelmä
narrower: Metallurgia
notation: 63.1
scope note: Gruvindustri och bergsbruk. Gruvteknik Malmer och mineral samt malm- och mineralfyndigheter Gruv- och malmgeologi. Ekonomisk geologi Prospektering och brytning av malmer, mineral, stenarter; jordarter och ädelstenar Dagbrott. Brytning under jord och vatten Gruvor. Gruvarbete. Byggande av gruvor Sand- och grustag. Stenbrott Bearbetning av stenmaterial. Stenkrosserier @sv
scope note: Kaivannais- ja kaivosteollisuus. Kaivostekniikka Kaivannaiset ja niiden esiintymät Kaivannais- ja malmigeologia. Taloudellinen geologia Malmien, mineraalien, kivilajien, maalajien ja jalokivien etsintä ja louhinta Avolouhokset. Maanalainen ja vedenalainen louhinta Kaivokset. Kaivostyö. Kaivosten rakentaminen Hiekka- ja sorakuopat. Kivilouhokset Kiviaineksen työstö. Kivenmurskaamot

Metallurgia
type: Concept
References: Epäorgaaninen kemia
References: Mineralogia. Petrologia. Kristallografia
References: METALLITEOLLISUUS. KONETEKNIIKKA. LIIKENNEVÄLINEET SÄHKÖTEKNIIKKA
References: Mekaaninen teknologia. Metallin työstö
References: Kemianteollisuus
References: Taidetaonta. Korutaide
type: YKL-luokka
alternative label: Förädling, malmer (63.12) @sv
alternative label: Guld, metallurgi (63.12) @sv
alternative label: Hopea, metallurgia (63.12)
alternative label: Jalometallit, metallurgia (63.12)
alternative label: Jalostus, malmit (63.12)
alternative label: Jordmetaller, metallurgi (63.12) @sv
alternative label: Järn, metallurgi (63.12) @sv
alternative label: Järn, produktion (63.12) @sv
alternative label: Kevytmetallit, metallurgia (63.12)
alternative label: Koppar, metallurgi (63.12) @sv
alternative label: Kulta, metallurgia (63.12)
alternative label: Kupari, metallurgia (63.12)
alternative label: Legeringar, metallurgi (63.12) @sv
alternative label: Lejeeringit, metallurgia (63.12)
alternative label: Lättmetaller, metallurgi (63.12) @sv
alternative label: Maametallit, metallurgia (63.12)
alternative label: Malmer, anrikning och förädling (63.12) @sv
alternative label: Malmer, metallurgi (63.12) @sv
alternative label: Malmit, metallurgia (63.12)
alternative label: Malmit, rikastus ja jalostus (63.12)
alternative label: Messinki, metallurgia (63.12)
alternative label: Metallegeringar, metallurgi (63.12) @sv
alternative label: Metaller (63.12) @sv
alternative label: Metaller, förädling och anrikning (63.12) @sv
alternative label: Metaller, metallurgi (63.12) @sv
alternative label: Metaller, metallära (63.12) @sv
alternative label: Metaller, produktion (63.12) @sv
alternative label: Metallioppi (63.12)
alternative label: Metalliseokset, metallurgia (63.12)
alternative label: Metallit (63.12)
alternative label: Metallit, jalostus ja rikastus (63.12)
alternative label: Metallit, metallioppi (63.12)
alternative label: Metallit, metallurgia (63.12)
alternative label: Metallit, tuotanto (63.12)
alternative label: Metallografi (63.12) @sv
alternative label: Metallografia (63.12)
alternative label: Metallurgi (63.12) @sv
alternative label: Metallurgia (63.12)
alternative label: Metallurginen teollisuus (63.12)
alternative label: Metallurgisk industri (63.12) @sv
alternative label: Metallära (63.12) @sv
alternative label: Mässing, metallurgi (63.12) @sv
alternative label: Raskasmetallit, metallurgia (63.12)
alternative label: Rauta, metallurgia (63.12)
alternative label: Rauta, tuotanto (63.12)
alternative label: Silver, metallurgi (63.12) @sv
alternative label: Stål, metallurgi (63.12) @sv
alternative label: Stål, produktion (63.12) @sv
alternative label: Tenn, metallurgi (63.12) @sv
alternative label: Teräs, metallurgia (63.12)
alternative label: Teräs, tuotanto (63.12)
alternative label: Tina, metallurgia (63.12)
alternative label: Tungmetaller, metallurgi (63.12) @sv
alternative label: Ädelmetaller, metallurgi (63.12) @sv
broader: Kaivannaisteollisuus
in scheme: YKL - Yleisten kirjastojen luokitusjärjestelmä
notation: 63.12
preferred label: Metallurgi @sv
preferred label: Metallurgy @en
scope note: Metallioppi. Metallit. Lejeeringit Jalometallit. Raskasmetallit. Kevytmetallit. Maametallit Metallien rikastus, jalostus ja kehittäminen malmeista Raudan, teräksen ja muiden metallien tuotanto Metallurginen teollisuus
scope note: Metallära. Metaller. Legeringar Ädelmetaller. Tungmetaller. Lättmetaller. Jordmetaller Anrikning, förädling och utveckling av malmer till metall Produktion av järn, stål och andra metaller Metallurgisk industri @sv

Keraaminen teollisuus. Lasiteollisuus. Sementtiteollisuus
type: Concept
References: Muovailu. Keramiikkatyöt
References: Rakennusstatiikka. Rakennussuunnittelu
References: Rakennusaineet. Rakennustyöt
References: Lasitaide. Keramiikkataide
type: YKL-luokka
alternative label: Astiat, lasi- ja keraaminen teollisuus (63.3)
alternative label: Betongindustri (63.3) @sv
alternative label: Betoniteollisuus (63.3)
alternative label: Cementindustri (63.3) @sv
alternative label: Emali, teollisuus (63.3)
alternative label: Emalj, industri (63.3) @sv
alternative label: Emaljering, industriell (63.3) @sv
alternative label: Emalointi, teollinen (63.3)
alternative label: Fajansindustri (63.3) @sv
alternative label: Fajanssiteollisuus (63.3)
alternative label: Gipsindustri (63.3) @sv
alternative label: Glasblåsning (63.3) @sv
alternative label: Glasföremål, fabrikstillverkat glas (63.3) @sv
alternative label: Glasindustri (63.3) @sv
alternative label: Kaakeliteollisuus (63.3)
alternative label: Kakelindustri (63.3) @sv
alternative label: Kalkindustri (63.3) @sv
alternative label: Kalkkiteollisuus (63.3)
alternative label: Keraaminen teollisuus (63.3)
alternative label: Keraamiset laatat ja putket (63.3)
alternative label: Keramiikkateollisuus (63.3)
alternative label: Keramisk industri (63.3) @sv
alternative label: Keramiska plattor och rör (63.3) @sv
alternative label: Kipsiteollisuus (63.3)
alternative label: Kivitavara, keramiikkateollisuus (63.3)
alternative label: Kristallföremål, glasindustri (63.3) @sv
alternative label: Kristalliesineet, lasiteollisuus (63.3)
alternative label: Kärl, glas- och keramisk industri (63.3) @sv
alternative label: Laastiteollisuus (63.3)
alternative label: Laatat, keraaminen teollisuus (63.3)
alternative label: Lasiesineet, teollinen lasi (63.3)
alternative label: Lasinpuhallus (63.3)
alternative label: Lasiteollisuus (63.3)
alternative label: Murbruksindustri (63.3) @sv
alternative label: Peilit, lasiteollisuus (63.3)
alternative label: Plattor, keramisk industri (63.3) @sv
alternative label: Porslinsindustri (63.3) @sv
alternative label: Posliiniteollisuus (63.3)
alternative label: Putket, keraamiset (63.3)
alternative label: Rör, keramiska (63.3) @sv
alternative label: Saviteollisuus (63.3)
alternative label: Sementtiteollisuus (63.3)
alternative label: Speglar, glasindustri (63.3) @sv
alternative label: Stengods, keramisk industri (63.3) @sv
alternative label: Tegelindustri (63.3) @sv
alternative label: Tiiliteollisuus (63.3)
broader: KAIVANNAISTEOLLISUUS. KEMIANTEOLLISUUS
in scheme: YKL - Yleisten kirjastojen luokitusjärjestelmä
notation: 63.3
preferred label: Ceramics industry. Glass industry. Cement industry @en
preferred label: Keramisk industri. Glasindustri. Cementindustri @sv
scope note: Glastillverkning. Glasblåsning. Glasskivor och glasföremål samt industriell tillverkning av dem. Keramik-, porslin-, fajans-, stengods- och lerföremål samt industriell tillverkning av dem Tegel. Keramiska plattor och rör. Hit också gips-, kalk-, murbruks- och betongindustri. Produktkataloger 63.303 @sv
scope note: Lasinvalmistus. Lasinpuhallus. Lasilevyt ja lasiesineet sekä niiden teollinen valmistus. Keramiikka-, posliini-, fajanssi-, kivitavara- ja saviesineet sekä niiden teollinen valmistus. Tiilet. Keraamiset laatat ja putket. Tähän myös kipsi-, kalkki-, laasti- ja betoniteollisuus. Tuoteluettelot 63.303

Kemianteollisuus
type: Concept
References: KEMIA
References: Biokemia. Biofysiikka. Molekyylibiologia
References: Kauneudenhoito. Ulkonäkö
References: Lääkehoito. Lääkeaineoppi
References: Elimet. Taudit
References: Orgaaniset ja fossiiliset polttoaineet
References: Sähkötekniikka
References: Metallurgia
References: Keraaminen teollisuus. Lasiteollisuus. Sementtiteollisuus
References: Muovi- ja kumiteollisuus
References: Paperi- ja selluloosateollisuus
References: Maanviljely. Puutarhanhoito. Hyötykasvit
References: Kasvinsuojelu
References: Elintarviketeollisuus
References: Julkiset huvit
alternative label: Ammoniak, kemisk industri (63.5) @sv
alternative label: Ammoniakki, kemianteollisuus (63.5)
alternative label: Arom, kemisk industri (63.5) @sv
alternative label: Aromi, kemianteollisuus (63.5)
alternative label: Biocider, kemisk industri (63.5) @sv
alternative label: Biosidit, kemianteollisuus (63.5)
alternative label: Bläck, färgindustri (63.5) @sv
alternative label: Doft, kemisk industri (63.5) @sv
alternative label: Dynamiikka, tekniikka (63.5)
alternative label: Dynamiitti, räjähdysaineteollisuus (63.5)
alternative label: Dynamik, teknik (63.5) @sv
alternative label: Dynamit, sprängämnesindustri (63.5) @sv
alternative label: Fernissor, kemisk industri (63.5) @sv
alternative label: Fläckuttagningsmedel, kemisk industri (63.5) @sv
alternative label: Fyrverkeripjäser, kemisk industri (63.5) @sv
alternative label: Hajuvedet, kemianteollisuus (63.5)
alternative label: Hyönteismyrkyt, kemianteollisuus (63.5)
alternative label: Ilotulitusvälineet, kemianteollisuus (63.5)
alternative label: Kaasut, kemianteollisuus (63.5)
alternative label: Kasvinsuojeluaineet, kemianteollisuus (63.5)
alternative label: Kauneudenhoitoaineet, kemianteollisuus (63.5)
alternative label: Kemia, kemianteollisuus (63.5)
alternative label: Kemia, teknologia (63.5)
alternative label: Kemianteollisuus (63.5)
alternative label: Kemikaalit, kemianteollisuus (63.5)
alternative label: Kosmeettiset aineet, kemianteollisuus (63.5)
alternative label: Kosmetiikkateollisuus (63.5)
alternative label: Lakat, kemianteollisuus (63.5)
alternative label: Lakkateollisuus (63.5)
alternative label: Lannoiteteollisuus (63.5)
alternative label: Liimateollisuus (63.5)
alternative label: Lääketeollisuus (63.5)
alternative label: Lääkkeet, lääketeollisuus (63.5)
alternative label: Maaliteollisuus (63.5)
alternative label: Meikit, kemianteollisuus (63.5)
alternative label: Musteet, väriteollisuus (63.5)
alternative label: Orgaanisen kemian teollisuus (63.5)
alternative label: Painovärit, kemianteollisuus (63.5)
alternative label: Parfyymit, kemianteollisuus (63.5)
alternative label: Pesuaineteollisuus (63.5)
alternative label: Puhdistusaineteollisuus (63.5)
alternative label: Pyrotekniikka (63.5)
alternative label: Rikkihappo, kemianteollisuus (63.5)
alternative label: Ruuti (63.5)
alternative label: Räjähdysaineteollisuus (63.5)
alternative label: Saippua, kemianteollisuus (63.5)
alternative label: Saippuateollisuus (63.5)
alternative label: Sytytysaineteollisuus (63.5)
alternative label: Tahranpoistoaineet, kemianteollisuus (63.5)
alternative label: Tekninen kemia (63.5)
alternative label: Teknokemiallinen teollisuus (63.5)
alternative label: Tuoksu, kemianteollisuus (63.5)
alternative label: Vahat, kemianteollisuus (63.5)
alternative label: Vernissat, kemianteollisuus (63.5)
alternative label: Väriaineet, kemianteollisuus (63.5)
alternative label: Värit, kemianteollisuus (63.5)
alternative label: Väriteollisuus (63.5)
alternative label: Värjäys, väriteollisuus (63.5)
alternative label: Yhdisteet, kemianteollisuus (63.5)
broader: KAIVANNAISTEOLLISUUS. KEMIANTEOLLISUUS
in scheme: YKL - Yleisten kirjastojen luokitusjärjestelmä
notation: 63.5
scope note: Hit allmänna verk om kemisk industri Kemisk teknologi och teknisk kemi Industriell tillverkning av kemiska ämnen och kemiska föreningar Teknokemisk industri Läkemedels- och kosmetikaindustri Industriell tillverkning av kemikalier, mediciner, skönhetsmedel samt tvätt- och rengöringsmedel Språng- och tändmedelsindustri Pyroteknik. Fyrverkeriindustri Färg- och lackindustri Målarfärger. Bläck. Färger. Lack. Lim Gödselindustri. Växtskyddsmedelsindustri Den kemiska industrins produkter för olika ändamål klassificeras enligt område @sv
scope note: Tähän kemianteollisuuden yleisteokset Kemian teknologia ja tekninen kemia Kemiallisten aineiden ja yhdisteiden teollinen valmistus Teknokemiallinen teollisuus Lääke- ja kosmetiikkateollisuus Kemikaalien, lääkkeiden, kauneudenhoitoaineiden sekä pesu- ja puhdistusaineiden teollinen valmistus Räjähdys- ja sytytysaineteollisuus Pyrotekniikka. Ilotulitusvälineteollisuus Väri-, maali- ja lakkateollisuus Maalit. Musteet. Värit. Lakat. Liimat Lannoiteteollisuus. Kasvinsuojeluaineteollisuus Kemian teollisuuden tuotteiden käyttö eri tarkoituksiin luokitetaan alan mukaan

Muovi- ja kumiteollisuus
type: Concept
References: Orgaaninen kemia. Muovien kemia
References: Orgaaniset ja fossiiliset polttoaineet
type: YKL-luokka
alternative label: Akrylplaster, plastindustri (63.7) @sv
alternative label: Akryylimuovit, muoviteollisuus (63.7)
alternative label: Armerad plast, plastindustri (63.7) @sv
alternative label: Förpackningsindustri, plastindustri (63.7) @sv
alternative label: Glasfiberplaster, plastindustri (63.7) @sv
alternative label: Gummiföremål (63.7) @sv
alternative label: Gummiindustri (63.7) @sv
alternative label: Gummiteknik (63.7) @sv
alternative label: Halvsyntetiska plaster, plastindustri (63.7) @sv
alternative label: Kemiska föreningar, gummi- och plastindustri (63.7) @sv
alternative label: Kumiesineet (63.7)
alternative label: Kumitekniikka (63.7)
alternative label: Kumiteollisuus (63.7)
alternative label: Lasikuitumuovit, muoviteollisuus (63.7)
alternative label: Lujitemuovit, muoviteollisuus (63.7)
alternative label: Luonnonkumi (63.7)
alternative label: Muoviesineet (63.7)
alternative label: Muovit, tekniikka ja teollisuus (63.7)
alternative label: Muoviteollisuus (63.7)
alternative label: Naturgummi (63.7) @sv
alternative label: Orgaanisen kemian teollisuus, kumit ja muovit (63.7)
alternative label: Organisk kemisk industri, gummi och plast (63.7) @sv
alternative label: PBC-muovit, muoviteollisuus (63.7)
alternative label: PCB-plaster, plastindustri (63.7) @sv
alternative label: PVC- plaster, plastindustri (63.7) @sv
alternative label: PVC-muovit, muoviteollisuus (63.7)
alternative label: Pakkausteollisuus, muoviteollisuus (63.7)
alternative label: Plaster, teknik och industri (63.7) @sv
alternative label: Plastföremål (63.7) @sv
alternative label: Plastindustri (63.7) @sv
alternative label: Polymeerit, muoviteollisuus (63.7)
alternative label: Polymerer, plastindustri (63.7) @sv
alternative label: Puolisynteettiset muovit, muoviteollisuus (63.7)
alternative label: Synteettiset kumit, kumiteollisuus (63.7)
alternative label: Synteettiset muovit, muoviteollisuus (63.7)
alternative label: Syntetiska gummin, gummiindustri (63.7) @sv
alternative label: Syntetiska plaster, plastindustri (63.7) @sv
alternative label: Yhdisteet, kumi- ja muoviteollisuus (63.7)
broader: KAIVANNAISTEOLLISUUS. KEMIANTEOLLISUUS
in scheme: YKL - Yleisten kirjastojen luokitusjärjestelmä
notation: 63.7
preferred label: Plast- och gummiindustri @sv
preferred label: Plastics and rubber industry @en
scope note: Hit allmänna verk om plast- och gummiindustri samt om plast- och gummiteknik Tillverkning av olika plastsorter såsom polyester, polyeten, polystyren, akryl, PVC eller PBC och användningen av dem inom industrin Armerad plast och glasfiberplast Syntetiska och halvsyntetiska plaster Syntetiskt gummi och naturgummi Hit också föremål av plast och gummi som industriprodukter i allmänhet Plast- och gummiföremål för specialändamål samt användning av dem klassificeras enligt område @sv
scope note: Tähän muovi- ja kumiteollisuuden sekä muovi- ja kumitekniikan yleisteokset Eri muovilaatujen, kuten polyesteri-, polyeteeni-, polystyreeni-, akryyli-, PVC- tai PBC-muovien valmistus ja käyttö teollisuudessa Lujite- ja lasikuitumuovit Synteettiset ja puolisynteettiset muovit Synteettinen ja luonnonkumi Tähän myös muovi- ja kumiesineet teollisuustuotteina yleensä Erikoisalojen muovi- ja kumiesineet sekä niiden käyttö luokitetaan alan mukaan

PUUNJALOSTUSTEOLLISUUS. TEKSTIILITEOLLISUUS NAHKATEOLLISUUS. HIENOMEKAANINEN TEOLLISUUS
type: Concept
References: SOVELLETUT TIETEET
type: YKL-luokka
alternative label: Industriell formgivning, resp. område (60 ... 64+) @sv
alternative label: Teollinen muotoilu, aloittain (60 ... 64+)
broader: TEKNIIKKA. TEOLLISUUS. KÄSITYÖ. MAA- JA METSÄTALOUS KOTITALOUS. LIIKETALOUS. LIIKENNE
in scheme: YKL - Yleisten kirjastojen luokitusjärjestelmä
narrower: Puunjalostusteollisuus
narrower: Tekstiili- ja vaatetusteollisuus
narrower: Nahka- ja jalkineteollisuus
narrower: Hienomekaaninen teollisuus
notation: 64
preferred label: TRÄFÖRÄDLINGSINDUSTRI. TEXTILINDUSTRI. LÄDER- OCH PÄLSVARUINDUSTRI. FINMEKANISK INDUSTRI @sv
preferred label: WOOD PROCESSING INDUSTRY. TEXTILE INDUSTRY. LEATHER INDUSTRY. FINE-MECHANICAL INDUSTRY @en
scope note: Hit allmänna verk som behandlar träförädlings-, textil-, läder- och finmekanisk industri Hit och till underklasserna företagsekonomi, produktionsmetoder, rationalisering och handel som har att göra med de aktuella industrigrenarna Om tyngdpunkten i verket ligger på en enskild industrigren ges företräde åt det ifrågavarande områdets klass @sv
scope note: Tähän yleisteokset, jotka koskevat sekä puunjalostus-, tekstiili-, nahka- että hienomekaanista teollisuutta Tähän ja alaluokkiin puunjalostus-, tekstiili-, nahka- ja hienomekaanisen teollisuuden liiketalous, tuotantomenetelmät, rationalisointi ja kauppa Jos teos painottuu johonkin tiettyyn teollisuudenalaan, annetaan etusija ko. alan luokalle

Puunjalostusteollisuus
type: Concept
References: Ympäristönsuojelu. Luonnonsuojelu
References: Ekologia. Eliömaantiede
References: Kasviekologia. Kasvimaantiede
References: Metsätalous
type: YKL-luokka
alternative label: Metsäteollisuus (64.1)
alternative label: Puu, puunjalostusteollisuus (64.1+)
alternative label: Puuhake, puunjalostusteollisuus (64.1+)
alternative label: Puulaadut, puunjalostusteollisuus (64.1+)
alternative label: Puulajit, puuteollisuus (64.1+)
alternative label: Puunjalostusteollisuus (64.1)
alternative label: Skogsindustri (64.1) @sv
alternative label: Trä, träförädlingsindustri (64.1+) @sv
alternative label: Trädarter, träindustri (64.1+) @sv
alternative label: Träflis, träförädlingsindustri (64.1+) @sv
alternative label: Träförädlingsindustri (64.1) @sv
alternative label: Träslag, träförädlingsindustri (64.1+) @sv
broader: PUUNJALOSTUSTEOLLISUUS. TEKSTIILITEOLLISUUS NAHKATEOLLISUUS. HIENOMEKAANINEN TEOLLISUUS
in scheme: YKL - Yleisten kirjastojen luokitusjärjestelmä
narrower: Puuteollisuus
narrower: Huonekaluteollisuus
narrower: Paperi- ja selluloosateollisuus
notation: 64.1
preferred label: Träförädlingsindustri @sv
preferred label: Wood processing industry @en
scope note: Hit verk som behandlar både träindustri och pappers- och massaindustri @sv
scope note: Tähän teokset, jotka koskevat sekä puuteollisuutta että paperi- ja selluloosateollisuutta

Puuteollisuus
type: Concept
References: Puutyö
References: Rakennusstatiikka. Rakennussuunnittelu
References: Rakennusaineet. Rakennustyöt
References: Metsätalous
References: Sisustusarkkitehtuuri. Huonekalutaide
type: YKL-luokka
alternative label: Bearbetning, trä (64.11) @sv
alternative label: Borrning, industriell bearbetning av trä (64.11) @sv
alternative label: Brädor, träindustri (64.11) @sv
alternative label: Byggnadssnickeriindustri (64.11) @sv
alternative label: Fiberskiveindustri (64.11) @sv
alternative label: Hyvlerier, träindustri (64.11) @sv
alternative label: Hyvling, industriell bearbetning av trä (64.11) @sv
alternative label: Höyläys, puun teollinen työstö (64.11)
alternative label: Höyläämöt, puuteollisuus (64.11)
alternative label: Impregnering, industriell behandling av trä (64.11) @sv
alternative label: Korkindustri (64.11) @sv
alternative label: Korkkiteollisuus (64.11)
alternative label: Kuitulevyteollisuus (64.11)
alternative label: Kuivaus, puun teollinen käsittely (64.11)
alternative label: Kyllästys, puun teollinen käsittely (64.11)
alternative label: Lastuava työstö, puu (64.11)
alternative label: Lastulevyteollisuus (64.11)
alternative label: Lastuvillateollisuus (64.11)
alternative label: Laudat, puuteollisuus (64.11)
alternative label: Mekaaninen puunjalostusteollisuus (64.11)
alternative label: Mekaaninen teknologia, puuteollisuus (64.11)
alternative label: Mekanisk teknologi, träindustri (64.11) @sv
alternative label: Mekanisk träförädlingsindustri (64.11) @sv
alternative label: Metsäteollisuus, mekaaninen (64.11)
alternative label: Pintakäsittely, puun teollinen työstö (64.11)
alternative label: Plywoodindustri (64.11) @sv
alternative label: Poraus, puun teollinen työstö (64.11)
alternative label: Puu, teollinen työstö (64.11)
alternative label: Puuesineet, puuteollisuus (64.11)
alternative label: Puunjalostusteollisuus, mekaaninen (64.11)
alternative label: Puuntyöstö (64.11)
alternative label: Puusepänteollisuus (64.11)
alternative label: Puutaloteollisuus (64.11)
alternative label: Puuteollisuus (64.11)
alternative label: Puuvalmisteteollisuus (64.11)
alternative label: Rakennuspuusepänteollisuus (64.11)
alternative label: Sahat, puuteollisuus (64.11)
alternative label: Sahateollisuus (64.11)
alternative label: Sahaus, puun teollinen työstö (64.11)
alternative label: Skogsindustri, mekanisk (64.11) @sv
alternative label: Snickeriindustri (64.11) @sv
alternative label: Sorvaus, puuteollisuus (64.11)
alternative label: Spånskiveindustri (64.11) @sv
alternative label: Spånskärande bearbetning, trä (64.11) @sv
alternative label: Svarvning, träindustri (64.11) @sv
alternative label: Sågar, träindustri (64.11) @sv
alternative label: Sågindustri (64.11) @sv
alternative label: Sågning, industriell bearbetning av trä (64.11) @sv
alternative label: Torkning, industriell behandling av trä (64.11) @sv
alternative label: Trä, industriell bearbetning (64.11) @sv
alternative label: Träbearbetning (64.11) @sv
alternative label: Träföremål, träindustri (64.11) @sv
alternative label: Träförädlingsindustri, mekanisk (64.11) @sv
alternative label: Trähusindustri (64.11) @sv
alternative label: Träindustri (64.11) @sv
alternative label: Träproduktindustri (64.11) @sv
alternative label: Träullsindustri (64.11) @sv
alternative label: Tulitikkuteollisuus (64.11)
alternative label: Työstö, puu (64.11)
alternative label: Tändsticksindustri (64.11) @sv
alternative label: Vaneriteollisuus (64.11)
alternative label: Ytbehandling, bearbetning av trä (64.11) @sv
broader: Puunjalostusteollisuus
in scheme: YKL - Yleisten kirjastojen luokitusjärjestelmä
notation: 64.11
preferred label: Industrial manufacture of wood and wood products, except furniture @en
preferred label: Träindustri @sv
scope note: Bearbetning och hantering av trä Mekanisk träförädlingsindustri Träslag ur träindustrins och bearbetningens synvinkel Sågning, hyvling, torkning, impregnering och ytbehandling av trä Sågindustri. Sågar. Hyvlerier. Plywoodfabriker Snickeriindustri. Byggnadssnickeriindustri Tillverkning av träprodukter. Trähusindustri Träindustrins råmaterial, teknik, maskiner och arbeten Träindustrins produkter Bräder. Faner och plywood. Fiberskivor. Spånskivor. Träull Korkindustri Hit också träföremål som industriprodukter i allmänhet Träföremål för specialområden och användningen av dem klassificeras enligt område @sv
scope note: Puun työstö ja käsittely Mekaaninen puunjalostusteollisuus Puulaadut puuteollisuuden ja puun työstön kannalta Puun sahaus, höyläys, kuivaus, kyllästys ja pintakäsittely Sahateollisuus. Sahat. Höyläämöt. Vaneritehtaat Puusepänteollisuus. Rakennuspuusepänteollisuus Puuvalmisteteollisuus. Puutaloteollisuus Puuteollisuuden raaka-aineet, tekniikka, koneet ja työt Puuteollisuuden tuotteet Laudat. Vanerit. Kuitulevyt. Lastulevyt. Lastuvilla Korkkiteollisuus Tähän myös puuesineet teollisuustuotteina yleensä Erikoisalojen puuesineet ja niiden käyttö luokitetaan alan mukaan

Huonekaluteollisuus
type: Concept
References: Huonekalujen rakentaminen
References: Sisustusoppaat
References: Sisustusarkkitehtuuri. Huonekalutaide
type: YKL-luokka
alternative label: Huonekalut, teollisuus ja kauppa (64.12)
alternative label: Huonekalut, verhoilu, teollinen (64.12)
alternative label: Huonekaluteollisuus (64.12)
alternative label: Mekaaninen puunjalostusteollisuus, huonekalut (64.12)
alternative label: Mekanisk träförädlingsindustri, möbler (64.12) @sv
alternative label: Metsäteollisuus, huonekalut (64.12)
alternative label: Möbelbeklädnad, industriell (64.12) @sv
alternative label: Möbelindustri (64.12) @sv
alternative label: Möbler, industri och handel (64.12) @sv
alternative label: Puunjalostusteollisuus, huonekalut (64.12)
alternative label: Puusepänteollisuus, huonekalut (64.12)
alternative label: Puuteollisuus, huonekalut (64.12)
alternative label: Puuvalmisteteollisuus, huonekalut (64.12)
alternative label: Skogsindustri, möbler. (64.12) @sv
alternative label: Snickeriindustri, möbler (64.12) @sv
alternative label: Tapetserarverkstäder (64.12) @sv
alternative label: Träförädlingsindustri, möbler (64.12) @sv
alternative label: Träindustri, möbler (64.12) @sv
alternative label: Träproduktindustri, möbler (64.12) @sv
alternative label: Verhoomot (64.12)
broader: Puunjalostusteollisuus
in scheme: YKL - Yleisten kirjastojen luokitusjärjestelmä
notation: 64.12
preferred label: Industrial manufacture of furniture @en
preferred label: Möbelindustri @sv
scope note: Hit industriell tillverkning av möbler oavsett material Hit också tapetserarverkstäder @sv
scope note: Tähän huonekalujen teollinen valmistus huonekalujen materiaalista riippumatta Tähän myös verhoomot

Paperi- ja selluloosateollisuus
type: Concept
References: Kirjapainotaito. Graafinen teollisuus
References: Kemianteollisuus
References: Paperi- ja pahvityöt
References: Rakennusaineet. Rakennustyöt
References: Jätehuolto. Kierrätys
References: Metsätalous
References: Sisustusarkkitehtuuri. Huonekalutaide
References: Paperitaide
type: YKL-luokka
alternative label: Arkkipaperi, paperiteollisuus (64.13)
alternative label: Arkpapper, pappersindustri (64.13) @sv
alternative label: Blekning, pappersindustri (64.13) @sv
alternative label: Cellulosaindustri (64.13) @sv
alternative label: Förpackningsindustri, pappers- och kartongindustri (64.13) @sv
alternative label: Hioke, puunjalostusteollisuus (64.13)
alternative label: Kartongindustri (64.13) @sv
alternative label: Kartonkiteollisuus (64.13)
alternative label: Kemiallinen puunjalostusteollisuus (64.13)
alternative label: Kemisk träförädlingsindustri (64.13) @sv
alternative label: Laatikot, pakkausteollisuus (64.13)
alternative label: Lådor, förpackningsindustri (64.13) @sv
alternative label: Metsäteollisuus, paperi- ja selluloosateollisuus (64.13)
alternative label: Pahvipakkaukset, pahviteollisuus (64.13)
alternative label: Pahviteollisuus (64.13)
alternative label: Pakkausteollisuus, paperi- ja pahviteollisuus (64.13)
alternative label: Paperi, valmistus, teollinen (64.13)
alternative label: Paperilaadut, paperiteollisuus (64.13)
alternative label: Paperimassateollisuus (64.13)
alternative label: Paperipakkaukset, paperiteollisuus (64.13)
alternative label: Paperiteollisuus (64.13)
alternative label: Papper, industriell tillverkning (64.13) @sv
alternative label: Pappersförpackningar, pappersindustri (64.13) @sv
alternative label: Pappersindustri (64.13) @sv
alternative label: Pappersmassaindustri (64.13) @sv
alternative label: Papperssorter, pappersindustri (64.13) @sv
alternative label: Pappförpackningar, pappindustri (64.13) @sv
alternative label: Pappindustri (64.13) @sv
alternative label: Puuhioke (64.13)
alternative label: Puuhiomot (64.13)
alternative label: Puukemia (64.13)
alternative label: Puunjalostusteollisuus, kemiallinen (64.13)
alternative label: Rullapaperi, paperiteollisuus (64.13)
alternative label: Rullpapper, pappersindustri (64.13) @sv
alternative label: Selluloosateollisuus (64.13)
alternative label: Skogsindustri, pappers- och cellulosaindustri (64.13) @sv
alternative label: Slipmassa (64.13) @sv
alternative label: Slipmassa, träförädlingsindustri (64.13) @sv
alternative label: Tapetindustri (64.13) @sv
alternative label: Tapettiteollisuus (64.13)
alternative label: Terva, puunjalostusteollisuus (64.13)
alternative label: Tjära, träförädlingsindustri (64.13) @sv
alternative label: Träförädlingsindustri, kemisk (64.13) @sv
alternative label: Träkemi (64.13) @sv
alternative label: Träsliperier (64.13) @sv
alternative label: Valkaisu, paperiteollisuus (64.13)
broader: Puunjalostusteollisuus
in scheme: YKL - Yleisten kirjastojen luokitusjärjestelmä
notation: 64.13
preferred label: Paper and pulp industry @en
preferred label: Pappers- och massaindustri @sv
scope note: Kemiallinen puunjalostusteollisuus. Puukemia Paperi- ja selluloosateollisuuden raaka-aineet, tekniikka, koneet, työt ja prosessit Paperi- ja selluloosateollisuuden tuotteet Selluloosa. Paperimassa. Hioke Paperi-, kartonki- ja pahvilaadut ja niiden valmistus Paperin koostumus. Rullapaperi. Arkkipaperi Paperi- ja pahvipakkausten sekä tapettien teollinen valmistus
scope note: Kemisk träförädlingsindustri. Träkemi Pappers- och massaindustrins råmaterial, teknik, maskiner, arbeten och processer Pappers- och massaindustrins produkter Cellulosa. Pappersmassa. Slipmassa Pappers-, kartong- och pappsorter och tillverkning av dem Papperets sammansättning. Rullpapper. Arkpapper Industriell tillverkning av pappers- och kartongförpackningar samt tapeter @sv

Tekstiili- ja vaatetusteollisuus
type: Concept
References: KANSATIEDE. KULTTUURIANTROPOLOGIA
References: Nahka- ja jalkineteollisuus
References: Tekstiilityö
References: Vaatteiden pesu ja hoito
References: Tilataide. Ympäristötaide
References: Tekstiilitaide
References: Muoti ja muodin historia
alternative label: Accessoarer, beklädnadsindustri (64.3) @sv
alternative label: Asusteet, vaatetusteollisuus (64.3)
alternative label: Babykläder, textilindustri (64.3) @sv
alternative label: Barnkläder, textilindustri (64.3) @sv
alternative label: Beklädnadsindustri (64.3) @sv
alternative label: Blekning, textilindustri (64.3) @sv
alternative label: Bomull, textil- och beklädnadsindustri (64.3) @sv
alternative label: Dräkter, beklädnadsindustri (64.3) @sv
alternative label: Fibrer, textilindustri (64.3) @sv
alternative label: Filtar, textilindustri (64.3) @sv
alternative label: Färgning, textilindustri (64.3) @sv
alternative label: Gardiner, textilindustri (64.3) @sv
alternative label: Garn, textilindustri (64.3) @sv
alternative label: Huovat, tekstiiliteollisuus (64.3)
alternative label: Kankaankudonta, tekstiiliteollisuus (64.3)
alternative label: Kankaanpainanta, tekstiiliteollisuus (64.3)
alternative label: Kankaat, tekstiiliteollisuus (64.3)
alternative label: Kardning, textilindustri (64.3) @sv
alternative label: Karstaus, tekstiiliteollisuus (64.3)
alternative label: Kehrääminen, tekstiiliteollisuus (64.3)
alternative label: Keinokuidut, tekstiiliteollisuus (64.3)
alternative label: Kläddesign, industriell (64.3) @sv
alternative label: Kläder, beklädnadsindustri (64.3) @sv
alternative label: Kläder, säkerhetsegenskaper (64.3) @sv
alternative label: Kläder, textilindustri (64.3) @sv
alternative label: Kläduthyrningsfirmor (64.3) @sv
alternative label: Konstfibrer, textilindustri (64.3) @sv
alternative label: Kudonta, tekstiiliteollisuus (64.3)
alternative label: Kuidut, tekstiiliteollisuus (64.3)
alternative label: Kutomateollisuus (64.3)
alternative label: Kutominen, tekstiiliteollisuus (64.3)
alternative label: Langat, tekstiiliteollisuus (64.3)
alternative label: Lapptäcken, textilindustri (64.3) @sv
alternative label: Lastenvaatteet, tekstiiliteollisuus (64.3)
alternative label: Luonnonkuidut, tekstiiliteollisuus (64.3)
alternative label: Mallin työ (64.3)
alternative label: Mannekiinin työ (64.3)
alternative label: Matot, mattoteollisuus (64.3)
alternative label: Mattoteollisuus (64.3)
alternative label: Muotipiirustus (64.3)
alternative label: Nahkateollisuus, vaatteet ja asusteet (64.3)
alternative label: Nahkavaatteet, vaatetusteollisuus (64.3)
alternative label: Neulonta, tekstiiliteollisuus (64.3)
alternative label: Ompelu, tekstiiliteollisuus (64.3)
alternative label: Pellavateollisuus (64.3)
alternative label: Piirustus, muotipiirustus (64.3)
alternative label: Pukuvuokraamot (64.3)
alternative label: Puuvilla, tekstiili- ja vaatetusteollisuus (64.3)
alternative label: Puvut, vaatetusteollisuus (64.3)
alternative label: Silkki, tekstiiliteollisuus (64.3)
alternative label: Tekokuidut, tekstiiliteollisuus (64.3)
alternative label: Tekonahkateollisuus, vaatteet (64.3)
alternative label: Tekstiilikemia (64.3)
alternative label: Tekstiilikuidut, tekstiiliteollisuus (64.3)
alternative label: Tekstiiliteollisuus (64.3)
alternative label: Tilkkutyöt, tekstiiliteollisuus (64.3)
alternative label: Trikooteollisuus (64.3)
alternative label: Vaatesuunnittelu, teollinen (64.3)
alternative label: Vaatetusteollisuus (64.3)
alternative label: Vaatteet, tekstiiliteollisuus (64.3)
alternative label: Vaatteet, turvallisuusominaisuudet (64.3)
alternative label: Vaatteet, vaatetusteollisuus (64.3)
alternative label: Valkaisu, tekstiiliteollisuus (64.3)
alternative label: Vauvanvaatteet, tekstiiliteollisuus (64.3)
alternative label: Verhot, tekstiiliteollisuus (64.3)
alternative label: Villateollisuus (64.3)
alternative label: Värjäys, tekstiiliteollisuus (64.3)
broader: PUUNJALOSTUSTEOLLISUUS. TEKSTIILITEOLLISUUS NAHKATEOLLISUUS. HIENOMEKAANINEN TEOLLISUUS
in scheme: YKL - Yleisten kirjastojen luokitusjärjestelmä
notation: 64.3
scope note: Tekstiili- ja vaatetusteollisuuden raaka-aineet, tekniikka, koneet ja työt Tekstiili- ja vaatetusteollisuuden tuotteet Teollinen vaatesuunnittelu. Muotipiirustus. Mallin työ Vaatteiden ominaisuudet ja turvallisuusominaisuudet Luonnon- ja tekokuitujen valmistus ja käsittely Karstaus, kehruu, kutominen, valkaisu, värjäys, painanta ja viimeistely tekstiili- ja vaatetusteollisuudessa Tekstiilikuitujen, lankojen, kankaiden, mattojen, huopien ja vaatteiden teollinen valmistus Tähän myös teokset, jotka koskevat sekä tekstiili- tai vaatetusteollisuutta että nahka-tai jalkineteollisuutta
scope note: Textil- och beklädnadsindustrins råmaterial, teknik, maskiner och arbeten Textil- och beklädnadsindustrins produkter Industriell klädformgivning. Modeteckning. Mannekängens arbete Egenskaper och säkerhetsegenskaper hos kläder Tillverkning och hantering av natur- och konstfiber Kardning, spinning, vävning, blekning, färgning, tryck och appretering inom textil- och beklädnadsindustri Industriell framställning av textilfibrer, tråd och garn, tyger, mattor, filtar och kläder Hit också verk som behandlar både textil- eller beklädnadsindustri och läder- eller skoindustri @sv

Nahka- ja jalkineteollisuus
type: Concept
References: KANSATIEDE. KULTTUURIANTROPOLOGIA
References: Nahkatyö
References: Tekstiilitaide
References: Muoti ja muodin historia
type: YKL-luokka
alternative label: Chinchilla, pälsvaruindustri (64.4) @sv
alternative label: Chinchillat, turkisteollisuus (64.4)
alternative label: Garvning, läderindustri (64.4) @sv
alternative label: Harmöss, pälsvaruindustri (64.4) @sv
alternative label: Hudar, skinnindustri (64.4) @sv
alternative label: Jalkineet (64.4)
alternative label: Jalkineteollisuus (64.4)
alternative label: Kengät, kenkäteollisuus (64.4)
alternative label: Kenkäteollisuus (64.4)
alternative label: Läderindustri (64.4) @sv
alternative label: Nahkateollisuus (64.4)
alternative label: Parkitus, nahkateollisuus (64.4)
alternative label: Pälsar, pälsindustri (64.4) @sv
alternative label: Pälshandel (64.4) @sv
alternative label: Pälsindustri (64.4) @sv
alternative label: Sinsillat, turkisteollisuus (64.4)
alternative label: Skinnindustri (64.4) @sv
alternative label: Skodon (64.4) @sv
alternative label: Skoindustri (64.4) @sv
alternative label: Skor, skoindustri (64.4) @sv
alternative label: Syntetläderindustri (64.4) @sv
alternative label: Tekonahkateollisuus (64.4)
alternative label: Turkikset, turkisteollisuus (64.4)
alternative label: Turkiskauppa (64.4)
alternative label: Turkisteollisuus (64.4)
alternative label: Vuodat, vuotateollisuus (64.4)
alternative label: Vuotateollisuus (64.4)
broader: PUUNJALOSTUSTEOLLISUUS. TEKSTIILITEOLLISUUS NAHKATEOLLISUUS. HIENOMEKAANINEN TEOLLISUUS
in scheme: YKL - Yleisten kirjastojen luokitusjärjestelmä
notation: 64.4
preferred label: Leather and shoe industry @en
preferred label: Läder- och pälsvaruindustri. Skoindustri @sv
scope note: Läder- och pälsvaruindustrins samt skoindustrins råmaterial, teknik, maskiner och arbeten Läder-, pälsvaru- och skoindustrins produkter Hit också bearbetning av djurhudar samt tillverkning av konstläder och syntetpälsar Om verket behandlar både läder-, pälsvaru- eller skoindustri och textil eller beklädnadsindustri, ges företräde åt klass 64.3. @sv
scope note: Nahka- jalkineteollisuuden raaka-aineet, tekniikka, koneet ja työt Nahka- ja jalkineteollisuuden tuotteet Tähän myös tekonahka-, turkis- ja vuotateollisuus Jos teos koskee sekä nahka- tai jalkineteollisuutta että tekstiili- tai vaatetusteollisuutta, annetaan etusija luokalle 64.3

Hienomekaaninen teollisuus
type: Concept
References: Tietokoneet
References: Säätö- ja systeemitekniikka. Teollinen automaatio
References: Tietoliikenne. Viestintätekniikka. Multimedia
References: Tekstiilityö
References: Huonetilojen ja irtaimiston hoito
References: Toimistotyö. Toimistotekniikka
type: YKL-luokka
alternative label: Apparater, finmekanisk industri (64.5+) @sv
alternative label: Bakmaskiner, industriell tillverkning (64.5) @sv
alternative label: Barometrar, finmekanisk industri (64.5) @sv
alternative label: Barometrit, hienomekaaninen teollisuus (64.5)
alternative label: Dammsugare, industriell tillverkning (64.5) @sv
alternative label: Finmekanik (64.5+) @sv
alternative label: Finmekanisk industri (64.5+) @sv
alternative label: Finmekaniska instrument och apparatur (64.5+) @sv
alternative label: Fotokopieringsmaskiner, finmekanisk industri (64.5) @sv
alternative label: Hienomekaaninen teollisuus (64.5+)
alternative label: Hienomekaaniset instrumentit ja laitteet (64.5+)
alternative label: Hienomekaniikka (64.5+)
alternative label: Hushållsmaskinindustri (64.5) @sv
alternative label: Ilmapuntarit, hienomekaaninen teollisuus (64.5)
alternative label: Instrument, finmekanisk industri (64.5+) @sv
alternative label: Instrumentit, hienomekaaninen teollisuus (64.5+)
alternative label: Kassaapparater, industriell framställning (64.5) @sv
alternative label: Kassakoneet, teollinen valmistus (64.5)
alternative label: Kassapäätteet, teollinen valmistus (64.5)
alternative label: Kassaterminaler, industriell framställning (64.5) @sv
alternative label: Kirjoituskoneteollisuus (64.5)
alternative label: Kodinkoneteollisuus (64.5)
alternative label: Kojeet, hienomekaaninen teollisuus (64.5+)
alternative label: Kompasser, finmekanik (64.5) @sv
alternative label: Kompassit, hienomekaniikka (64.5)
alternative label: Kontorsmaskinindustri (64.5) @sv
alternative label: Konttorikoneteollisuus, (64.5)
alternative label: Kopieringsmaskinindustri (64.5) @sv
alternative label: Kopiokoneteollisuus (64.5)
alternative label: Kotitalouskoneteollisuus (64.5)
alternative label: Leipäkoneet, teollinen valmistus (64.5)
alternative label: Liedet, teollinen valmistus (64.5)
alternative label: Lämpömittarit, hienomekaaninen teollisuus (64.5)
alternative label: Neulekoneteollisuus (64.5)
alternative label: Ompelukoneteollisuus (64.5)
alternative label: Ordbehandlare, finmekanisk industri (64.5) @sv
alternative label: Pesukoneteollisuus (64.5)
alternative label: Pölynimurit, teollinen valmistus (64.5)
alternative label: Sanojenkäsittelylaitteet, hienomekaaninen teollisuus (64.5)
alternative label: Siivouskoneet, teollinen valmistus (64.5)
alternative label: Silityslaitteet, teollinen valmistus (64.5)
alternative label: Skrivmaskinsindustri (64.5) @sv
alternative label: Spisar, industriell tillverkning (64.5) @sv
alternative label: Stickmaskinindustri (64.5) @sv
alternative label: Strykmaskiner, industriell tillverkning (64.5) @sv
alternative label: Städmaskiner, industriell tillverkning (64.5) @sv
alternative label: Symaskinindustri (64.5) @sv
alternative label: Tekstinkäsittelylaitteet, hienomekaaninen teollisuus (64.5)
alternative label: Termometer, finmekanisk industri (64.5) @sv
alternative label: Termometrar, finmekanisk industri (64.5) @sv
alternative label: Termometrit, hienomekaaninen teollisuus (64.5)
alternative label: Termostaatit, hienomekaaninen teollisuus (64.5)
alternative label: Termostater, finmekanisk industri (64.5) @sv
alternative label: Textbehandlare, finmekanisk industri (64.5) @sv
alternative label: Tvättmaskinindustri (64.5) @sv
alternative label: Valokopiokoneet, hienomekaaninen teollisuus (64.5)
broader: PUUNJALOSTUSTEOLLISUUS. TEKSTIILITEOLLISUUS NAHKATEOLLISUUS. HIENOMEKAANINEN TEOLLISUUS
in scheme: YKL - Yleisten kirjastojen luokitusjärjestelmä
narrower: Optiset ja lääketieteelliset laitteet
narrower: Soitinrakennus
narrower: Kelloteollisuus
notation: 64.5
preferred label: Finmekanisk industri @sv
preferred label: Precision industry @en
scope note: Hit allmänna verk om finmekanisk industri och finmekanik Den finmekaniska industrins teknik, maskiner och arbeten Den finmekaniska industrins produkter Tillverkning av apparater, maskiner, anordningar och instrument för den finmekaniska industrin Kontorsmaskinsindustri och hushållsmaskinsindustri Tillverkning av skriv- och räknemaskiner, textbehandlare och kopiatorer Tillverkning av sy-, stick- och hushållsmaskiner Användningen av finmekaniska apparater klassificeras enligt område @sv
scope note: Tähän hienomekaanisen teollisuuden ja hienomekaniikan yleisteokset Hienomekaanisen teollisuuden tekniikka, koneet ja työt Hienomekaanisen teollisuuden tuotteet Hienomekaanisten kojeiden, koneiden, laitteiden ja instrumenttien valmistus Toimisto- ja kodinkoneteollisuus Kirjoituskoneiden, tekstinkäsittelylaitteiden ja kopiokoneiden valmistus Ompelu-, neule- ja kotitalouskoneiden valmistus Hienomekaanisten laitteiden käyttö luokitetaan alan mukaan

Optiset ja lääketieteelliset laitteet
type: Concept
References: Tähtitieteelliset kojeet
References: Yleinen mikrobiologia
References: Sairaalatekniikka
References: Sairaiden ja vammaisten apuvälineet
References: Elimet. Taudit
References: Valokuvauksen tekniikka. Valokuvausoppaat
References: Elokuvatekniikka
type: YKL-luokka
alternative label: Artificiella organ, finmekanisk industri (64.52) @sv
alternative label: Digitaalikamerat, optinen teollisuus (64.52)
alternative label: Digitalkameror, optisk industri (64.52) @sv
alternative label: Elektronimikroskopia (64.52)
alternative label: Elektronmikroskopi (64.52) @sv
alternative label: Glasögon, optikerns arbete (64.52) @sv
alternative label: Glasögon, optisk industri (64.52) @sv
alternative label: Handikapphjälpmedel, finmekanisk industri (64.52) @sv
alternative label: Hjälpmedel för sjuka, finmekanisk industri (64.52) @sv
alternative label: Holografi, teknik (64.52) @sv
alternative label: Holografia, tekniikka (64.52)
alternative label: Hörapparater, finmekanisk industri (64.52) @sv
alternative label: Kamerat, optinen teollisuus (64.52)
alternative label: Kameror, optisk industri (64.52) @sv
alternative label: Kaukoputket, optinen teollisuus (64.52)
alternative label: Kiikarit, optinen teollisuus (64.52)
alternative label: Kikare, optisk industri (64.52) @sv
alternative label: Kuulolaitteet, hienomekaaninen teollisuus (64.52)
alternative label: Linser, optisk industri (64.52) @sv
alternative label: Linssit, optinen teollisuus (64.52)
alternative label: Lääketieteelliset laitteet, hienomekaaninen teoll. (64.52)
alternative label: Medicinsk apparatur, finmekanisk industri (64.52) @sv
alternative label: Mikroskoopit, optinen teollisuus (64.52)
alternative label: Mikroskop, optisk industri (64.52) @sv
alternative label: Mikroskopi (64.52) @sv
alternative label: Mikroskopia (64.52)
alternative label: Objektiivit, optinen teollisuus (64.52)
alternative label: Objektiv, optisk industri (64.52) @sv
alternative label: Optiikka, hienomekaniikka (64.52)
alternative label: Optik, finmekanik (64.52) @sv
alternative label: Optikerns arbete (64.52) @sv
alternative label: Optikon työ (64.52)
alternative label: Optinen tekniikka (64.52)
alternative label: Optinen teollisuus (64.52)
alternative label: Optiset laitteet, hienomekaniikka (64.52)
alternative label: Optisk industri (64.52) @sv
alternative label: Optisk teknik (64.52) @sv
alternative label: Optiska apparater, finmekanik (64.52) @sv
alternative label: Prismat, optinen teollisuus (64.52)
alternative label: Prismer, optisk industri (64.52) @sv
alternative label: Proteesit, hienomekaaninen teollisuus (64.52)
alternative label: Proteser, finmekanisk industri (64.52) @sv
alternative label: Pyörätuolit, hienomekaaninen teollisuus (64.52)
alternative label: Rullstolar, finmekanisk industri (64.52) @sv
alternative label: Sairaiden apuvälineet, hienomekaaninen teollisuus (64.52)
alternative label: Silmälasit, optikon työ (64.52)
alternative label: Silmälasit, optinen teollisuus (64.52)
alternative label: Tekoelimet, hienomekaaninen teollisuus (64.52)
alternative label: Teleskop, optisk industri (64.52) @sv
alternative label: Vammaisten apuvälineet, hienomekaaninen teollisuus (64.52)
broader: Hienomekaaninen teollisuus
in scheme: YKL - Yleisten kirjastojen luokitusjärjestelmä
notation: 64.52
preferred label: Optical and medical instruments @en
preferred label: Optiska och medicinska instrument och apparater @sv
scope note: Industriell tillverkning av instrument och apparater som används vid medicinsk behandling och undersökning. Optisk industri Tillverkning av kikare, teleskop, mikroskop, kameror och objektiv Glasögontillverkning. Optikerns arbete Tillverkning av hörapparater, proteser, rullstolar och andra hjälpmedel för handikappade Användning av optiska och medicinska apparater klassificeras enligt område @sv
scope note: Lääketieteelliseen hoitoon ja tutkimukseen liittyvien laitteiden teollinen valmistus. Optinen teollisuus Kiikareiden, kaukoputkien, mikroskooppien, kameroiden ja linssien valmistus Silmälasien valmistus. Optikon työ Kuulokojeiden, proteesien, pyörätuolien ja muiden vammaisten apuvälineiden valmistus Optisten ja lääketieteellisten laitteiden käyttö luokitetaan alan mukaan

Soitinrakennus
type: Concept
References: Yhtye- ja orkesterimusiikki
References: Kosketinsoitinmusiikki. Näppäilysoitinmusiikki
References: Jousisoitinmusiikki
References: Puhallinsoitinmusiikki. Lyömäsoitinmusiikki. Muilla soittimilla esitetty musiikki. Elektroakustinen musiikki. Musiikkikulttuurien sulautumat. Populaarimusiikki
type: YKL-luokka
alternative label: Instrumentbygge (64.54) @sv
alternative label: Instrumentbyggeri (64.54) @sv
alternative label: Instrumentindustri (64.54) @sv
alternative label: Instrumentteknologi (64.54) @sv
alternative label: Instrumentunderhåll (64.54) @sv
alternative label: Ljudåtergivningsanordningar, instrumentbygge (64.54) @sv
alternative label: Musikinstrument, instrumentbyggeri (64.54) @sv
alternative label: Musikinstrument, musikinstrumentindustri (64.54) @sv
alternative label: Soitinhuolto (64.54)
alternative label: Soitinrakennus (64.54)
alternative label: Soitinteknologia (64.54)
alternative label: Soitinteollisuus (64.54)
alternative label: Soittimet, soitinrakennus (64.54)
alternative label: Soittimet, soitinteollisuus (64.54)
alternative label: Äänentoistolaitteet, soitinrakennus (64.54)
broader: Hienomekaaninen teollisuus
in scheme: YKL - Yleisten kirjastojen luokitusjärjestelmä
notation: 64.54
preferred label: Instrumentbyggnad @sv
preferred label: Manufacture of musical instruments @en
scope note: Hit hantverksmässig och industriell tillverkning av akustiska, elektriska och elektroniska musikinstrument Hit instrumentbyggnad och arbetsbeskrivningar för instrumentbyggnad oavsett byggnadsmaterial Om verket behandlar instrument ur flera olika synvinklar, ges företräde åt klass 78+ @sv
scope note: Tähän akustisten, sähköisten ja elektronisten soitinten valmistus käsityönä tai teollisesti Tähän soitinrakennus ja soitinten rakennusohjeet valmistusmateriaalista riippumatta Jos teos koskee soittimia useasta eri näkökulmasta, annetaan etusija luokalle 78+

Kelloteollisuus
type: Concept
References: Ajanlasku
References: Taidetaonta. Korutaide
type: YKL-luokka
alternative label: Guldklockor (64.57) @sv
alternative label: Kellosepän työ (64.57)
alternative label: Kellot (64.57)
alternative label: Kelloteollisuus (64.57)
alternative label: Klockindustri (64.57) @sv
alternative label: Klockor (64.57) @sv
alternative label: Kultakellot (64.57)
alternative label: Urmakarens arbete (64.57) @sv
broader: Hienomekaaninen teollisuus
in scheme: YKL - Yleisten kirjastojen luokitusjärjestelmä
notation: 64.57
preferred label: Urindustri @sv
preferred label: Watch and clock industry @en
scope note: Hit hantverksmässig och industriell tillverkning av ur Urmakarens arbete. Urmakeriindustri Hit också klockor som antikföremål Om verket behandlar både urmakarens och guldsmedens arbete, ges företräde åt klass 64.57 @sv
scope note: Tähän kellojen valmistus käsityönä tai teollisesti Kellosepän työ. Kellosepänteollisuus Tähän myös kellot antiikkiesineinä Jos teos koskee sekä kello- että kultasepän työtä, annetaan etusija luokalle 64.57

KÄSITYÖ. KOTITEOLLISUUS
type: Concept
References: KANSATIEDE. KULTTUURIANTROPOLOGIA
References: Tekniikka ja sovelletut tieteet harrasteena
References: Liikennevälineiden pienoismallit
References: Hienomekaaninen teollisuus
References: MUOTOILU. TAIDETEOLLISUUS. TAIDEKÄSITYÖ
References: Lentourheilu
References: Pelit. Leikit. Keräily
References: Muoti ja muodin historia
alternative label: Ajanviete, askartelu (65+)
alternative label: Ajanviete, käsityö (65+)
alternative label: Askartelu (65+)
alternative label: Askartelu, käsityö (65+)
alternative label: Bearbetning, hantverk och hobby (65+) @sv
alternative label: Benarbetsbeskrivningar och -modeller (65) @sv
alternative label: Cosplay, allm. (30.12) @sv
alternative label: Cosplay, asujen valmistus (65+)
alternative label: Cosplay, tillverkning av dräkter (65+) @sv
alternative label: Cosplay, yl. (30.12)
alternative label: Drakar, byggande (65) @sv
alternative label: Entistäminen, käsityöohjeet (65+)
alternative label: Entisöinti, käsityöohjeet (65+)
alternative label: Furry, asujen valmistus (65+)
alternative label: Furry, tillverkning av dräkter (65+) @sv
alternative label: Handarbeten (65+) @sv
alternative label: Handarbetsbeskrivningar (65+) @sv
alternative label: Handarbetsmönster (65+) @sv
alternative label: Hantverk (65+) @sv
alternative label: Hantverksyrken (65+) @sv
alternative label: Harrastukset, askartelu (65+)
alternative label: Harrastukset, käsityö (65+)
alternative label: Hemslöjd (65+) @sv
alternative label: Hemslöjdsrådgivning (65+) @sv
alternative label: Hobbyarbete (65+) @sv
alternative label: Hobbyarbete, handarbete (65+) @sv
alternative label: Hobbyer, handarbete (65+) @sv
alternative label: Hobbyer, pyssel (65+) @sv
alternative label: Inramning (65+) @sv
alternative label: Joulukoristeet, käsityöohjeet ja -mallit (65+)
alternative label: Jouluseimet, askartelu (65+)
alternative label: Kehystys (65+)
alternative label: Kivi, askarteluohjeet ja -mallit (65)
alternative label: Konservointi, käsityöohjeet (65+)
alternative label: Koristeet, käsityöohjeet ja -mallit (65+)
alternative label: Korut, käsityöohjeet ja -mallit (65+)
alternative label: Kotiteollisuus (65+)
alternative label: Kotiteollisuusneuvonta (65+)
alternative label: Käsiteollisuus (65+)
alternative label: Käsityöammatit (65+)
alternative label: Käsityömallit (65+)
alternative label: Käsityöohjeet (65+)
alternative label: Käsityöt (65+)
alternative label: Leijat, rakentaminen (65)
alternative label: Luutyöohjeet ja -mallit (65)
alternative label: Painokuvat, askarteluohjeet ja -mallit (65)
alternative label: Pintakäsittely, askarteluohjeet (65+)
alternative label: Puuhakirjat, askartelu (65+)
alternative label: Pääsiäiskoristeet, käsityöohjeet ja -mallit (65+)
alternative label: Restaurointi, käsityöohjeet (65+)
alternative label: Saippua, kotivalmistus (65)
alternative label: Seimet, askartelu (65+)
alternative label: Skräppäys (65+)
alternative label: Tehtäväkirjat, askartelu (65+)
alternative label: Turri, asujen valmistus (65+)
alternative label: Työkalut, käsityö- ja askarteluohjeet (65+)
alternative label: Työstö, käsityö- ja askarteluohjeet (65+)
broader: TEKNIIKKA. TEOLLISUUS. KÄSITYÖ. MAA- JA METSÄTALOUS KOTITALOUS. LIIKETALOUS. LIIKENNE
in scheme: YKL - Yleisten kirjastojen luokitusjärjestelmä
narrower: Puutyö
narrower: Metallityö
narrower: Nahkatyö
narrower: Tekstiilityö
narrower: Paperi- ja pahvityöt
narrower: Muovailu. Keramiikkatyöt
narrower: Lasimaalaus. Posliinimaalaus
narrower: Leikkikalut
narrower: Muut käsityöt
notation: 65
scope note: Hit allmänna verk om handarbete, hemslöjd och hobbyverksamhet av hantverksnatur. Hit och till underklasserna handarbetsbeskrivningar och handarbetsmönster. Hit och till underklasserna tillverkning för hand av smycken och prydnader, t.ex. jul- och påskprydnader. Hit också byggande av drakar. Hit och till underklasserna också hantverkaryrken. Pyssel och hobbyverksamhet inom specialområden klassificeras enligt område. Om verket innehåller både handarbetsbeskrivningar och etnologi eller kulturhistoria, ges företräde åt klass 65+. Om verket innehåller både handarbete eller hemslöjd och industri, ges företräde åt klasserna för industri 60-64+. Om verket innehåller både handarbetsbeskrivningar och konstindustri eller formgivning, ges företräde åt klass 65+. Skråväsen och gillen 65.09 @sv
scope note: Tähän käsityön, kotiteollisuuden ja käsityönluonteisen askartelun yleisteokset. Tähän ja alaluokkiin käsityöohjeet ja käsityömallit. Tähän ja alaluokkiin korujen ja koristeiden, esim. joulu- tai pääsiäiskoristeiden, valmistus käsityönä. Tähän myös leijojen rakentaminen. Tähän ja alaluokkiin myös käsityöammatit. Erikoisalojen askartelu ja harrasteet luokitetaan alan mukaan Jos teoksessa on sekä käsityöohjeita että kansatiedettä tai kulttuurihistoriaa, annetaan etusija luokalle 65+. Jos teoksessa on sekä käsityötä tai kotiteollisuutta että varsinaista teollisuutta, annetaan etusija varsinaisen teollisuuden luokille 60-64+. Jos teoksessa on sekä käsityöohjeita että taideteollisuutta tai muotoilua, annetaan etusija luokalle 65+. Kilta- ja ammattikuntalaitos 65.09

Puutyö
type: Concept
References: KANSATIEDE. KULTTUURIANTROPOLOGIA
References: Puuteollisuus
References: Rakennusaineet. Rakennustyöt
References: Sisustusarkkitehtuuri. Huonekalutaide
type: YKL-luokka
alternative label: Borrning, snickeriarbetsbeskrivningar (65.1+) @sv
alternative label: Brädor, träarbetsbeskrivningar (65.1+) @sv
alternative label: Hyvling, träarbetsanvisningar (65.1+) @sv
alternative label: Höyläys, puutyöohjeet (65.1+)
alternative label: Laudat, puutyöohjeet (65.1+)
alternative label: Lehtisahaus, puutyöohjeet ja -mallit (65.1+)
alternative label: Lövsågning, träarbetsbeskrivningar och -modeller (65.1+) @sv
alternative label: Poraus, puutyöohjeet (65.1+)
alternative label: Puu, käsityöohjeet ja -mallit (65.1+)
alternative label: Puuesineet, käsityöohjeet ja -mallit (65.1+)
alternative label: Puuleikkausohjeet ja -mallit (65.1+)
alternative label: Puusepän työ (65.1+)
alternative label: Puutyöt, käsityöohjeet ja -mallit (65.1+)
alternative label: Puutyöt, puusepäntyöt (65.1+)
alternative label: Slöjd, träarbetsbeskrivningar och -mönster (65.1+) @sv
alternative label: Snickarens arbete (65.1+) @sv
alternative label: Trä, arbetsbeskrivningar och mönster (65.1+) @sv
alternative label: Träarbeten, arbetsbeskrivningar och mönster (65.1+) @sv
alternative label: Träarbeten, snickerier (65.1+) @sv
alternative label: Träföremål, arbetsbeskrivningar och modeller (65.1+) @sv
alternative label: Träsnideri, arbetsbeskrivningar och mönster (65.1+) @sv
alternative label: Veisto, puutyöohjeet ja -mallit (65.1+)
broader: KÄSITYÖ. KOTITEOLLISUUS
in scheme: YKL - Yleisten kirjastojen luokitusjärjestelmä
narrower: Huonekalujen rakentaminen
notation: 65.1
preferred label: Träarbete @sv
preferred label: Woodwork @en
scope note: Arbetsbeskrivningar och modeller för träarbeten i allmänhet Snickarens arbete i allmänhet @sv
scope note: Puutyöohjeet ja -mallit yleensä Puusepän työ yleensä

Huonekalujen rakentaminen
type: Concept
References: KANSATIEDE. KULTTUURIANTROPOLOGIA
References: Huonekaluteollisuus
References: Sisustusarkkitehtuuri. Huonekalutaide
type: YKL-luokka
alternative label: Huonekalut, entisöintiohjeet (65.11)
alternative label: Huonekalut, koristeluohjeet ja -mallit (65.11)
alternative label: Huonekalut, puusepän työ (65.11)
alternative label: Huonekalut, rakennusohjeet ja -mallit (65.11)
alternative label: Huonekalut, verhoiluohjeet ja -mallit (65.11)
alternative label: Möbler, byggnadsinstruktioner och -modeller (65.11) @sv
alternative label: Möbler, dekorationsbeskrivningar och -mönster (65.11) @sv
alternative label: Möbler, restaurering (65.11) @sv
alternative label: Möbler, snickarens arbete (65.11) @sv
alternative label: Möbler, tapetseringsanvisningar och -mönster (65.11) @sv
alternative label: Tapetserarens arbete (65.11) @sv
alternative label: Verhoilijan työ (65.11)
broader: Puutyö
in scheme: YKL - Yleisten kirjastojen luokitusjärjestelmä
notation: 65.11
preferred label: Manufacture of furniture @en
preferred label: Möbelsnickeri @sv
scope note: Arbetsinstruktioner och modeller för möbelsnickeri Möbelsnickeri, möbelbeklädnad, möbeldekoration och möbelrestaurering ur hantverkets och hemslöjdens synvinkel @sv
scope note: Huonekalujen rakennusohjeet ja -mallit Huonekalujen rakentaminen, verhoilu, koristelu ja entisöinti käsityön ja kotiteollisuuden kannalta

Metallityö
type: Concept
References: KANSATIEDE. KULTTUURIANTROPOLOGIA
References: METALLITEOLLISUUS. KONETEKNIIKKA. LIIKENNEVÄLINEET SÄHKÖTEKNIIKKA
References: Mekaaninen teknologia. Metallin työstö
References: Kelloteollisuus
References: Taidetaonta. Korutaide
type: YKL-luokka
alternative label: Bronsarbetsbeskrivningar och -mönster (65.2) @sv
alternative label: Drivning, arbetsbeskrivningar och -mönster (65.2) @sv
alternative label: Gjutmetoder, arbetsbeskrivningar och -modeller (65.2) @sv
alternative label: Järn, smedens arbete (65.2) @sv
alternative label: Koppararbeten, arbetsbeskrivningar och modeller (65.2) @sv
alternative label: Kuparityöohjeet ja -mallit (65.2)
alternative label: Messinkityöohjeet ja -mallit (65.2)
alternative label: Metallarbeten, arbetsbeskrivningar och mönster (65.2) @sv
alternative label: Metallarbeten, smedens arbete (65.2) @sv
alternative label: Metaller, bearbetning, hantverk (65.2) @sv
alternative label: Metaller, bearbetning, smedens arbete (65.2) @sv
alternative label: Metallföremål, arbetsbeskrivningar och modeller (65.2) @sv
alternative label: Metalliesineet, käsityöohjeet ja -mallit (65.2)
alternative label: Metallilangat, käsityöohjeet ja -mallit (65.2)
alternative label: Metallilankatyöt, käsityöohjeet ja -mallit (65.2)
alternative label: Metallit, työstö, käsityö (65.2)
alternative label: Metallit, työstö, sepän työ (65.2)
alternative label: Metallityöt, käsityöohjeet ja -mallit (65.2)
alternative label: Metallityöt, sepän työ (65.2)
alternative label: Metalltråd, arbetsbeskrivningar och mönster (65.2) @sv
alternative label: Metalltrådsarbeten, arbetsbeskrivningar och mönster (65.2) @sv
alternative label: Mässing, arbetsbeskrivningar och modeller (65.2) @sv
alternative label: Pajatyö, sepän työ (65.2)
alternative label: Pakotus, käsityöohjeet ja -mallit (65.2)
alternative label: Peltisepän työ (65.2)
alternative label: Plåtslagarens arbete (65.2) @sv
alternative label: Pronssityöohjeet ja -mallit (65.2)
alternative label: Puukot, käsiteollisuus (65.2)
alternative label: Rauta, sepän työ (65.2)
alternative label: Sepän työ, metallityöohjeet ja -mallit (65.2)
alternative label: Slidknivar, hantverk (65.2) @sv
alternative label: Smedens arbete, metallarbetsbeskrivningar och -mönster (65.2) @sv
alternative label: Smedjearbete, smedens arbete (65.2) @sv
alternative label: Smide, arbetsbeskrivningar och -mönster (65.2) @sv
alternative label: Smide, smedens arbete (65.2) @sv
alternative label: Taonta, käsityöohjeet ja -mallit (65.2)
alternative label: Taonta, sepän työ (65.2)
alternative label: Tennarbetsbeskrivningar och -modeller (65.2) @sv
alternative label: Tinatyöohjeet ja -mallit (65.2)
alternative label: Valumenetelmät, käsityöohjeet ja -mallit (65.2)
broader: KÄSITYÖ. KOTITEOLLISUUS
in scheme: YKL - Yleisten kirjastojen luokitusjärjestelmä
notation: 65.2
preferred label: Metallarbete @sv
preferred label: Metalwork @en
scope note: Arbetsinstruktioner och modeller för metallarbete Gjutning, drivning och hamring av metall ur hantverkets och hemslöjdens synvinkel Smedens och plåtsmedens arbete ur hantverkets, smedjearbetets och hemslöjdens synvinkel @sv
scope note: Metallityöohjeet ja -mallit Metallin valu, pakotus ja taonta käsityön ja kotiteollisuuden kannalta Sepän ja peltisepän työ käsityön, pajatyön ja kotiteollisuuden kannalta

Nahkatyö
type: Concept
References: KANSATIEDE. KULTTUURIANTROPOLOGIA
References: Nahka- ja jalkineteollisuus
References: Tekstiilitaide
type: YKL-luokka
alternative label: Garvarens arbete (65.3) @sv
alternative label: Garvning, läderarbeten, beskrivningar (65.3) @sv
alternative label: Hudar, läderarbetsbeskrivningar och -modeller (65.3) @sv
alternative label: Jalkinemestarin työ (65.3)
alternative label: Körsnärens arbete (65.3) @sv
alternative label: Läderarbeten, handarbetsbeskrivningar och -mönster (65.3) @sv
alternative label: Nahkat, käsittely (65.3)
alternative label: Nahkatyöt, käsityöohjeet ja -mallit (65.3)
alternative label: Nahkurin työ (65.3)
alternative label: Parkitus, nahkatyöohjeet (65.3)
alternative label: Pälsar, körsnärens arbete (65.3) @sv
alternative label: Pälsverk, handarbetsbeskrivningar och -mönster (65.3) @sv
alternative label: Sadelmakarens arbete (65.3) @sv
alternative label: Satulasepän työ (65.3)
alternative label: Skinn, behandling (65.3) @sv
alternative label: Skomakarens arbete (65.3) @sv
alternative label: Suutarin työ (65.3)
alternative label: Syntetläderarbeten, handarbetsbeskrivningar och -mönster (65.3) @sv
alternative label: Tekonahkatyöt, käsityöohjeet ja -mallit (65.3)
alternative label: Turkikset, turkkurin työ (65.3)
alternative label: Turkistyöt, käsityöohjeet ja -mallit (65.3)
alternative label: Turkkurin työ (65.3)
alternative label: Vuodat, nahkatyöohjeet ja -mallit (65.3)
broader: KÄSITYÖ. KOTITEOLLISUUS
in scheme: YKL - Yleisten kirjastojen luokitusjärjestelmä
notation: 65.3
preferred label: Leatherwork @en
preferred label: Läderarbete @sv
scope note: Arbetsbeskrivningar och mönster för läder- och konstläderarbete Hantering av läder och skinn Skomakarens, garvarens, körsnärens och sadelmakarens arbete ur handarbets- och hemslöjdens synvinkel @sv
scope note: Nahka- ja tekonahkatyöohjeet ja -mallit Nahkojen käsittely Suutarin, nahkurin, turkkurin ja satulasepän työ käsityön ja kotiteollisuuden kannalta

Tekstiilityö
type: Concept
References: KANSATIEDE. KULTTUURIANTROPOLOGIA
References: Tekstiili- ja vaatetusteollisuus
References: Lastenvaatteiden valmistus käsityönä
References: Vaatteiden pesu ja hoito
References: Tilataide. Ympäristötaide
References: Tekstiilitaide
References: Muoti ja muodin historia
type: YKL-luokka
alternative label: Accessoarer, handarbetsmönster och -modeller (65.4+) @sv
alternative label: Asusteet, käsityöohjeet ja -mallit (65.4+)
alternative label: Bandgrind, handarbetsbeskrivningar och -mönster (65.4) @sv
alternative label: Bandväv, handarbetsbeskrivningar och -mönster (65.4) @sv
alternative label: Beklädnadsarbete, handarbetsbeskrivningar och -mönster (65.4+) @sv
alternative label: Flätade band, handarbetsbeskrivningar och -mönster (65.4) @sv
alternative label: Gardiner, handarbetsbeskrivningar och -mönster (65.4+) @sv
alternative label: Garn, handarbetsbeskrivningar och -mönster (65.4+) @sv
alternative label: Hattmakeri (65.4) @sv
alternative label: Hatunteko (65.4)
alternative label: Kläder, handarbetsbeskrivningar och -mönster (65.4+) @sv
alternative label: Langat, käsityöohjeet ja -mallit (65.4+)
alternative label: Lautanauhat, käsityöohjeet ja -mallit (65.4)
alternative label: Lin, handarbetsbeskrivningar och -mönster (65.4+) @sv
alternative label: Modistens arbete (65.4) @sv
alternative label: Modistin työ (65.4)
alternative label: Palmikoidut nauhat, käsityöohjeet ja -mallit (65.4)
alternative label: Pellava, käsityöohjeet ja -mallit (65.4+)
alternative label: Pirtanauhat, käsityöohjeet ja -mallit (65.4)
alternative label: Sidenmålning, arbetsbeskrivningar och mönster (65.4) @sv
alternative label: Silkkimaalausohjeet ja -mallit (65.4)
alternative label: Tekstiilityö, käsityöohjeet ja -mallit (65.4+)
alternative label: Textilarbete, handarbetsbeskrivningar och -mönster (65.4+) @sv
alternative label: Vaatetustyö, käsityöohjeet ja -mallit (65.4+)
alternative label: Vaatteet, käsityöohjeet ja -mallit (65.4+)
alternative label: Verhot, käsityöohjeet ja -mallit (65.4+)
broader: KÄSITYÖ. KOTITEOLLISUUS
in scheme: YKL - Yleisten kirjastojen luokitusjärjestelmä
narrower: Kudonta
narrower: Ompelu
narrower: Neulonta
narrower: Kankaanpainanta
narrower: Kehrääminen. Karstaus. Värjäys
notation: 65.4
preferred label: Textilarbete @sv
preferred label: Textile work @en
scope note: Hit och till underklasserna tillverkning av textilier, kläder och accessoarer ur handarbets- och hemslöjdens synvinkel Hit och till underklasserna textilarbetsbeskrivningar och textilarbetsmönster Hit modistens arbete och hur man tillverkar hattar @sv
scope note: Tähän ja alaluokkiin tekstiilien, vaatteiden ja asusteiden valmistaminen käsityön ja kotiteollisuuden kannalta Tähän ja alaluokkiin tekstiilityöohjeet ja -mallit Tähän modistin työ ja hatunteko

Kudonta
type: Concept
References: Tekstiili- ja vaatetusteollisuus
References: Tekstiilitaide
type: YKL-luokka
alternative label: Bildtapeter, beskrivningar och mönster (65.41) @sv
alternative label: Dubbelvävnadsbeskrivningar och -mönster (65.41) @sv
alternative label: Gobeliiniohjeet ja -mallit (65.41)
alternative label: Gobelänger, beskrivningar och mönster (65.41) @sv
alternative label: Kangaspuut, käyttö (65.41+)
alternative label: Kankaankudonta, käsityöohjeet ja -mallit (65.41)
alternative label: Kankaat, käsityöohjeet ja -mallit (65.41)
alternative label: Kankaiden sidokset, käsityöohjeet ja -mallit (65.41)
alternative label: Kudonta, käsityöohjeet ja -mallit (65.41+)
alternative label: Kutominen, käsityöohjeet ja -mallit (65.41+)
alternative label: Kuultokudosohjeet ja -mallit (65.41)
alternative label: Kuvakudosohjeet ja -mallit (65.41)
alternative label: Poppana, beskrivningar och mönster (65.41) @sv
alternative label: Poppanaohjeet ja -mallit (65.41)
alternative label: Raanuohjeet ja -mallit (65.41)
alternative label: Ranor, arbetsbeskrivningar och -mönster (65.41) @sv
alternative label: Ryijyohjeet ja -mallit (65.41)
alternative label: Ryor, arbetsbeskrivningar och -mönster (65.41) @sv
alternative label: Saalit, käsityöohjeet ja -mallit (65.41)
alternative label: Schalar, handarbetsbeskrivningar och -mönster (65.41) @sv
alternative label: Seinävaatteet, käsityöohjeet ja -mallit (65.41)
alternative label: Shaalit, käsityöohjeet ja -mallit (65.41)
alternative label: Sjalar, handarbetsbeskrivningar och -mönster (65.41) @sv
alternative label: Transparanger, arbetsbeskrivningar och mönster (65.41) @sv
alternative label: Tyger, handarbetsbeskrivningar och -mönster (65.41) @sv
alternative label: Täkänäohjeet ja -mallit (65.41)
alternative label: Väggbonader, handarbetsbeskrivningar och -mönster (65.41) @sv
alternative label: Vävbindningar, handarbetsbeskrivningar och -modeller (65.41) @sv
alternative label: Vävning, handarbetsbeskrivningar och -mönster (65.41+) @sv
alternative label: Vävstolar, användning (65.41+) @sv
broader: Tekstiilityö
in scheme: YKL - Yleisten kirjastojen luokitusjärjestelmä
narrower: Matonkudonta
notation: 65.41
preferred label: Vävning @sv
preferred label: Weaving @en
scope note: Kankaankudonnan ohjeet ja mallit Saali-, raanu-, poppana-, täkänä-, gobeliini-, ryijy- sekä kuulto- ja kuvakudosohjeet ja -mallit Kankaankudonta, kangaspuut ja kankaiden sidokset käsityön ja kotiteollisuuden kannalta
scope note: Vävbeskrivningar och vävmönster Arbetsbeskrivningar och mönster för sjalar, ranor, poppana, dubbelvävnader, gobelänger, ryor, transparangväv och bildtapeter Tygvävning och vävstolar ur handarbetets och hemslöjdens synvinkel @sv

Matonkudonta
type: Concept
References: Tekstiili- ja vaatetusteollisuus
References: Tekstiilitaide
type: YKL-luokka
alternative label: Matot, käsityöohjeet ja -mallit (65.411)
alternative label: Mattor, handarbetsbeskrivningar och -mönster (65.411) @sv
alternative label: Räsymatot, käsityöohjeet ja -mallit (65.411)
alternative label: Trasmattor, handarbetsbeskrivningar och -mönster (65.411) @sv
broader: Kudonta
in scheme: YKL - Yleisten kirjastojen luokitusjärjestelmä
notation: 65.411
preferred label: Carpet weaving @en
preferred label: Mattvävning @sv
scope note: Matonkudonnan ohjeet ja mallit Matonkudonta käsityön ja kotiteollisuuden kannalta
scope note: Mattvävningsbeskrivningar och mattvävningsmönster Mattvävning ur handarbets- och hemslöjdens synvinkel @sv

Ompelu
type: Concept
References: KANSATIEDE. KULTTUURIANTROPOLOGIA
References: Tekstiili- ja vaatetusteollisuus
References: Lastenvaatteiden valmistus käsityönä
References: Neulonta
type: YKL-luokka
alternative label: Dräkter, sömnadsbeskrivningar och -mönster (65.42+) @sv
alternative label: Kaavat, ompelu (65.42+)
alternative label: Kläder i syntetläder, sömnadsbeskrivningar och -mönster (65.42) @sv
alternative label: Kläder, sömnadsbeskrivningar och -mönster (65.42+) @sv
alternative label: Klädsömnadsanvisningar och -mönster (65.42+) @sv
alternative label: Lapptäcken, arbetsbeskrivningar och mönster (65.42) @sv
alternative label: Läderkläder, sömnadsbeskrivningar och -mönster (65.42+) @sv
alternative label: Mönster, sömnad (65.42+) @sv
alternative label: Nahkavaatteet, ompeluohjeet ja -mallit (65.42+)
alternative label: Ompelijan työ (65.42+)
alternative label: Ompelukoneet, käyttö (65.42+)
alternative label: Ompeluohjeet ja -mallit (65.42+)
alternative label: Pukuompeluohjeet ja -mallit (65.42+)
alternative label: Puvut, ompeluohjeet ja -mallit (65.42+)
alternative label: Räätälin työ (65.42+)
alternative label: Skräddarens arbete (65.42+) @sv
alternative label: Symaskiner, användning (65.42+) @sv
alternative label: Sömmerskans arbete (65.42+) @sv
alternative label: Sömnadsbeskrivningar och -mönster (65.42+) @sv
alternative label: Tekonahkavaatteet, ompeluohjeet ja -mallit (65.42)
alternative label: Tilkkutyöt, käsityöohjeet ja -mallit (65.42)
alternative label: Vaatteet, ompeluohjeet ja -mallit (65.42+)
alternative label: Vaatturin työ (65.42+)
broader: Tekstiilityö
in scheme: YKL - Yleisten kirjastojen luokitusjärjestelmä
narrower: Koruompelu. Kirjonta
narrower: Lastenvaatteiden valmistus käsityönä
notation: 65.42
preferred label: Sewing @en
preferred label: Sömnad @sv
scope note: Ompelu- ja tilkkutyöohjeet ja -mallit Vaatteiden ja muiden tekstiilien ompelu sekä ompelukoneet käsityön ja kotiteollisuuden kannalta Tähän myös vaatturin, räätälin ja ompelijan työ käsityön ja kotiteollisuuden kannalta Jos teos koskee sekä ompelua että neulontaa, annetaan etusija luokalle 65.42+
scope note: Sömnadsbeskrivningar och sömnadsmönster Klädsömnad och annan textilsömnad samt symaskinen ur handarbets- och hemslöjdens synvinkel Hit också skräddarens och sömmerskans yrke ur handarbets- och hemslöjdens synvinkel Om verket innehåller både sömnad och stickning, ges företräde åt klass 65.42+ @sv

Koruompelu. Kirjonta
type: Concept
References: Tekstiili- ja vaatetusteollisuus
References: Lastenvaatteiden valmistus käsityönä
References: Tekstiilitaide
type: YKL-luokka
alternative label: Broderi, beskrivningar och mönster (65.421) @sv
alternative label: Hålsömnadsbeskrivningar och -mönster (65.421) @sv
alternative label: Kirjontaohjeet ja -mallit (65.421)
alternative label: Korsstygnsbeskrivningar och -mönster (65.421) @sv
alternative label: Koruompeluohjeet ja -mallit (65.421)
alternative label: Märkning, beskrivningar och -mönster (65.421) @sv
alternative label: Nimikointiohjeet ja -mallit (65.421)
alternative label: Reikäompeluohjeet ja -mallit (65.421)
alternative label: Revinnäistyöohjeet ja -mallit (65.421)
alternative label: Ristipisto-ohjeet ja -mallit (65.421)
alternative label: Tapisseri, beskrivningar och mönster (65.421) @sv
alternative label: Utdragssöm, arbetsbeskrivningar och -mönster (65.421) @sv
alternative label: Vohvelityöohjeet ja -mallit (65.421)
alternative label: Våffelvävnad, arbetsbeskrivningar och mönster (65.421) @sv
broader: Ompelu
in scheme: YKL - Yleisten kirjastojen luokitusjärjestelmä
notation: 65.421
preferred label: Broderi @sv
preferred label: Embroidery. Decorative needlework @en
scope note: Beskrivningar och mönster för broderi och märkning @sv
scope note: Koruompelun, kirjonnan ja nimikoinnin ohjeet ja mallit

Lastenvaatteiden valmistus käsityönä
type: Concept
References: Tekstiili- ja vaatetusteollisuus
type: YKL-luokka
alternative label: Babykläder, beskrivningar och mönster (65.424) @sv
alternative label: Barnkläder, beskrivningar och mönster (65.424) @sv
alternative label: Kudonta, käsityöohjeet ja -mallit, lasten ja -vauvanvaatteet (65.424)
alternative label: Kutominen, käsityöohjeet ja -mallit, lasten- ja vauvanvaatteet (65.424)
alternative label: Lastenvaatteet, käsityöohjeet ja -mallit (65.424)
alternative label: Neulonta, käsityöohjeet ja -mallit, lasten- ja vauvanvaatteet (65.424)
alternative label: Ompeluohjeet ja -mallit, lasten- ja vauvanvaatteet (65.424)
alternative label: Stickning, handarbetsbeskrivningar och -mönster, barn- och babykläder (65.424) @sv
alternative label: Sömnadsbeskrivningar och -mönster, barn- och babykläder (65.424) @sv
alternative label: Vauvanvaatteet, käsityöohjeet ja -mallit (65.424)
alternative label: Vävning, handarbetsbeskrivningar och -mönster, barn- och babykläder (65.424) @sv
broader: Ompelu
in scheme: YKL - Yleisten kirjastojen luokitusjärjestelmä
notation: 65.424
preferred label: Children's clothes as handicraft @en
preferred label: Framställning av barnkläder som hantverk @sv
scope note: Beskrivningar och mönster för barn- och babykläder Om verket passar såväl i klass 65.424 som i klassen för en specifik form av hantverk, så skrivs 65.424 som huvudklass; av klassen för formen av hantverk görs vid behov ett klasstillägg @sv
scope note: Lasten- ja vauvanvaatteiden käsityöohjeet ja -mallit Jos teos sopii sekä luokkaan 65.424 että tietyn käsityömuodon luokkaan, merkitään varsinaiseksi luokaksi 65.424; käsityömuodon luokasta voidaan tehdä luokkalisäkirjaus

Neulonta
type: Concept
References: Tekstiili- ja vaatetusteollisuus
References: Ompelu
References: Lastenvaatteiden valmistus käsityönä
type: YKL-luokka
alternative label: Kläder, stickbeskrivningar och -mönster (65.43) @sv
alternative label: Koneneulontaohjeet ja -mallit (65.43)
alternative label: Maskinstickning, beskrivningar och mönster (65.43) @sv
alternative label: Neulekoneet, käyttö (65.43)
alternative label: Neulonta, ohjeet ja mallit (65.43+)
alternative label: Stickmaskiner, användning (65.43) @sv
alternative label: Stickning, arbetsbeskrivningar och mönster (65.43+) @sv
alternative label: Vaatteet, neulontaohjeet ja -mallit (65.43)
alternative label: Villavaatteet, neulontaohjeet ja -mallit (65.43)
alternative label: Yllekläder, stickbeskrivningar och -mönster (65.43) @sv
broader: Tekstiilityö
in scheme: YKL - Yleisten kirjastojen luokitusjärjestelmä
narrower: Virkkaus. Nypläys
narrower: Solmeilu. Makramee. Fransut
notation: 65.43
preferred label: Knitting @en
preferred label: Stickning @sv
scope note: Neulontaohjeet ja -mallit Vaatteiden ja muiden tekstiilien käsin- ja koneneulonta Neulekoneet käsityön ja kotiteollisuuden kannalta Jos teos koskee sekä neulontaa että ompelua, annetaan etusija luokalle 65.42+
scope note: Stickbeskrivningar och stickmönster Sömnad för hand och maskinsömnad av kläder och andra textilier Stickmaskiner ur handarbets- och hemslöjdens synvinkel Om verket innehåller både stickning och sömnad, ges företräde åt klass 65.42+ @sv

Virkkaus. Nypläys
type: Concept
References: Lastenvaatteiden valmistus käsityönä
type: YKL-luokka
alternative label: Frivolitee, ohjeet ja -mallit (65.433)
alternative label: Frivolitet, beskrivningar och mönster (65.433) @sv
alternative label: Kläder, virkbeskrivningar och -mönster (65.433) @sv
alternative label: Knyppling, arbetsbeskrivningar och mönster (65.433) @sv
alternative label: Koukkuaminen (65.433)
alternative label: Koukkuamisohjeet ja -mallit (65.433)
alternative label: Krokning, beskrivningar och mönster (65.433) @sv
alternative label: Käpypitsi, ohjeet ja -mallit (65.433)
alternative label: Neulapitsi, ohjeet ja -mallit (65.433)
alternative label: Nypläysohjeet ja -mallit (65.433)
alternative label: Pitsinnypläysohjeet ja -mallit (65.433)
alternative label: Pitsinvirkkausohjeet ja -mallit (65.433)
alternative label: Spetsknyppling, beskrivningar och mönster (65.433) @sv
alternative label: Spetsvirkning, beskrivningar och mönster (65.433) @sv
alternative label: Vaatteet, virkkausohjeet ja -mallit (65.433)
alternative label: Virkkausohjeet ja -mallit (65.433)
alternative label: Virkning, arbetsbeskrivningar och mönster (65.433) @sv
broader: Neulonta
in scheme: YKL - Yleisten kirjastojen luokitusjärjestelmä
notation: 65.433
preferred label: Crocheting. Lace-making @en
preferred label: Virkning. Knyppling @sv
scope note: Beskrivningar och mönster för virkning, spetsvirkning, krokning och spetsknyppling @sv
scope note: Virkkauksen, pitsinvirkkauksen, koukkuamisen ja pitsinnypläyksen ohjeet ja mallit

Solmeilu. Makramee. Fransut
type: Concept
References: Juuri-, kaisla-, kori-, korkki-, lastu-, niini-, olki-, paju-, rottinki-, tuohi- ja tulitikkutyöt
References: Vesiliikenne
type: YKL-luokka
alternative label: Fransflätning, arbetsbeskrivningar och mönster (65.434) @sv
alternative label: Fransut, ohjeet ja mallit (65.434)
alternative label: Knutar, arbetsbeskrivningar och mönster (65.434) @sv
alternative label: Knytning, arbetsbeskrivningar och mönster (65.434) @sv
alternative label: Makramee, ohjeet ja mallit (65.434)
alternative label: Makramé, arbetsbeskrivningar och mönster (65.434) @sv
alternative label: Solmeilu, ohjeet ja mallit (65.434)
alternative label: Solmut, ohjeet ja mallit (65.434)
broader: Neulonta
in scheme: YKL - Yleisten kirjastojen luokitusjärjestelmä
notation: 65.434
preferred label: Knotting. Macramé. Fringes @en
preferred label: Knytning. Makramé. Fransflätning @sv
scope note: Beskrivningar och mönster för knytning, makramé och fransflätning Hit också knutar och knopslagning i allmänhet @sv
scope note: Solmeilun, makrameen ja fransujen ohjeet ja mallit Tähän myös solmut ja solmujenteko-ohjeet yleensä

Kankaanpainanta
type: Concept
References: Tekstiili- ja vaatetusteollisuus
References: Lastenvaatteiden valmistus käsityönä
References: Tekstiilitaide
type: YKL-luokka
alternative label: Batiikkiohjeet ja -mallit (65.44)
alternative label: Batikbeskrivningar och -mönster (65.44) @sv
alternative label: Handtryck, arbetsbeskrivningar och mönster för textilier (65.44) @sv
alternative label: Kankaanpainanta, käsityöohjeet ja -mallit (65.44)
alternative label: Käsinpainanta, tekstiilityöohjeet ja -mallit (65.44)
alternative label: Painokuvat, kankaanpainantaohjeet ja -mallit (65.44)
alternative label: Painovärit, kankaanpainantaohjeet ja -mallit (65.44)
alternative label: Serigrafi, tygtrycksbeskrivningar och -mönster (65.44) @sv
alternative label: Serigrafia, kankaanpainantaohjeet ja -mallit (65.44)
alternative label: Silk screen, tygtrycksbeskrivningar och -mönster (65.44) @sv
alternative label: Silkkipainanta, kankaanpainantaohjeet ja -mallit (65.44)
alternative label: Textiltryck, arbetsbeskrivningar och mönster (65.44) @sv
alternative label: Tryckbilder, tygtrycksbeskrivningar och -mönster (65.44) @sv
alternative label: Tryckfärger, tygtrycksbeskrivningar och -mönster (65.44) @sv
broader: Tekstiilityö
in scheme: YKL - Yleisten kirjastojen luokitusjärjestelmä
notation: 65.44
preferred label: Cloth printing @en
preferred label: Tygtryck @sv
scope note: Beskrivningar och mönster för tygtryck och batik Tygtryck och batik ur handarbets- och hemslöjdens synvinkel @sv
scope note: Kankaanpainanta- ja batiikkiohjeet ja -mallit Kankaanpainanta ja batiikkityöt käsityön ja kotiteollisuuden kannalta

Kehrääminen. Karstaus. Värjäys
type: Concept
References: Tekstiili- ja vaatetusteollisuus
References: Lastenvaatteiden valmistus käsityönä
References: Muut hyötykasvit
type: YKL-luokka
alternative label: Filtningsinstruktioner (65.45) @sv
alternative label: Färgningsanvisningar, textilhandarbete (65.45) @sv
alternative label: Färgväxter, växtfärgning (65.45) @sv
alternative label: Garn, tillverknings- och färgningsanvisningar (65.45) @sv
alternative label: Huovutusohjeet (65.45)
alternative label: Kankaat, värjäysohjeet ja -mallit (65.45)
alternative label: Kardning, handarbetsbeskrivningar (65.45) @sv
alternative label: Karstaus, käsityöohjeet (65.45)
alternative label: Kasveilla värjäys, tekstiilit ja langat (65.45)
alternative label: Kehrääminen, käsityöohjeet (65.45)
alternative label: Langat, valmistus- ja värjäysohjeet (65.45)
alternative label: Spinning, handarbetsbeskrivningar (65.45) @sv
alternative label: Tyger, färgningsinstruktioner och -mönster (65.45) @sv
alternative label: Väriainekasvit, kasveilla värjäys (65.45)
alternative label: Värjäysohjeet, tekstiilikäsityö (65.45)
alternative label: Växtfärgning, textilier och garn (65.45) @sv
broader: Tekstiilityö
in scheme: YKL - Yleisten kirjastojen luokitusjärjestelmä
notation: 65.45
preferred label: Spinning. Carding. Dyeing @en
preferred label: Spinning. Kardning. Färgning @sv
scope note: Kehrääminen, karstaus, huovutus ja lankojen valmistus sekä lankojen ja tekstiilien värjäys ja kasveilla värjäys käsityön ja kotiteollisuuden kannalta
scope note: Spinning, kardning, filtning och garntillverkning samt färgning av garn och textilier och växtfärgning ur handarbets- och hemslöjdens synvinkel @sv

Paperi- ja pahvityöt
type: Concept
References: Paperi- ja selluloosateollisuus
References: Paperitaide
type: YKL-luokka
alternative label: Origami, beskrivningar och mönster (65.5) @sv
alternative label: Origamiohjeet ja -mallit (65.5)
alternative label: Pahvi, askartelu (65.5)
alternative label: Pahvityöt, askartelu (65.5)
alternative label: Paperi, askartelu (65.5)
alternative label: Paperi, valmistus, käsityöohjeet (65.5)
alternative label: Paperikorut, käsityöohjeet ja -mallit (65.5)
alternative label: Paperinleikkausohjeet ja -mallit (65.5)
alternative label: Paperintaitteluohjeet ja -mallit (65.5)
alternative label: Paperityöohjeet ja -mallit (65.5)
alternative label: Paperityöt, askartelu (65.5)
alternative label: Papp, pyssel (65.5) @sv
alternative label: Papparbeten, pyssel (65.5) @sv
alternative label: Papper, pyssel (65.5) @sv
alternative label: Papper, tillverkning för hand, instruktioner (65.5) @sv
alternative label: Pappersarbeten, pyssel (65.5) @sv
alternative label: Pappersklipp, arbetsbeskrivningar och mönster (65.5) @sv
alternative label: Pappersslöjd, arbetsbeskrivningar och mönster (65.5) @sv
alternative label: Papperssmycken, handarbetsbeskrivningar och -mönster (65.5) @sv
alternative label: Pappersvikningsinstruktioner och -mönster (65.5) @sv
alternative label: Siluetit, paperinleikkausohjeet ja -mallit (65.5)
alternative label: Siluetter, klippbeskrivningar och -mönster (65.5) @sv
broader: KÄSITYÖ. KOTITEOLLISUUS
in scheme: YKL - Yleisten kirjastojen luokitusjärjestelmä
notation: 65.5
preferred label: Paper and cardboard work @en
preferred label: Pappers- och papparbeten @sv
scope note: Beskrivningar och modeller för pappers- och papparbeten Beskrivningar och modeller för origami och pappersvikning Pappersframställning som hantverk @sv
scope note: Paperi- ja pahvityöohjeet ja -mallit Origami- ja paperintaitteluohjeet ja -mallit Paperin valmistus käsityönä

Muovailu. Keramiikkatyöt
type: Concept
References: Keraaminen teollisuus. Lasiteollisuus. Sementtiteollisuus
References: Muovi- ja kumiteollisuus
References: Lasimaalaus. Posliinimaalaus
References: Lasitaide. Keramiikkataide
type: YKL-luokka
alternative label: Keramiikan poltto (65.6)
alternative label: Keramiikkatyöohjeet ja -mallit (65.6)
alternative label: Keramikarbeten, arbetsbeskrivningar och modeller (65.6) @sv
alternative label: Keramikarbeten, beskrivningar och mönster (65.6) @sv
alternative label: Keramikbränning (65.6) @sv
alternative label: Kynttilänvaluohjeet ja -mallit (65.6)
alternative label: Ljusstöpning, arbetsbeskrivningar och mönster (65.6) @sv
alternative label: Modellering, arbetsbeskrivningar och mönster, hobbyarbete (65.6) @sv
alternative label: Modelleringsvax, arbetsbeskrivningar och mönster (65.6) @sv
alternative label: Muovailuohjeet ja -mallit, askartelu (65.6)
alternative label: Muovailuvahaohjeet ja -mallit (65.6)
alternative label: Muovityöohjeet ja -mallit (65.6)
alternative label: Plaster, arbetsbeskrivningar och mönster (65.6) @sv
alternative label: Savityöohjeet ja -mallit (65.6)
broader: KÄSITYÖ. KOTITEOLLISUUS
in scheme: YKL - Yleisten kirjastojen luokitusjärjestelmä
notation: 65.6
preferred label: Ler- och keramikarbete. Modellering @sv
preferred label: Modelling. Ceramics work @en
scope note: Beskrivningar och modeller för ler- och keramikarbeten Hit också arbetsbeskrivningar och modeller för modellera och plastmassa samt ljusstöpning Om verket innehåller arbetsbeskrivningar och mönster både för ler och keramikarbete och för porslinsmålning, ges företräde åt klass 65.6 @sv
scope note: Muovailuohjeet ja -mallit Savi- ja keramiikkatyöohjeet ja -mallit Tähän myös muovailuvaha- ja muovityöohjeet ja -mallit sekä kynttilänvaluohjeet Jos teoksessa on sekä savi- että keramiikkatyöohjeita että posliinimaalausohjeita, annetaan etusija luokalle 65.6

Lasimaalaus. Posliinimaalaus
type: Concept
References: Keraaminen teollisuus. Lasiteollisuus. Sementtiteollisuus
References: Muovailu. Keramiikkatyöt
References: Lasitaide. Keramiikkataide
type: YKL-luokka
alternative label: Glasarbeten (65.7) @sv
alternative label: Glasmåleri, arbetsbeskrivningar och mönster (65.7) @sv
alternative label: Lasimaalausohjeet ja -mallit (65.7)
alternative label: Lasityöt (65.7)
alternative label: Mosaiikkityöohjeet ja -mallit (65.7)
alternative label: Mosaik, arbetsbeskrivningar och mönster (65.7) @sv
alternative label: Porslinsmålning, beskrivningar och mönster (65.7) @sv
alternative label: Posliinimaalausohjeet ja -mallit (65.7)
broader: KÄSITYÖ. KOTITEOLLISUUS
in scheme: YKL - Yleisten kirjastojen luokitusjärjestelmä
notation: 65.7
preferred label: Glasmålning. Porslinsmålning @sv
preferred label: Glass painting. Porcelain painting @en
scope note: Beskrivningar och modeller för glas- och porslinsmålning Hit också beskrivningar och modeller för glas- och mosaikarbeten Om verket innehåller arbetsbeskrivningar och mönster både för porslinsmålning och för ler- och keramikarbete, ges företräde åt klass 65.6 @sv
scope note: Lasi- ja posliinimaalausohjeet ja -mallit Tähän myös lasi- ja mosaiikkityöohjeet ja -mallit Jos teoksessa on sekä posliinimaalausohjeita että savi- tai keramiikkatyöohjeita, annetaan etusija luokalle 65.6

Leikkikalut
type: Concept
References: KANSATIEDE. KULTTUURIANTROPOLOGIA
References: Liikennevälineiden pienoismallit
References: Leikit
type: YKL-luokka
alternative label: Byggserier, leksaker (65.8) @sv
alternative label: Dockindustri (65.8) @sv
alternative label: Dockkläder, handarbetsbeskrivningar och -mönster (65.8) @sv
alternative label: Dockor, handarbetsbeskrivningar och -mönster (65.8) @sv
alternative label: Dockor, leksaksindustri (65.8) @sv
alternative label: Dockskåp (65.8) @sv
alternative label: Dockteater, tillverkning av dockor (65.8) @sv
alternative label: Handdockor, tillverkning (65.8) @sv
alternative label: Kangaseläimet, käsityöohjeet ja -mallit (65.8)
alternative label: Käsinuket, valmistus (65.8)
alternative label: Legobitar, byggnadsinstruktioner (65.8) @sv
alternative label: Legot, rakennusohjeet (65.8)
alternative label: Leikkikalut (65.8)
alternative label: Leikkikalut, valmistus käsityönä (65.8)
alternative label: Leikkikaluteollisuus (65.8)
alternative label: Leksaker (65.8) @sv
alternative label: Leksaker, leksaksindustri (65.8) @sv
alternative label: Leksaker, tillverkning för hand (65.8) @sv
alternative label: Leksaksindustri (65.8) @sv
alternative label: Lelut (65.8)
alternative label: Lelut, leikkikaluteollisuus (65.8)
alternative label: Lelut, valmistus käsityönä (65.8)
alternative label: Nukenvaatteet, käsityöohjeet ja -mallit (65.8)
alternative label: Nuket, käsityöohjeet ja -mallit (65.8)
alternative label: Nuket, leikkikaluteollisuus (65.8)
alternative label: Nukkekodit (65.8)
alternative label: Nukketeatteri, käsinukkien valmistus (65.8)
alternative label: Nukketeollisuus (65.8)
alternative label: Rakennussarjat, leikkikalut (65.8)
alternative label: Tennsoldater (65.8) @sv
alternative label: Tinasotilaat (65.8)
alternative label: Tygdjur, handarbetsbeskrivningar och -modeller (65.8) @sv
broader: KÄSITYÖ. KOTITEOLLISUUS
in scheme: YKL - Yleisten kirjastojen luokitusjärjestelmä
notation: 65.8
preferred label: Leksaker @sv
preferred label: Toys @en
scope note: Leikkikalut. Leikkikaluteollisuus Leikkikalujen valmistus käsityön, askartelun ja kotiteollisuuden kannalta Leikkikalujen valmistusohjeet ja -mallit valmistusmateriaalista riippumatta Tähän myös nuket ja nukenvaatteet ja niiden valmistus teollisesti ja käsityönä Jos teoksessa on sekä leikkikalujen valmistusohjeita että kansatiedetta, annetaan etusija luokalle 65.8 Jos teos koskee sekä leikkikaluja että leikkejä, annetaan etusija luokalle 79.84+
scope note: Leksaker. Leksaksindustri Tillverkning av leksaker ur hantverkets, hemslöjdens och hobbyverksamhetens synvinkel Beskrivningar och modeller för tillverkning av leksaker oavsett material Hit också dockor och dockkläder samt hantverksmässig och industriell tillverkning av dem Om verket innehåller både beskrivningar av docktillverkning och etnologi, ges företräde åt klass 65.8 Om verket behandlar både leksaker och lekar, ges företräde åt klass 79.84+ @sv

Muut käsityöt
type: Concept
References: KÄSITYÖ. KOTITEOLLISUUS
type: YKL-luokka
broader: KÄSITYÖ. KOTITEOLLISUUS
in scheme: YKL - Yleisten kirjastojen luokitusjärjestelmä
narrower: Helmityöt
narrower: Juuri-, kaisla-, kori-, korkki-, lastu-, niini-, olki-, paju-, rottinki-, tuohi- ja tulitikkutyöt
narrower: Betoni- ja kipsityöt
notation: 65.9
preferred label: Other handicraft @en
preferred label: Övriga handarbeten @sv

Helmityöt
type: Concept
type: YKL-luokka
alternative label: Helmet, käsityöohjeet ja -mallit (65.91)
alternative label: Helmityöt, käsityöohjeet ja -mallit (65.91)
alternative label: Pärlarbeten, handarbete, beskrivningar och mönster (65.91) @sv
alternative label: Pärlor, handarbete, beskrivningar och mönster (65.91) @sv
broader: Muut käsityöt
in scheme: YKL - Yleisten kirjastojen luokitusjärjestelmä
notation: 65.91
preferred label: Pearl work @en
preferred label: Pärlarbeten @sv

Juuri-, kaisla-, kori-, korkki-, lastu-, niini-, olki-, paju-, rottinki-, tuohi- ja tulitikkutyöt
type: Concept
References: Solmeilu. Makramee. Fransut
type: YKL-luokka
alternative label: Bastarbeten, arbetsbeskrivningar och mönster (65.92) @sv
alternative label: Flätningsarbeten, arbetsbeskrivningar och mönster (65.92) @sv
alternative label: Halmarbeten, arbetsbeskrivningar och mönster (65.92) @sv
alternative label: Halmmobiler, arbetsbeskrivningar och mönster (65.92) @sv
alternative label: Himmelit, ohjeet ja mallit (65.92)
alternative label: Juurityöt, ohjeet ja mallit (65.92)
alternative label: Kaislatyöt, ohjeet ja mallit (65.92)
alternative label: Korgarbeten, arbetsbeskrivningar och mönster (65.92) @sv
alternative label: Korityöt, ohjeet ja mallit (65.92)
alternative label: Korkarbeten, arbetsbeskrivningar och mönster (65.92) @sv
alternative label: Korkkityöt, ohjeet ja mallit (65.92)
alternative label: Lastutyöt, ohjeet ja mallit (65.92)
alternative label: Niinityöt, ohjeet ja mallit (65.92)
alternative label: Näverarbeten, arbetsbeskrivningar och mönster (65.92) @sv
alternative label: Olkityöt, ohjeet ja mallit (65.92)
alternative label: Pajutyöt, ohjeet ja mallit (65.92)
alternative label: Punontatyöt, ohjeet ja mallit (65.92)
alternative label: Risslöjd, arbetsbeskrivningar och mönster (65.92) @sv
alternative label: Risutyöt, ohjeet ja mallit (65.92)
alternative label: Rotarbeten, arbetsbeskrivningar och mönster (65.92) @sv
alternative label: Rottingarbeten, arbetsbeskrivningar och mönster (65.92) @sv
alternative label: Rottinkityöt, ohjeet ja mallit (65.92)
alternative label: Spånarbeten, arbetsbeskrivningar och mönster (65.92) @sv
alternative label: Sävarbeten, arbetsbeskrivningar och mönster (65.92) @sv
alternative label: Tulitikkutyöt, ohjeet ja mallit (65.92)
alternative label: Tuohityöt, ohjeet ja mallit (65.92)
alternative label: Tändsticksarbeten, arbetsbeskrivningar och mönster (65.92) @sv
alternative label: Videarbeten, arbetsbeskrivningar och mönster (65.92) @sv
broader: Muut käsityöt
in scheme: YKL - Yleisten kirjastojen luokitusjärjestelmä
notation: 65.92
preferred label: Bast-, halm-, korg-, kork-, näver-, rot-, rotting-, spån-, säv-, tändsticks- och videarbeten @sv
preferred label: Root crafts, reed crafts, wicker crafts, cork crafts, wood chip and wood shavings crafts, bast fibre crafts, straw crafts, osier crafts, rattan and cane crafts, birch bark crafts - and matchstick crafts @en
scope note: Flätningsarbeten i allmänhet. Halmmobiler. Risslöjd @sv
scope note: Punontatyöt yleensä. Himmelit. Risutyöt

Betoni- ja kipsityöt
type: Concept
type: YKL-luokka
alternative label: Betong, hobbyarbete (65.93) @sv
alternative label: Betoni, askartelu (65.93)
alternative label: Gips, hobbyarbete (65.93) @sv
alternative label: Kipsi, askartelu (65.93)
broader: Muut käsityöt
in scheme: YKL - Yleisten kirjastojen luokitusjärjestelmä
notation: 65.93
preferred label: Betong- och gipsarbete @sv
preferred label: Concrete crafts and plaster crafts @en

RAKENNUSTEKNIIKKA
type: Concept
References: Asemakaava- ja rakentamislainsäädäntö
References: ALUESUUNNITTELU. ALUEPOLITIIKKA
References: KANSATIEDE. KULTTUURIANTROPOLOGIA
References: Rakennukset. Rakennustyypit
type: YKL-luokka
alternative label: Brandsäkerhet, byggnadsteknik (66+) @sv
alternative label: Byggande (66+) @sv
alternative label: Bygginstruktioner, byggnadsteknik (66+) @sv
alternative label: Byggmaskiner, byggnadsteknik (66) @sv
alternative label: Byggnadsarbeten, byggnadsteknik (66) @sv
alternative label: Byggnadsbranschen (66+) @sv
alternative label: Byggnadsforskning, byggnadsteknik (66) @sv
alternative label: Byggnadsindustri (66+) @sv
alternative label: Byggnadsinspektion, byggnadsteknik (66) @sv
alternative label: Byggnadsteknik (66+) @sv
alternative label: Byggvaror, byggnadsteknik (66) @sv
alternative label: Byggverktyg, byggnadsteknik (66) @sv
alternative label: Iglor, byggnadsinstruktioner (66+) @sv
alternative label: Iglut, rakennusohjeet (66+)
alternative label: Kommunalteknik (66) @sv
alternative label: Kunnallistekniikka (66)
alternative label: Lumilinnat (66+)
alternative label: Lumirakentaminen (66+)
alternative label: Paloturvallisuus, rakennustekniikka (66+)
alternative label: Rakennusala (66+)
alternative label: Rakennuskoneet, rakennustekniikka (66)
alternative label: Rakennusohjeet, rakennustekniikka (66+)
alternative label: Rakennustarkastus, rakennustekniikka (66)
alternative label: Rakennustarvikkeet, rakennustekniikka (66)
alternative label: Rakennustekniikka (66+)
alternative label: Rakennusteollisuus (66+)
alternative label: Rakennustutkimus, rakennustekniikka (66)
alternative label: Rakennustyökalut, rakennustekniikka (66)
alternative label: Rakennustyöt, rakennustekniikka (66)
alternative label: Rakentaminen (66+)
alternative label: Snöbyggande (66+) @sv
alternative label: Snöslott (66+) @sv
alternative label: Yhdyskuntatekniikka (66)
broader: TEKNIIKKA. TEOLLISUUS. KÄSITYÖ. MAA- JA METSÄTALOUS KOTITALOUS. LIIKETALOUS. LIIKENNE
in scheme: YKL - Yleisten kirjastojen luokitusjärjestelmä
narrower: Rakennusstatiikka. Rakennussuunnittelu
narrower: Geotekniikka. Maatyöt
narrower: Talonrakennus
narrower: Rakennuksen kunnossapito
narrower: Tienrakennus
narrower: Vesirakennus
narrower: Kunnallistekninen ympäristönhuolto
notation: 66
preferred label: BYGGNADSTEKNIK @sv
preferred label: CONSTRUCTION ENGINEERING @en
scope note: Hit allmänna verk om byggnadsteknik. Byggnadsbranschen i allmänhet. Hit och till underklasserna byggande, byggarbete, byggverktyg, byggmaskiner och byggmaterial samt byggforskning och bygginspektion. Hit och till underklasserna också kommunalteknik och byggande av kommunaltekniska anläggningar. Om verket innehåller både byggnadsinstruktioner och etnologi, ges företräde åt klass 66+. Om verket innehåller både byggnadsteknik och arkitektur, ges företräde åt klass 66+ @sv
scope note: Tähän rakennustekniikan yleisteokset. Rakennusala yleensä. Tähän ja alaluokkiin rakentaminen, rakennustyö, rakennustyökalut, rakennuskoneet ja rakennustarvikkeet sekä rakennustutkimus ja rakennustarkastus. Tähän ja alaluokkiin myös kunnallistekniikka ja sen rakentaminen. Jos teoksessa on sekä rakennusohjeita että kansatiedettä, annetaan etusija luokalle 66+. Jos teoksessa on sekä rakennustekniikkaa että arkkitehtuuria, annetaan etusija luokalle 66+

Rakennusstatiikka. Rakennussuunnittelu
type: Concept
References: Geotekniikka. Maatyöt
References: Talonrakennus
References: Rakennuksen kunnossapito
References: Tienrakennus
References: Vesirakennus
alternative label: Balkar, byggnadsteknik (66.1) @sv
alternative label: Belastningsberäkningar, byggnadsteknik (66.1) @sv
alternative label: Betong, byggnadsteknik (66.1) @sv
alternative label: Betongarbeten, byggnadsteknik (66.1) @sv
alternative label: Betongarmering, byggnadsteknik (66.1) @sv
alternative label: Betoni, rakennustekniikka (66.1)
alternative label: Betoniraudoitus, rakennustekniikka (66.1)
alternative label: Betonityöt, rakennustekniikka (66.1)
alternative label: Byggelement, byggnadsteknik (66.1) @sv
alternative label: Byggkostnader, byggnadsteknik (66.1) @sv
alternative label: Byggmaterial, byggnadsteknik (66.1) @sv
alternative label: Byggnadsbeskrivningar, byggnadsteknik (66.1) @sv
alternative label: Byggnadsplanering, byggnadsteknik (66.1) @sv
alternative label: Byggnadsritningar, byggnadsteknik (66.1) @sv
alternative label: Byggnadsstatik, byggnadsteknik (66.1) @sv
alternative label: Byggnadsstommar, byggnadsteknik (66.1) @sv
alternative label: Bärförmåga, byggnadsteknik (66.1) @sv
alternative label: Cement, byggnadsteknik (66.1) @sv
alternative label: Elementstrukturer, byggnadsteknik (66.1) @sv
alternative label: Elementtirakenteet, rakennustekniikka (66.1)
alternative label: Färdigställande, byggnadsteknik (66.1) @sv
alternative label: Glas, byggnadsteknik (66.1) @sv
alternative label: Holvit, rakennustekniikka (66.1)
alternative label: Hängkonstruktioner, byggnadsteknik (66.1) @sv
alternative label: Hållfasthetsberäkningar, byggnadsteknik (66.1) @sv
alternative label: Jännityslaskelmat, rakennustekniikka (66.1)
alternative label: Kaakelointi, rakennustekniikka (66.1)
alternative label: Kakelläggning, byggnadsteknik (66.1) @sv
alternative label: Kalk, byggnadsteknik (66.1) @sv
alternative label: Kalkki, rakennustekniikka (66.1)
alternative label: Kantokyky, rakennustekniikka (66.1)
alternative label: Kivi, rakennustekniikka (66.1)
alternative label: Kolonner, byggteknik (66.1) @sv
alternative label: Kuormalaskelmat, rakennustekniikka (66.1)
alternative label: Kustannuslaskelmat, rakennustekniikka (66.1)
alternative label: Laasti, rakennustekniikka (66.1)
alternative label: Laatat, rakennustekniikka (66.1)
alternative label: Lasi, rakennustekniikka (66.1)
alternative label: Levyt, rakennustekniikka (66.1)
alternative label: Lujuuslaskelmat, rakennustekniikka (66.1)
alternative label: Metallit, rakennustekniikka (66.1)
alternative label: Mineraalit, rakennustekniikka (66.1)
alternative label: Muovit, rakennustekniikka (66.1)
alternative label: Määrälaskelmat, rakennustekniikka (66.1)
alternative label: Palkit, rakennustekniikka (66.1)
alternative label: Piirustus, rakennuspiirustus (66.1)
alternative label: Pilarit, rakennustekniikka (66.1)
alternative label: Puu, rakennustekniikka (66.1)
alternative label: Puutyöt, rakennustekniikka (66.1)
alternative label: Pylväät, rakennustekniikka (66.1)
alternative label: Rakenneosat, rakennustekniikka (66.1)
alternative label: Rakennusaineet, rakennustekniikka (66.1)
alternative label: Rakennuselementit, rakennustekniikka (66.1)
alternative label: Rakennuskustannukset, rakennustekniikka (66.1)
alternative label: Rakennuspiirustukset, rakennustekniikka (66.1)
alternative label: Rakennusrungot, rakennustekniikka (66.1)
alternative label: Rakennusselitykset, rakennustekniikka (66.1)
alternative label: Rakennusstatiikka, rakennustekniikka (66.1)
alternative label: Rakennussuunnittelu, rakennustekniikka (66.1)
alternative label: Rakenteet, rakennustekniikka (66.1)
alternative label: Rappaustyöt, rakennustekniikka (66.1)
alternative label: Riippurakenteet, rakennustekniikka (66.1)
alternative label: Savi, rakennustekniikka (66.1)
alternative label: Sementti, rakennustekniikka (66.1)
alternative label: Tekninen rakennuspiirustus (66.1)
alternative label: Teräs, rakennustekniikka (66.1)
alternative label: Tiili, rakennustekniikka (66.1)
alternative label: Viimeistelytyöt, rakennustekniikka (66.1)
alternative label: Ylipainerakenteet, rakennustekniikka (66.1)
broader: RAKENNUSTEKNIIKKA
in scheme: YKL - Yleisten kirjastojen luokitusjärjestelmä
notation: 66.1
scope note: Hit allmänna verk om byggnadsstatik och teknisk byggnadsplanering Konstruktioner, konstruktionsdelar, byggmaterial, byggstommar och byggelement i allmänhet Teknisk byggnadsritning i allmänhet Tekniska byggnadsritningar samt byggnadsbeskrivningar och byggnadsredogörelser i allmänhet Mängd-, kostnads-, hållfasthets-, belastnings- och spänningsberäkningar samt mätning av konstruktioner och konstruktionernas bärförmåga i allmänhet Trä, betong, cement, sten, mineralen, kalk, tegel, lera, jord, metaller, stål, plast och glas som byggmaterial i allmänhet Skivor, plattor, balkar, pelare, kolonner och valv som konstruktionskomponenter i allmänhet Hit också häng-, valv- och elementkonstruktioner i allmänhet @sv
scope note: Tähän rakennusstatiikan ja teknisen rakennussuunnittelun yleisteokset Rakenteet, rakenneosat, rakennusaineet, rakennusrungot ja rakennuselementit yleensä Tekninen rakennuspiirustus yleensä Tekniset rakennuspiirustukset sekä rakennusselitykset ja rakennusselostukset yleensä Määrä-, kustannus-, lujuus-, kuorma- ja jännityslaskelmat sekä rakenteiden mitoitus ja kantokyky yleensä Puu, betoni, sementti, kivi, mineraalit, kalkki, tiili, savi, maa, metallit, teräs, muovi ja lasi rakennusaineina yleensä Levyt, laatat, palkit, pilarit, pylväät ja holvit rakenneosina yleensä Tähän myös riippu-, ylipaine- ja elementtirakenteet yleensä

Geotekniikka. Maatyöt
type: Concept
References: Kaivannaisteollisuus
References: Talonrakennus
References: Tienrakennus
References: Vesirakennus
References: Kunnallistekninen ympäristönhuolto
References: Jätehuolto. Kierrätys
type: YKL-luokka
alternative label: Bergbyggnad (66.2) @sv
alternative label: Bergmekanik (66.2) @sv
alternative label: Bergskärning (66.2) @sv
alternative label: Brytning, byggnadsteknik (66.2) @sv
alternative label: Geotekniikka (66.2)
alternative label: Geoteknik (66.2) @sv
alternative label: Grunder, byggnadsteknik (66.2) @sv
alternative label: Grundkonstruktioner, byggnadsteknik (66.2) @sv
alternative label: Grävningsteknik, geoteknik (66.2) @sv
alternative label: Is, geoteknik (66.2) @sv
alternative label: Jord, byggnadsteknik (66.2) @sv
alternative label: Jordbyggnad (66.2) @sv
alternative label: Jordmån, geoteknik (66.2) @sv
alternative label: Jordtransporter, geoteknik (66.2) @sv
alternative label: Jordutjämning, geoteknik (66.2) @sv
alternative label: Jää, geotekniikka (66.2)
alternative label: Kaivuutekniikka, geotekniikka (66.2)
alternative label: Kalliomekaniikka (66.2)
alternative label: Kallionleikkaus (66.2)
alternative label: Kallionrakennus (66.2)
alternative label: Louhinta, rakennustekniikka (66.2)
alternative label: Lumi, geotekniikka (66.2)
alternative label: Maa, rakennustekniikka (66.2)
alternative label: Maanrakennus (66.2)
alternative label: Maansiirrot, geotekniikka (66.2)
alternative label: Maansiirtokoneet, käyttö (66.2)
alternative label: Maantasaus, geotekniikka (66.2)
alternative label: Maantäyttö, geotekniikka (66.2)
alternative label: Maanvahvistus, geotekniikka (66.2)
alternative label: Maaperä, geotekniikka (66.2)
alternative label: Maarakennus (66.2)
alternative label: Maatyöt, rakennustekniikka (66.2)
alternative label: Markarbeten, byggnadsteknik (66.2) @sv
alternative label: Markbyggnad (66.2) @sv
alternative label: Markförstärkning, geoteknik (66.2) @sv
alternative label: Markutfyllning, geoteknik (66.2) @sv
alternative label: Pengerrystekniikka, geotekniikka (66.2)
alternative label: Perustukset, rakennustekniikka (66.2)
alternative label: Pohjarakenteet, rakennustekniikka (66.2)
alternative label: Routa, geotekniikka (66.2)
alternative label: Routavauriot (66.2)
alternative label: Räjäytys, geotekniikka (66.2)
alternative label: Schaktningsmaskiner, användning (66.2) @sv
alternative label: Snö, geoteknik (66.2) @sv
alternative label: Sprängning, geoteknik (66.2) @sv
alternative label: Stödkonstruktioner, geoteknik (66.2) @sv
alternative label: Terasseringsteknik, geoteknik (66.2) @sv
alternative label: Tjäle, geoteknik (66.2) @sv
alternative label: Tjälskador (66.2) @sv
alternative label: Tukirakenteet, geotekniikka (66.2)
alternative label: Tunnelit, rakentaminen (66.2)
alternative label: Tunnlar, byggande (66.2) @sv
alternative label: Vatten, geoteknik (66.2) @sv
alternative label: Vesi, geotekniikka (66.2)
broader: RAKENNUSTEKNIIKKA
in scheme: YKL - Yleisten kirjastojen luokitusjärjestelmä
notation: 66.2
preferred label: Geotechnics. Earth-moving @en
preferred label: Geoteknik. Mark- och anläggningsarbeten @sv
scope note: Hit allmänna verk om geoteknik eller anläggningsarbeten Markbyggnad. Bergskärning. Tunnelbyggnad Grundarbeten. Stödkonstruktioner. Fundament Grävning, sprängning, schaktning, fyllning, utjämning, terrassering och förstärkning av mark eller berggrund Vatten, snö, is, tjäle och olika jordarter ur anläggningsarbetenas synvinkel Hit också geoteknik samt mark- och anläggningsarbeten ur byggnadsunderhållets synvinkel @sv
scope note: Tähän geotekniikkaa tai maatöitä koskevat yleisteokset Maarakennus. Kallionrakennus. Tunnelirakennus Perustukset. Tukirakenteet. Pohjarakennus Maan tai kallioperän kaivuu, louhinta, leikkaus, siirto, täyttö, tasaus, pengerrys ja vahvistaminen Vesi, lumi, jää, routa ja maaperän laatu maatöiden kannalta yleensä Tähän myös geotekniikka ja maatyöt rakennuksen kunnossapidon kannalta

Talonrakennus
type: Concept
References: Asemakaava- ja rakentamislainsäädäntö
References: Yhdyskuntasuunnittelu. Kaupunkisuunnittelu. Ympäristönsuunnittelu
References: Asuinalueiden suunnittelu
References: Asuntopolitiikka
References: Puuteollisuus
References: Rakennuksen kunnossapito
References: MAA- JA METSÄTALOUS. ELINTARVIKETEOLLISUUS. BIOTEKNIIKKA
References: Rakennukset. Rakennustyypit
alternative label: Aitat, rakentaminen (66.3+)
alternative label: Asemarakennukset, rakennustekniikka (66.3+)
alternative label: Asuinrakennukset, rakennustekniikka (66.3+)
alternative label: Asunnot, rakennustekniikka (66.3+)
alternative label: Autiotuvat, rakentaminen (66.3+)
alternative label: Ekotalot, rakennustekniikka (66.3+)
alternative label: Eläinsuojat, rakentaminen (66.3+)
alternative label: Geotekniikka, talonrakennus (66.3+)
alternative label: Hallintorakennukset, rakennustekniikka (66.3+)
alternative label: Hevostallit, rakentaminen (66.3+)
alternative label: Hoitolaitokset, rakennustekniikka (66.3+)
alternative label: Hotellit, rakennustekniikka (66.3+)
alternative label: Huvilat, rakennustekniikka (66.3+)
alternative label: Julkiset rakennukset, rakennustekniikka (66.3+)
alternative label: Jännityslaskelmat, talonrakennus (66.3+)
alternative label: Kanalat, rakentaminen (66.3+)
alternative label: Kantokyky, talonrakennus (66.3+)
alternative label: Karjasuojat, rakentaminen (66.3+)
alternative label: Kauppahallit, rakennustekniikka (66.3+)
alternative label: Kauppakeskukset, rakennustekniikka (66.3+)
alternative label: Keittiöt, rakennusohjeet (66.3+)
alternative label: Kerrostalot, rakennustekniikka (66.3+)
alternative label: Kesäasunnot, rakennustekniikka (66.3+)
alternative label: Kesämökit, rakennustekniikka (66.3+)
alternative label: Kirjastorakennukset, rakennustekniikka (66.3+)
alternative label: Kirkkorakennukset, rakennustekniikka (66.3+)
alternative label: Kirkot, rakennustekniikka (66.3+)
alternative label: Konserttitalot, rakennustekniikka (66.3+)
alternative label: Korkeakoulurakennukset, rakennustekniikka (66.3+)
alternative label: Kotieläinrakennukset, rakentaminen (66.3+)
alternative label: Koulurakennukset, rakennustekniikka (66.3+)
alternative label: Kulttuurirakennukset, rakennustekniikka (66.3+)
alternative label: Kuormalaskelmat, talonrakennus (66.3+)
alternative label: Kustannuslaskelmat, talonrakennus (66.3+)
alternative label: Kylpyhuoneet, rakennusohjeet (66.3+)
alternative label: Ladot, rakentaminen (66.3+)
alternative label: Lampolat, rakentaminen (66.3+)
alternative label: Liikennerakennukset, rakennustekniikka (66.3+)
alternative label: Liikerakennukset, rakennustekniikka (66.3+)
alternative label: Loma-asunnot, rakennustekniikka (66.3+)
alternative label: Lujuuslaskelmat, talonrakennus (66.3+)
alternative label: Maatalousrakennukset, rakentaminen (66.3+)
alternative label: Maatyöt, talonrakennus (66.3+)
alternative label: Majat, rakentaminen (66.3+)
alternative label: Monitoimitalot, rakennustekniikka (66.3+)
alternative label: Motellit, rakennustekniikka (66.3+)
alternative label: Museot, rakennustekniikka (66.3+)
alternative label: Määrälaskelmat, talonrakennus (66.3+)
alternative label: Navetat, rakentaminen (66.3+)
alternative label: Nuorisotalot, rakennustekniikka (66.3+)
alternative label: Omakotitalot, rakennustekniikka (66.3+)
alternative label: Oopperatalot, rakennustekniikka (66.3+)
alternative label: Oppilaitokset, rakennustekniikka (66.3+)
alternative label: Pappilat, rakennustekniikka (66.3+)
alternative label: Parantolat, rakennustekniikka (66.3+)
alternative label: Paritalot, rakennustekniikka (66.3+)
alternative label: Pientalot, rakennustekniikka (66.3+)
alternative label: Piirustus, talonrakennus (66.3+)
alternative label: Puutalot, rakennustekniikka (66.3+)
alternative label: Rakennukset, talonrakennus (66.3+)
alternative label: Rakennusala, talonrakennus (66.3+)
broader: RAKENNUSTEKNIIKKA
in scheme: YKL - Yleisten kirjastojen luokitusjärjestelmä
narrower: Rakenneosat
narrower: Rakennusaineet. Rakennustyöt
narrower: LVI-työt. Sähkötyöt
narrower: Rakennusten erillistilat
narrower: Huoneakustiikka
notation: 66.3
scope note: Hit allmänna verk om husbyggnad Hit och till underklasserna byggande av offentliga byggnader och bostäder Hit och till underklasserna byggande av t.ex. skolor, sjukhus, affärshus, hotell, kulturbyggnader, fabriker och lantbruksbyggnader Hit och till underklasserna byggande av flervåningshus, radhus, parhus och egnahemshus samt fritidshus Hit och till underklasserna byggnadsstatik, byggnadsplanering och byggnadsritning ur husbyggnadens synvinkel Hit och till underklasserna byggnads- och typritningar, byggnadsbeskrivningar och byggnadsinstruktioner samt mängd-, kostnads-, hållfasthets-, belastnings- och spänningsberäkningar när det gäller husbyggnad Hit geoteknik och anläggningsarbeten för husbyggnad @sv
scope note: Tähän talonrakennuksen yleisteokset Tähän ja alaluokkiin julkisten rakennusten ja asuinrakennusten rakentaminen Tähän ja alaluokkiin esim. koulujen, sairaaloiden, liiketalojen, hotellien, kulttuurirakennusten, tehtaiden ja maatalousrakennusten rakentaminen Tähän ja alaluokkiin kerros-, rivi-, pari- ja omakotitalojen sekä huviloiden rakentaminen Tähän ja alaluokkiin rakennusstatiikka, rakennussuunnittelu ja rakennuspiirustus talonrakennuksen kannalta Tähän ja alaluokkiin rakennus- ja tyyppipiirustukset, rakennusselitykset ja -ohjeet sekä määrä-, kustannus-, lujuus-, kuorma- ja jännitelaskelmat talonrakennuksessa Tähän geotekniikka ja maatyöt talonrakennuksessa

Rakenneosat
type: Concept
References: Rakennusaineet. Rakennustyöt
References: LVI-työt. Sähkötyöt
References: Rakennusten erillistilat
References: Huoneakustiikka
type: YKL-luokka
alternative label: Balkar, husbyggnad (66.32) @sv
alternative label: Byggelement, husbyggnad (66.32) @sv
alternative label: Byggnadsstommar, husbyggnad (66.32) @sv
alternative label: Bärande väggar, husbyggnad (66.32) @sv
alternative label: Dörrar, husbyggnad (66.32) @sv
alternative label: Elementstrukturer, husbyggnad (66.32) @sv
alternative label: Elementtirakenteet, talonrakennus (66.32)
alternative label: Fasader (66.32) @sv
alternative label: Fönster, husbyggnad (66.32) @sv
alternative label: Golv, husbyggnad (66.32) @sv
alternative label: Grunder, husbyggnad (66.32) @sv
alternative label: Grundkonstruktioner, husbyggnad (66.32) @sv
alternative label: Holvit, talonrakennus (66.32)
alternative label: Ikkunat, talonrakennus (66.32)
alternative label: Innertak, husbyggnad (66.32) @sv
alternative label: Julkisivut (66.32)
alternative label: Kantavat seinät, talonrakennus (66.32)
alternative label: Katot, talonrakennus (66.32)
alternative label: Kevyet seinät, talonrakennus (66.32)
alternative label: Komponenter, husbyggnad (66.32) @sv
alternative label: Konstruktioner, husbyggnad (66.32) @sv
alternative label: Lattiat, talonrakennus (66.32)
alternative label: Lätta väggar, husbyggnad (66.32) @sv
alternative label: Murar, husbyggnad (66.32) @sv
alternative label: Muurit, talonrakennus (66.32)
alternative label: Ovet, talonrakennus (66.32)
alternative label: Palkit, talonrakennus (66.32)
alternative label: Pelare, husbyggnad (66.32) @sv
alternative label: Perustukset, talonrakennus (66.32)
alternative label: Pilarit, talonrakennus (66.32)
alternative label: Pohjarakenteet, talonrakennus (66.32)
alternative label: Portaat, talonrakennus (66.32)
alternative label: Pylväät, talonrakennus (66.32)
alternative label: Rakenneosat, talonrakennus (66.32)
alternative label: Rakennuselementit, talonrakennus (66.32)
alternative label: Rakennusrungot, talonrakennus (66.32)
alternative label: Rakenteet, talonrakennus (66.32)
alternative label: Seinät, talonrakennus (66.32)
alternative label: Sisäkatot, talonrakennus (66.32)
alternative label: Stödkonstruktioner, husbyggnad (66.32) @sv
alternative label: Tak, husbyggnad (66.32) @sv
alternative label: Trappor, husbyggnad (66.32) @sv
alternative label: Tukirakenteet, talonrakennus (66.32)
alternative label: Valv, husbyggnad (66.32) @sv
alternative label: Vesikatot, talonrakennus (66.32)
alternative label: Väggar, husbyggnad (66.32) @sv
alternative label: Yttertak, husbyggnad (66.32) @sv
broader: Talonrakennus
in scheme: YKL - Yleisten kirjastojen luokitusjärjestelmä
notation: 66.32
preferred label: Building components @en
preferred label: Konstruktionsdelar @sv
scope note: Konstruktionsdelar ur husbyggnadens synvinkel och ur byggnadsunderhållets synvinkel Grunder, murar, bärande och lätta väggar, valv, inner- och yttertak, golv, fundament, trappor, dörrar, fönster, pelare, kolonner, balkar, fasader och byggelement ur husbyggnadens synvinkel och ur byggnadsunderhållets synvinkel Hit också byggnadsarbeten och byggmaterial som har att göra med en viss konstruktionsdel @sv
scope note: Rakenneosat talonrakennuksen ja rakennuksen kunnossapidon kannalta Perustukset, muurit, kantavat ja kevyet seinät, holvit, sisä- ja vesikatot, lattiat, pohjarakenteet, portaat, ovet, ikkunat, pilarit, pylväät, palkit, julkisivut ja rakennuselementit talonrakennuksen ja rakennuksen kunnossapidon kannalta Tähän myös tiettyyn rakenneosaan liittyvät rakennustyöt ja rakennusaineet

Rakennusaineet. Rakennustyöt
type: Concept
References: Rakenneosat
References: LVI-työt. Sähkötyöt
alternative label: Betong, husbyggnad (66.33) @sv
alternative label: Betongarbeten, husbyggnad (66.33) @sv
alternative label: Betongarmering, husbyggnad (66.33) @sv
alternative label: Betoni, talonrakennus (66.33)
alternative label: Betoniraudoitus, talonrakennus (66.33)
alternative label: Betonityöt, talonrakennus (66.33)
alternative label: Byggmaskiner, husbyggnad (66.33) @sv
alternative label: Byggmaterial, husbyggnad (66.33) @sv
alternative label: Byggnadsarbeten, husbyggnad (66.33) @sv
alternative label: Byggvaror, husbyggnad (66.33) @sv
alternative label: Byggverktyg, husbyggnad (66.33) @sv
alternative label: Cement, husbyggnad (66.33) @sv
alternative label: Färdigställande, husbyggnad (66.33) @sv
alternative label: Glas, husbyggnad (66.33) @sv
alternative label: Impregnering, byggnadsarbeten (66.33) @sv
alternative label: Jord, husbyggnad (66.33) @sv
alternative label: Kaakelointi, talonrakennus (66.33)
alternative label: Kakelläggning, husbyggnad (66.33) @sv
alternative label: Kalk, husbyggnad (66.33) @sv
alternative label: Kalkki, talonrakennus (66.33)
alternative label: Kirvesmiehen työ, talonrakennus (66.33)
alternative label: Kivi, talonrakennus (66.33)
alternative label: Kyllästys, rakennustyöt (66.33)
alternative label: Laasti, talonrakennus (66.33)
alternative label: Laatat, talonrakennus (66.33)
alternative label: Laatoitus, talonrakennus (66.33)
alternative label: Lack, målarens arbete (66.33) @sv
alternative label: Lakat, maalarin työ (66.33)
alternative label: Lasi, talonrakennus (66.33)
alternative label: Lera, husbyggnad (66.33) @sv
alternative label: Levyt, talonrakennus (66.33)
alternative label: Maa, talonrakennus (66.33)
alternative label: Maalarin työ (66.33)
alternative label: Maalaus (66.33)
alternative label: Maalaustyöt, talonrakennus (66.33)
alternative label: Maalit, maalarin työ (66.33)
alternative label: Metaller, husbyggnad (66.33) @sv
alternative label: Metallit, talonrakennus (66.33)
alternative label: Mineraalit, talonrakennus (66.33)
alternative label: Mineral, husbyggnad (66.33) @sv
alternative label: Muovit, talonrakennus (66.33)
alternative label: Murarens arbete (66.33) @sv
alternative label: Murbruk, husbyggnad (66.33) @sv
alternative label: Murningsarbeten, husbyggnad (66.33) @sv
alternative label: Muurarin työ (66.33)
alternative label: Muuraustyöt, talonrakennus (66.33)
alternative label: Målarens arbete (66.33) @sv
alternative label: Målarfärger, målarens arbete (66.33) @sv
alternative label: Målning (66.33) @sv
alternative label: Målningsarbeten, husbyggnad (66.33) @sv
alternative label: Möbeltapetsering (66.33) @sv
alternative label: Pintakäsittely, rakennustyöt (66.33)
alternative label: Plaster, husbyggnad (66.33) @sv
alternative label: Plattläggning, husbyggnad (66.33) @sv
alternative label: Plattor, husbyggnad (66.33) @sv
alternative label: Puu, talonrakennus (66.33)
alternative label: Puusepän työ, rakennuspuusepän työ (66.33)
alternative label: Puutyöt, talonrakennus (66.33)
alternative label: Rakennusaineet, talonrakennus (66.33)
alternative label: Rakennuskoneet, talonrakennus (66.33)
alternative label: Rakennustarvikkeet, talonrakennus (66.33)
alternative label: Rakennustyökalut, talonrakennus (66.33)
alternative label: Rakennustyöt, talonrakennus (66.33)
alternative label: Rappaustyöt, talonrakennus (66.33)
alternative label: Ruiskumaalaus, maalaustyöt (66.33)
alternative label: Savi, talonrakennus (66.33)
alternative label: Sementti, talonrakennus (66.33)
alternative label: Tapetointi (66.33)
alternative label: Teräs, talonrakennus (66.33)
alternative label: Tiili, talonrakennus (66.33)
alternative label: Työkalut, rakennustyöt (66.33)
alternative label: Viimeistelytyöt, talonrakennus (66.33)
broader: Talonrakennus
in scheme: YKL - Yleisten kirjastojen luokitusjärjestelmä
notation: 66.33
scope note: Hit byggmaterial och byggnadsarbeten ur husbyggnadens synvinkel och ur byggnadsunderhållets synvinkel Byggmaskiner, byggredskap och byggtillbehör för husbyggnad Trä, betong, cement, sten, mineral, kalk, tegel, lera, jord, metall, stål, plast och glas som byggmaterial ur husbyggnadens synvinkel och ur byggnadsunderhållets synvinkel Betongarbete, arbete med armerad betong, metall-, stål-, trä-, murnings-, rappnings-, kakel- och stenläggningsarbete samt målning, glasinsättning och tapetsering och andra liknande arbeten ur husbyggnadens synvinkel samt ur byggnadsunderhållets synvinkel @sv
scope note: Tähän rakennusaineet ja -työt talonrakennuksen ja rakennuksen kunnossapidon kannalta Rakennuskoneet, -työkalut ja -tarvikkeet talonrakennuksessa Puu, betoni, sementti, kivi, mineraalit, kalkki, tiili, savi, maa, metallit, teräs, muovi ja lasi rakennusaineina talonrakennuksen ja rakennuksen kunnossapidon kannalta Betoni-, teräsbetoni-, metalli-, teräs-, puu-, muuraus-, rappaus-, laatoitus- ja kiveystyöt sekä maalaus, lasitus tapetointi ja muut viimeistelytyöt talonrakennuksen ja rakennuksen kunnossapidon kannalta

LVI-työt. Sähkötyöt
type: Concept
References: Energia
References: Sähkötekniikka
References: Vesi- ja jätevesihuolto
type: YKL-luokka
alternative label: Avlopp, husbyggnad (66.34) @sv
alternative label: Belysning, VVS-arbeten (66.34) @sv
alternative label: Brunnar, byggande (66.34) @sv
alternative label: Elarbeten, husbyggnad (66.34+) @sv
alternative label: Elbesparing, byggnader (66.34+) @sv
alternative label: Elförbruknig, byggnader (66.34+) @sv
alternative label: Elljus, VVS-arbeten (66.34) @sv
alternative label: Elsäkerhet, elarbeten för byggnader (66.34+) @sv
alternative label: Energiankulutus, rakennukset (66.34+)
alternative label: Energiansäästö, rakennukset (66.34+)
alternative label: Energiatodistukset, talonrakennus (66.34)
alternative label: Energibesparing, byggnader (66.34+) @sv
alternative label: Energicertificat, husbyggnad (66.34) @sv
alternative label: Energiförbrukning, byggnader (66.34+) @sv
alternative label: Fuktning, VVS-arbeten (66.34) @sv
alternative label: Glödlampor, VVS-arbeten (66.34) @sv
alternative label: Hemreparationer, el-arbeten (66.34+) @sv
alternative label: Ilmanvaihto (66.34)
alternative label: Ilmastointi (66.34)
alternative label: Kaivot, rakentaminen (66.34)
alternative label: Kodin korjaustyöt, sähkötyöt (66.34+)
alternative label: Kompostikäymälät, rakennustekniikka (66.34)
alternative label: Kosteutus, LVI-työt (66.34)
alternative label: Kuivakäymälät (66.34)
alternative label: Käymälätekniikka (66.34)
alternative label: LVI-asennukset (66.34+)
alternative label: LVI-huolto (66.34+)
alternative label: LVI-tekniikka (66.34+)
alternative label: LVI-työt (66.34+)
alternative label: Lampor, elarbeten i byggnader (66.34) @sv
alternative label: Lamput, rakennuksen sähkötyöt (66.34)
alternative label: Luftkonditionering (66.34) @sv
alternative label: Mulltoaletter, byggnadsteknik (66.34) @sv
alternative label: Putkityöt, talonrakennus (66.34)
alternative label: Rörläggningar, husbyggnad (66.34) @sv
alternative label: Saniteettitekniikka (66.34)
alternative label: Sanitetsteknik (66.34) @sv
alternative label: Sähkölamput, LVI-työt (66.34)
alternative label: Sähkönkulutus, rakennukset (66.34+)
alternative label: Sähkönsäästö, rakennukset (66.34+)
alternative label: Sähköturvallisuus, rakennuksen sähkötyöt (66.34+)
alternative label: Sähkötyöt, talonrakennus (66.34+)
alternative label: Sähkövalo, LVI-työt (66.34)
alternative label: Toaletteknik (66.34) @sv
alternative label: Torrklosetter (66.34) @sv
alternative label: Tuuletus, talonrakennus (66.34)
alternative label: Tuuletuslaitteet (66.34)
alternative label: VVS-arbeten (66.34+) @sv
alternative label: VVS-installeringar (66.34+) @sv
alternative label: VVS-service (66.34+) @sv
alternative label: VVS-teknik (66.34+) @sv
alternative label: Valaistus, LVI-työt (66.34)
alternative label: Vattenbesparing, byggnader (66.34) @sv
alternative label: Vattenförbrukning, byggnader (66.34) @sv
alternative label: Vattenledningar, husbyggnad (66.34) @sv
alternative label: Vedenkulutus, rakennukset (66.34)
alternative label: Vedensäästö, rakennukset (66.34)
alternative label: Ventilation (66.34) @sv
alternative label: Ventilation, husbyggnad (66.34) @sv
alternative label: Ventilationsanläggningar (66.34) @sv
alternative label: Vesijohdot, talonrakennus (66.34)
alternative label: Viemärit, talonrakennus (66.34)
alternative label: WC-tekniikka (66.34)
alternative label: WC-teknik (66.34) @sv
broader: Talonrakennus
in scheme: YKL - Yleisten kirjastojen luokitusjärjestelmä
narrower: Lämmitys
notation: 66.34
preferred label: HVAC and plumbing. Electrical installation @en
preferred label: VVS-arbeten. Elarbeten @sv
scope note: Hit VVS-arbeten, VVS-teknik, VVS-installationer och VVS-service för byggnader i allmänhet Hit också elarbeten, elektroteknik, elinstallationer och elservice i allmänhet Hit också byggnadens vattenledningar, avlopp och sanitetsanläggningar samt underhållet av dem Hit också byggnadens luftkonditionering, luftfuktighet och belysning samt underhållet av dem @sv
scope note: Rakennusten LVI-työt, LVI-tekniikka, LVI-asennukset ja LVI-huolto yleensä Tähän myös rakennusten sähkötyöt, sähkötekniikka, sähköasennukset ja sähköhuolto yleensä Tähän myös rakennusten vesijohdot, viemärit ja saniteettilaitteet sekä niiden kunnossapito Tähän myös rakennusten ilmastointi, ilmankosteutus ja valaistus sekä niiden kunnossapito

Lämmitys
type: Concept
References: Palo- ja pelastustoimi
References: Energia
References: Sähkötekniikka
alternative label: Aurinkoenergia, lämmitystekniikka (66.341)
alternative label: Aurinkolämmitys (66.341)
alternative label: Aurinkopaneelit, lämmitystekniikka (66.341)
alternative label: Brännoljor, uppvärmningsteknik (66.341) @sv
alternative label: Bränntorv, uppvärmningsteknik (66.341) @sv
alternative label: Brännved, uppvärmningsteknik (66.341) @sv
alternative label: Bränslen, uppvärmningsteknik (66.341) @sv
alternative label: Centralvärme (66.341) @sv
alternative label: Elbesparing, uppvärmningsteknik (66.341) @sv
alternative label: Elförbrukning, uppvärmningsteknik (66.341) @sv
alternative label: Elvärme (66.341) @sv
alternative label: Energialternativ, uppvärmningsteknik (66.341) @sv
alternative label: Energiankulutus, lämmitystekniikka (66.341)
alternative label: Energiansäästö, lämmitystekniikka (66.341)
alternative label: Energiavaihtoehdot, lämmitystekniikka (66.341)
alternative label: Energibesparing, uppvärmningsteknik (66.341) @sv
alternative label: Energiförbrukning, uppvärmningsteknik (66.341) @sv
alternative label: Eristys, lämmitystekniikka (66.341)
alternative label: Fjärrvärme (66.341) @sv
alternative label: Flytgas, uppvärmningsteknik (66.341) @sv
alternative label: Fossiiliset polttoaineet, lämmitystekniikka (66.341)
alternative label: Fossila bränslen, uppvärmningsteknik (66.341) @sv
alternative label: Gasuppvärmning (66.341) @sv
alternative label: Golvvärme (66.341) @sv
alternative label: Halot, lämmitys (66.341)
alternative label: Hormit, rakennustekniikka (66.341)
alternative label: Huonekohtainen lämmitys (66.341)
alternative label: Höyrykeskuslämmitys (66.341)
alternative label: Isolering, uppvärmningsteknik (66.341) @sv
alternative label: Jordvärme, uppvärmningsteknik (66.341) @sv
alternative label: Kaakeliuunit (66.341)
alternative label: Kaasulämmitys (66.341)
alternative label: Kakelugnar (66.341) @sv
alternative label: Kamiinat, lämmitystekniikka (66.341)
alternative label: Kaminer, uppvärmningsteknik (66.341) @sv
alternative label: Kaukolämmitys (66.341)
alternative label: Keskuslämmitys (66.341)
alternative label: Kivihiili, lämmitystekniikka (66.341)
alternative label: Koksilämmitys (66.341)
alternative label: Koksuppvärmning (66.341) @sv
alternative label: Kuumailmalämmitys (66.341)
alternative label: Kuumavesilämmitys (66.341)
alternative label: Lattialämmitys (66.341)
alternative label: Lämmitys (66.341)
alternative label: Lämmitys, rakennustekniikka (66.341)
alternative label: Lämmitys, tekniikka, laitteet ja huolto (66.341)
alternative label: Lämmöneristys, rakennustekniikka (66.341)
alternative label: Lämpöpatterit (66.341)
alternative label: Lämpötilan säätö, lämmitystekniikka (66.341)
alternative label: Maakaasu, lämmitystekniikka (66.341)
alternative label: Maalämpö, lämmitystekniikka (66.341)
alternative label: Murningsarbeten, ugnar, spisar och skorstenar (66.341) @sv
alternative label: Muuraustyöt, uunit, takat ja savupiiput (66.341)
alternative label: Nestekaasu, lämmitystekniikka (66.341)
alternative label: Orgaaniset polttoaineet, lämmitystekniikka (66.341)
alternative label: Pannuhuoneet, lämmitys- ja rakennustekniikka (66.341)
alternative label: Polttoaineet, lämmitystekniikka (66.341)
alternative label: Polttopuu, lämmitystekniikka (66.341)
alternative label: Polttoturve, lämmitystekniikka (66.341)
alternative label: Polttoöljyt, lämmitystekniikka (66.341)
alternative label: Puu, lämmitystekniikka (66.341)
alternative label: Puulämmitys (66.341)
alternative label: Savupiiput, rakennustekniikka (66.341)
alternative label: Sähkölämmitys (66.341)
alternative label: Sähkönkulutus, lämmitystekniikka (66.341)
alternative label: Sähkönsäästö, lämmitystekniikka (66.341)
alternative label: Takat, rakentaminen (66.341)
alternative label: Termostaatit, lämmitystekniikka (66.341)
alternative label: Turve, lämmitystekniikka (66.341)
alternative label: Uunit, lämmitys- ja rakennustekniikka (66.341)
alternative label: Öljy, lämmitystekniikka (66.341)
broader: LVI-työt. Sähkötyöt
in scheme: YKL - Yleisten kirjastojen luokitusjärjestelmä
notation: 66.341
scope note: Rakennusten lämmitystekniikka Rakennusten lämmityslaitteet ja niiden kunnossapito Lämmitysvaihtoehdot. Lämmityskustannukset Energian kulutus ja säästö lämmityksessä Lämmityslaitteiden käyttö ja huolto Lämpötilan säätö. Termostaatit. Lämmöneristys Huonekohtainen lämmitys. Keskuslämmitys. Kaukolämmitys Uunit. Takat. Kaminat. Hormit. Savupiiput Lämpöpatterit. Kuumailmalämmitys Lämminvesi- ja höyrykeskuslämmitys Puu-, turve-, kivihiili-, öljy-, kaasu-, sähkö-, maa- ja aurinkolämmitys
scope note: Teknik för uppvärmning av byggnader Uppvärmningsanordningar för byggnader och underhållet av dem Uppvärmningsalternativ. Uppvärmningskostnader Energiförbrukning och energihushållning vid uppvärmning Temperaturreglering. Termostat. Värmeisolering Rumsvis uppvärmning. Centralvärme. Fjärrvärme Kakelugnar. Öppna spisar. Kaminer. Rökkanaler. Skorstenar Värmeelement. Varmluftsuppvärmning Vattenburen och ångburen centralvärme Ved, torv-, stenkols-, gas- och oljeeldning. Elvärme. Jord- och solvärme @sv

Rakennusten erillistilat
type: Concept
References: Viheralueiden suunnittelu
References: Palo- ja pelastustoimi
References: Maanviljely. Puutarhanhoito. Hyötykasvit
References: Säilöntä
type: YKL-luokka
alternative label: Aidat, rakentaminen (66.35)
alternative label: Aitaukset, rakentaminen (66.35)
alternative label: Autotallit, rakentaminen (66.35)
alternative label: Balkonger, byggande (66.35) @sv
alternative label: Bastur, byggande (66.35) @sv
alternative label: Byggnader, fristående utrymmen, byggnadsteknik (66.35) @sv
alternative label: Båthus (66.35) @sv
alternative label: Garage, byggande (66.35) @sv
alternative label: Grillar, byggande (66.35) @sv
alternative label: Grillit, rakentaminen (66.35)
alternative label: Gårdar, anläggande (66.35) @sv
alternative label: Gårdsbyggnader, byggande (66.35) @sv
alternative label: Gårdsplanering, gårdskonstruktioner och gårdsbyggnader (66.35) @sv
alternative label: Hundkojor, byggande (66.35) @sv
alternative label: Huvimajat, rakentaminen (66.35)
alternative label: Inhägnader, byggande (66.35) @sv
alternative label: Kellarit, rakentaminen (66.35)
alternative label: Koirankopit, rakentaminen (66.35)
alternative label: Kuistit, rakentaminen (66.35)
alternative label: Kylmiöt, rakentaminen (66.35)
alternative label: Kylrum, byggande (66.35) @sv
alternative label: Källare, byggande (66.35) @sv
alternative label: Laatoitus, piharakentaminen (66.35)
alternative label: Leikkimökit, rakentaminen (66.35)
alternative label: Lekstugor, byggande (66.35) @sv
alternative label: Lusthus, byggande (66.35) @sv
alternative label: Murar, gårdskonstruktioner (66.35) @sv
alternative label: Muurit, piharakenteet (66.35)
alternative label: Parvekkeet, rakentaminen (66.35)
alternative label: Pesutuvat, rakentaminen (66.35)
alternative label: Piharakennukset, rakentaminen (66.35)
alternative label: Pihasuunnittelu, piharakenteet ja piharakennukset (66.35)
alternative label: Pihat, rakentaminen (66.35)
alternative label: Plattläggning, gårdsbygge (66.35) @sv
alternative label: Puutarha-arkkitehtuuri, talonrakennus (66.35)
alternative label: Puutarhat, talonrakennus (66.35)
alternative label: Rakennukset, erillistilat, rakennustekniikka (66.35)
alternative label: Rökerier, byggande (66.35) @sv
alternative label: Saunat, rakentaminen (66.35)
alternative label: Savustamot, rakentaminen (66.35)
alternative label: Simbassänger, byggande (66.35) @sv
alternative label: Stängsel, byggandet (66.35) @sv
alternative label: Trädgårdar, husbyggnad (66.35) @sv
alternative label: Trädgårdsarkitektur, husbyggnad (66.35) @sv
alternative label: Tvättstugor, byggande (66.35) @sv
alternative label: Uima-altaat, rakentaminen (66.35)
alternative label: Ullakot, rakentaminen (66.35)
alternative label: Venevajat, rakentaminen (66.35)
alternative label: Verandor, byggande (66.35) @sv
alternative label: Viherhuoneet, rakentaminen (66.35)
alternative label: Vindar, byggande (66.35) @sv
alternative label: Vinterträdgårdar, byggande (66.35) @sv
broader: Talonrakennus
in scheme: YKL - Yleisten kirjastojen luokitusjärjestelmä
notation: 66.35
preferred label: Outhouses and annexes @en
preferred label: Särskilda utrymmen i byggnader @sv
scope note: Byggande av särskilda utrymmen och underhålla av dem Byggande av källare, vindar, balkonger, kallrum, tvättstugor, bastur, simbassänger, lusthus, vinterträdgårdar, garage och båtskjul Hit också byggande av gårdsbyggnader och gårdskonstruktioner såsom staket Plattläggning av gården @sv
scope note: Rakennusten erillistilojen rakentaminen ja kunnossapito Kellareiden, ullakoiden, parvekkeiden, kylmiöiden, pesutupien, saunojen, uima-altaiden, huvimajojen, viherhuoneiden, autotallien ja venevajojen rakentaminen Tähän myös piharakennusten ja -rakenteiden, kuten aitojen, rakentaminen Pihan laatoitustyöt

Huoneakustiikka
type: Concept
References: Äänioppi. Mekaaniset värähtelyt
type: YKL-luokka
alternative label: Akustiikka, musiikin kannalta (66.36)
alternative label: Akustiikka, musiikki ja näyttämötaiteet (66.36)
alternative label: Akustiikka, talonrakennus (66.36)
alternative label: Akustik, husbyggnad (66.36) @sv
alternative label: Akustik, musik och scenkonster (66.36) @sv
alternative label: Akustik, ur musikens synpunkt (66.36) @sv
alternative label: Eko, rumsakustik (66.36) @sv
alternative label: Elektroakustik, byggnadsteknik (66.36) @sv
alternative label: Eristys, huoneakustiikka (66.36)
alternative label: Eristys, äänieristys (66.36)
alternative label: Huoneakustiikka (66.36)
alternative label: Isolering, ljudisolering (66.36) @sv
alternative label: Isolering, rumsakustik (66.36) @sv
alternative label: Kaiku, huoneakustiikka (66.36)
alternative label: Konserthus, akustik (66.36) @sv
alternative label: Konserttitalot, akustiikka (66.36)
alternative label: Ljudisolering, husbyggnad (66.36) @sv
alternative label: Ljudåtergivning, akustik (66.36) @sv
alternative label: Musiikki, akustiikka (66.36)
alternative label: Musik, akustik (66.36) @sv
alternative label: Oopperatalot, akustiikka (66.36)
alternative label: Operahus, akustik (66.36) @sv
alternative label: Rumsakustik (66.36) @sv
alternative label: Sähköakustiikka, rakennustekniikka (66.36)
alternative label: Teaterhus, akustik (66.36) @sv
alternative label: Teatteritalot, akustiikka (66.36)
alternative label: Äänentoisto, akustiikka (66.36)
alternative label: Äänieristys, talonrakennus (66.36)
broader: Talonrakennus
in scheme: YKL - Yleisten kirjastojen luokitusjärjestelmä
notation: 66.36
preferred label: Room acoustics @en
preferred label: Rumsakustik @sv
scope note: Akustiska egenskaper i rum och byggnadsteknisk planering av akustik Ljudisolering Hit också akustik ur musikens och den muntliga framställningens synvinkel @sv
scope note: Sisätilojen akustiset ominaisuudet ja niiden rakennustekninen suunnittelu Äänieristys Tähän myös akustiikka musiikin ja suullisen esittämisen kannalta

Rakennuksen kunnossapito
type: Concept
References: Palo- ja pelastustoimi
References: Rakennusstatiikka. Rakennussuunnittelu
References: Geotekniikka. Maatyöt
References: Rakenneosat
References: Rakennusaineet. Rakennustyöt
References: LVI-työt. Sähkötyöt
References: Rakennusten erillistilat
References: Huoneakustiikka
References: Huonetilojen ja irtaimiston hoito
References: Rakennukset. Rakennustyypit
alternative label: Anläggningsunderhåll, fastighetsskötsel (66.4) @sv
alternative label: Asuinrakennukset, kunnossapito (66.4)
alternative label: Bostadsbyggnader, underhåll (66.4) @sv
alternative label: Byggnader, ombyggnadsarbeten (66.4) @sv
alternative label: Byggnader, renoveringsarbeten (66.4) @sv
alternative label: Byggnader, restaurering, byggnadsteknik (66.4) @sv
alternative label: Byggnader, saneringsarbeten (66.4) @sv
alternative label: Byggnader, underhållsarbeten (66.4) @sv
alternative label: Byggnadsskador, byggnadsteknik (66.4) @sv
alternative label: Disponentens arbete (66.4) @sv
alternative label: Disponentskap (66.4) @sv
alternative label: Entistäminen, rakennustekniikka (66.4)
alternative label: Entisöinti, rakennustekniikka (66.4)
alternative label: Fastigheter, byggnadsunderhåll (66.4) @sv
alternative label: Fastighetsskötarens arbete (66.4) @sv
alternative label: Fuktskador, byggnadsunderhåll (66.4) @sv
alternative label: Garantireparationer, byggnader (66.4) @sv
alternative label: Gårdskarlens arbete (66.4) @sv
alternative label: Hemreparationer, husreparation (66.4) @sv
alternative label: Homevauriot, rakennuksen kunnossapito (66.4)
alternative label: Huoltomiehen työ (66.4)
alternative label: Husreparationer (66.4) @sv
alternative label: Isskador, byggnadsunderhåll (66.4) @sv
alternative label: Isännöinti (66.4)
alternative label: Isännöitsijän työ (66.4)
alternative label: Jäävauriot, rakennuksen kunnossapito (66.4)
alternative label: Kiinteistönhoito (66.4)
alternative label: Kiinteistöt, rakennuksen kunnossapito (66.4)
alternative label: Kodin korjaustyöt, talon korjaus (66.4)
alternative label: Korjausrakentaminen (66.4)
alternative label: Korjaustyöt, rakennustekniikka (66.4)
alternative label: Kosteusvauriot, rakennuksen kunnossapito (66.4)
alternative label: Kunnossapito, rakennukset (66.4)
alternative label: Laitoshuolto, kiinteistönhuolto (66.4)
alternative label: Lumivauriot, rakennuksen kunnossapito (66.4)
alternative label: Mögeskador, byggnadsunderhåll (66.4) @sv
alternative label: Ombyggnad (66.4) @sv
alternative label: Peruskorjaukset, rakennustekniikka (66.4)
alternative label: Purkutyöt (66.4)
alternative label: Rakennukset, entisöinti, rakennustekn. (66.4)
alternative label: Rakennukset, korjaustyöt (66.4)
alternative label: Rakennukset, kunnossapitotyöt (66.4)
alternative label: Rakennukset, peruskorjaustyöt (66.4)
alternative label: Rakennukset, saneeraustyöt (66.4)
alternative label: Rakennusvauriot, rakennustekniikka (66.4)
alternative label: Remontti (66.4)
alternative label: Reparation, byggnader (66.4) @sv
alternative label: Reparationsarbeten, byggnadsteknik (66.4) @sv
alternative label: Restaurering, byggnadsteknik (66.4) @sv
alternative label: Restaurointi, rakennustekniikka (66.4)
alternative label: Rivningsarbete (66.4) @sv
alternative label: Routavauriot, rakennuksen kunnossapito (66.4)
alternative label: Saneeraus, rakennustekniikka (66.4)
alternative label: Sanering, byggnadsteknik (66.4) @sv
alternative label: Snöskador, byggnadsunderhåll (66.4) @sv
alternative label: Takuukorjaukset, rakennukset (66.4)
alternative label: Talonkorjaustyöt (66.4)
alternative label: Talonmiehen työ (66.4)
alternative label: Tjälskador, byggnadsunderhåll (66.4) @sv
alternative label: Totalrenoveringar, byggnadsteknik (66.4) @sv
alternative label: Underhåll, skötsel, byggnader (66.4) @sv
alternative label: Vattenskador, byggnadsunderhåll (66.4) @sv
alternative label: Vesivauriot, rakennuksen kunnossapito (66.4)
broader: RAKENNUSTEKNIIKKA
in scheme: YKL - Yleisten kirjastojen luokitusjärjestelmä
notation: 66.4
preferred label: Building maintenance @en
scope note: Hit allmänna byggnadstekniska instruktioner och handböcker om underhåll, renovering, ombyggnad, sanering eller restaurering av byggnader Hit också allmän byggnadsstatik och teknisk byggnadsplanering som har att göra med byggnadsunderhåll Hit också byggnadsskador samt reparation och förebyggande av dem Hit också garantireparationer av byggnader Hit också disponentens, gårdskarlens och fastighetsskötarens arbete Underhålls- och reparationsinstruktioner som har att göra med ett enskilt byggnadstekniskt specialområde förs till klassen för specialområdet @sv
scope note: Tähän rakennuksen kunnossapitoa, korjausrakentamista, korjaustöitä, peruskorjausta, saneerausta tai entisöintiä koskevat yleiset rakennustekniset ohjeet ja oppaat Tähän myös rakennuksen kunnossapitoon liittyvä yleinen rakennusstatiikka ja tekninen rakennussuunnittelu Tähän myös rakennusvauriot sekä niiden ehkäisy ja korjaus Tähän myös rakennusten takuukorjaukset Tähän myös isännöitsijän, talonmiehen ja huoltomiehen työt Tiettyyn rakennustekniikan erikoisalaan liittyvät kunnossapito- ja korjausohjeet luokitetaan ko. rakennustekniikan erikoisalan luokkaan

Tienrakennus
type: Concept
References: Maa- ja vesioikeus
References: Liikennelainsäädäntö
References: Liikennesuunnittelu
References: Liikennevälineet
References: Maaliikenne
References: Lentoliikenne
alternative label: Alikulkuväylät, tienrakennus (66.6)
alternative label: Anslutningar, vägbyggnad (66.6) @sv
alternative label: Asfalt, vägbyggnad (66.6) @sv
alternative label: Asfaltti, tienrakennus (66.6)
alternative label: Bangårdar, byggande (66.6) @sv
alternative label: Broar (66.6) @sv
alternative label: Brobygge (66.6) @sv
alternative label: Cykelvägar, byggande (66.6) @sv
alternative label: Flygfält, byggande (66.6) @sv
alternative label: Färjor, landsvägsfärjor (66.6) @sv
alternative label: Gator, byggnad och underhåll (66.6) @sv
alternative label: Gatubelysning, byggande (66.6) @sv
alternative label: Gatubyggnad (66.6) @sv
alternative label: Geotekniikka, tienrakennus (66.6)
alternative label: Geoteknik, vägbyggnad (66.6) @sv
alternative label: Gågator, byggande (66.6) @sv
alternative label: Hängbroar, byggande (66.6) @sv
alternative label: Jalkakäytävät, rakentaminen (66.6)
alternative label: Järnvägar, byggande (66.6) @sv
alternative label: Järnvägsbyggnad (66.6) @sv
alternative label: Kadunrakennus (66.6)
alternative label: Kadut, rakentaminen ja kunnossapito (66.6)
alternative label: Katuvalaistus, rakentaminen (66.6)
alternative label: Kevyt liikenne, tienrakennus (66.6)
alternative label: Kunnossapito, kadut ja tiet (66.6)
alternative label: Kävelykadut, rakentaminen (66.6)
alternative label: Landsvägar, byggande (66.6) @sv
alternative label: Landsvägsfärjor, byggande (66.6) @sv
alternative label: Landtrafikleder, väg- och gatubyggnad (66.6) @sv
alternative label: Lautat, lossit (66.6)
alternative label: Lentokentät, rakentaminen (66.6)
alternative label: Liikenneväylät, tien- ja kadunrakennus (66.6)
alternative label: Liittymät, tienrakennus (66.6)
alternative label: Lossit, rakentaminen (66.6)
alternative label: Lätt trafik, vägbyggnad (66.6) @sv
alternative label: Maaliikenneväylät, tien- ja kadunrakennus (66.6)
alternative label: Maantiet, rakentaminen (66.6)
alternative label: Maatyöt, tienrakennus (66.6)
alternative label: Markarbeten, vägbyggnad (66.6) @sv
alternative label: Metro, byggande (66.6) @sv
alternative label: Metro, rakentaminen (66.6)
alternative label: Moottoritiet, rakentaminen (66.6)
alternative label: Motorvägar, byggande (66.6) @sv
alternative label: Paikoitusalueet, kadunrakennus (66.6)
alternative label: Parkeringsområden, gatubyggnad (66.6) @sv
alternative label: Pysäköintialueet, kadunrakennus (66.6)
alternative label: Pyörätiet, rakentaminen (66.6)
alternative label: Radanrakennus (66.6)
alternative label: Raitiotiet, rakentaminen (66.6)
alternative label: Ratapihat, rakentaminen (66.6)
alternative label: Rautatiet, rakentaminen (66.6)
alternative label: Riippusillat, rakentaminen (66.6)
alternative label: Routa, tienrakennus (66.6)
alternative label: Routavauriot, tiet (66.6)
alternative label: Sillanrakennus (66.6)
alternative label: Sillat (66.6)
alternative label: Spårvägar, byggande (66.6) @sv
alternative label: Talvikunnossapito, tiet ja kadut (66.6)
alternative label: Tienrakennus (66.6)
alternative label: Tiet, rakentaminen ja kunnossapito (66.6)
alternative label: Tjäle, vägbyggnad (66.6) @sv
alternative label: Tjälskador, vägar (66.6) @sv
alternative label: Trafikleder, väg- och gatubyggande (66.6) @sv
alternative label: Tunnelit, metronrakennus (66.6)
alternative label: Tunnelit, rautatienrakennus (66.6)
alternative label: Tunnelit, tienrakennus (66.6)
alternative label: Vesivauriot, tiet (66.6)
alternative label: Ylikulkuväylät, tienrakennus (66.6)
broader: RAKENNUSTEKNIIKKA
in scheme: YKL - Yleisten kirjastojen luokitusjärjestelmä
notation: 66.6
scope note: Byggande av trafikleder på land Hit också byggnadsstatik, teknisk byggnadsplanering samt geoteknik och anläggningsarbeten ur vägbyggnadens synvinkel Byggande och underhåll av vägar, gator, parkeringsområden, gatubelysning, broar, anslutningar, under- och överfarter, trottoarer, gång- och cykelvägar, järnvägar och spårvägar, tunnelbanor, landsvägsfärjor och flygfält Hit också tjälskador samt förebyggande och reparation av dem Hit också verk som rör både väg- och vattenbyggnad @sv
scope note: Maaliikenneväylien rakentaminen Tähän myös rakennusstatiikka, tekninen rakennussuunnittelu sekä geotekniikka ja maatyöt tienrakennuksen kannalta Teiden, katujen, paikoitusalueiden, katuvalaistuksen, siltojen, liittymien, ali- ja ylikulkuväylien, kevyen liikenteen väylien, jalkakäytävien, kävely- ja pyöräteiden, rauta- ja raitioteiden, metrojen, lossien ja lentokenttien rakentaminen ja kunnossapito Tähän myös routavauriot sekä niiden ehkäisy ja korjaaminen Tähän myös teokset, jotka koskevat sekä tien- että vesirakennusta

Vesirakennus
type: Concept
References: Maa- ja vesioikeus
References: Liikennelainsäädäntö
References: Liikennesuunnittelu
References: Vesiensuojelu
References: Hydrologia
References: Energia
References: Vesikulkuneuvot
References: Tienrakennus
References: Maanviljely. Puutarhanhoito. Hyötykasvit
References: Metsänhoito
References: Puunkorjuu. Puukauppa. Metsänarviointi
References: Kalastus
References: Vesiliikenne
type: YKL-luokka
alternative label: Aallonmurtajat (66.7)
alternative label: Altaat, vesirakennus (66.7)
alternative label: Bassänger, vattenbyggnad (66.7) @sv
alternative label: Bryggor (66.7) @sv
alternative label: Dammar, byggnadsteknik (66.7) @sv
alternative label: Floder, vattenbyggnad (66.7) @sv
alternative label: Forsar, rensning (66.7) @sv
alternative label: Hamnanordningar, byggande (66.7) @sv
alternative label: Hamnar, vattenbyggnad (66.7) @sv
alternative label: Hamnbassänger (66.7) @sv
alternative label: Is, vattenbyggnad (66.7) @sv
alternative label: Joet, vesirakennus (66.7)
alternative label: Järvet, vesirakennus (66.7)
alternative label: Jää, vesirakennus (66.7)
alternative label: Kanaler, byggande (66.7) @sv
alternative label: Kanavat, rakentaminen (66.7)
alternative label: Konstgjorda sjöar, vattenbyggnad (66.7) @sv
alternative label: Konstgjorda vattenmagasin, vattenbyggnad (66.7) @sv
alternative label: Kosket, perkaaminen (66.7)
alternative label: Kuivatus, vesirakennus (66.7)
alternative label: Kunnossapito, vesiväylät (66.7)
alternative label: Laiturit (66.7)
alternative label: Liikenneväylät, vesirakennus (66.7)
alternative label: Muddring (66.7) @sv
alternative label: Padot, rakennustekniikka (66.7)
alternative label: Pengerrystekniikka, vesirakennus (66.7)
alternative label: Ruoppaaminen (66.7)
alternative label: Satama-altaat, rakentaminen (66.7)
alternative label: Satamalaitteet, rakentaminen (66.7)
alternative label: Satamat, vesirakennus (66.7)
alternative label: Sjöar, vattenbyggnad (66.7) @sv
alternative label: Slussar, kanalbygge (66.7) @sv
alternative label: Sulut, kanavanrakennus (66.7)
alternative label: Tekoaltaat, vesirakennus (66.7)
alternative label: Tekojärvet, vesirakennus (66.7)
alternative label: Telakat, rakentaminen (66.7)
alternative label: Terasseringsteknik, vattenbyggnad (66.7) @sv
alternative label: Torrläggning, vattenbyggnad (66.7) @sv
alternative label: Trafikleder, vattenbyggnad (66.7) @sv
alternative label: Tulvasuojelu, vesirakennus (66.7)
alternative label: Underhåll, skötsel, vattenleder (66.7) @sv
alternative label: Varv, byggande (66.7) @sv
alternative label: Vatten, reglering, vattenbyggnad (66.7) @sv
alternative label: Vatten, vattenbyggnad (66.7) @sv
alternative label: Vattenbyggnad (66.7) @sv
alternative label: Vattendrag, reglering, vattenbyggnad (66.7) @sv
alternative label: Vattendrag, vattenbyggnad (66.7) @sv
alternative label: Vattenleder, byggande (66.7) @sv
alternative label: Vedet, säännöstely, vesirakennus (66.7)
alternative label: Vedet, vesirakennus (66.7)
alternative label: Vesi, vesirakennus (66.7)
alternative label: Vesirakennus (66.7)
alternative label: Vesirakentaminen (66.7)
alternative label: Vesistöt, säännöstely, vesirakennus (66.7)
alternative label: Vesistöt, vesirakennus (66.7)
alternative label: Vesiväylät, rakentaminen (66.7)
alternative label: Vågbrytare (66.7) @sv
alternative label: Översvämningsskydd, vattenbyggnad (66.7) @sv
broader: RAKENNUSTEKNIIKKA
in scheme: YKL - Yleisten kirjastojen luokitusjärjestelmä
notation: 66.7
preferred label: Hydraulic engineering @en
preferred label: Vattenbyggnad @sv
scope note: Byggande av farleder och andra vattenleder Hit också byggnadsstatik, teknisk byggnadsplanering samt geoteknik och anläggningsarbeten ur vattenbyggnadens synvinkel Byggande och underhåll av hamnar, vågbrytare, hamnbassänger, bryggor, varv, hamnanläggningar, kanaler, slussar, dammar och bankar Reglering och dränering av vatten ur vattenbyggnadens synvinkel Byggande av konstgjorda sjöar. Översvämningsskydd Rensning och muddring av vatten, vattenleder och forsar @sv
scope note: Vesiliikenneväylien rakentaminen Tähän myös rakennusstatiikka, tekninen rakennussuunnittelu sekä geotekniikka ja maatyöt vesirakennuksen kannalta Satamien, aallonmurtajien, satama-altaiden, laitureiden, telakoiden, satamalaitteiden, kanavien, sulkujen, patojen ja penkereiden rakentaminen ja kunnossapito Vesien säännöstely ja kuivatus vesirakennuksen kannalta Tekojärvien rakentaminen. Tulvasuojelu Vesistöjen, vesireittien ja koskien perkaus ja ruoppaus

Kunnallistekninen ympäristönhuolto
type: Concept
References: Yhdyskuntasuunnittelu. Kaupunkisuunnittelu. Ympäristönsuunnittelu
References: Ympäristönsuojelu. Luonnonsuojelu
References: Ilmansuojelu
References: Maaperänsuojelu
References: Sosiaalilääketiede. Ympäristölääketiede
type: YKL-luokka
alternative label: Bullervallar, byggande (66.9) @sv
alternative label: Kommunal miljövård (66.9+) @sv
alternative label: Kommunalteknik, miljövård (66.9) @sv
alternative label: Kunnallinen ympäristönhuolto (66.9+)
alternative label: Kunnallistekniikka, ympäristönhuolto (66.9+)
alternative label: Meluvallit, rakentaminen (66.9)
alternative label: Miljövård, kommunalteknik (66.9+) @sv
alternative label: Miljövårdsteknik, kommunalteknik (66.9+) @sv
alternative label: Puhtaanapito, kunnallistekniikka (66.9+)
alternative label: Renhållning, kommunalteknik (66.9+) @sv
alternative label: Yhdyskuntatekniikka, ympäristönhuolto (66.9)
alternative label: Ympäristönhuolto, kunnallistekniikka (66.9+)
alternative label: Ympäristönsuojelutekniikka, kunnallistekniikka (66.9+)
broader: RAKENNUSTEKNIIKKA
in scheme: YKL - Yleisten kirjastojen luokitusjärjestelmä
narrower: Vesi- ja jätevesihuolto
narrower: Jätehuolto. Kierrätys
notation: 66.9
preferred label: Environmental municipal services @en
preferred label: Kommunalteknisk miljövård @sv
scope note: Hit och till underklasserna kommunal miljövårdsteknik och byggande av dithörande anläggningar Hit byggande av bullervallar @sv
scope note: Tähän ja alaluokkiin kunnallistekninen ympäristönhuolto ja sen rakentaminen Tähän meluvallien rakentaminen

Vesi- ja jätevesihuolto
type: Concept
References: Vesiensuojelu
References: Hydrologia
References: LVI-työt. Sähkötyöt
References: Vesirakennus
References: Jätehuolto. Kierrätys
type: YKL-luokka
alternative label: Avlopp, spillvattenhantering (66.93) @sv
alternative label: Avloppsvatten, kommunalteknik (66.93) @sv
alternative label: Avloppsvattenhantering (66.93) @sv
alternative label: Avloppsverk (66.93) @sv
alternative label: Brunnar, vattenförsörjning (66.93) @sv
alternative label: Grundvatten, vattenförsörjning (66.93) @sv
alternative label: Hushållsavfall, spillvatten (66.93) @sv
alternative label: Hushållsvatten, vattenförsörjning (66.93) @sv
alternative label: Industriavfall, rening av spillvatten (66.93) @sv
alternative label: Jätevedet, kunnallistekniikka (66.93)
alternative label: Jätevesihuolto (66.93)
alternative label: Kaivot, vesihuolto (66.93)
alternative label: Kotitalousjätteet, jätevedet (66.93)
alternative label: Oljebekämpningsteknik (66.93) @sv
alternative label: Oljeskador, bekämpningsteknik (66.93) @sv
alternative label: Pintavedet, vesihuolto (66.93)
alternative label: Pohjavesi, vesihuolto (66.93)
alternative label: Puhdistamot, jätevesihuolto (66.93)
alternative label: Reningsverk (66.93) @sv
alternative label: Talousvesi, vesihuolto (66.93)
alternative label: Teollisuusjätteet, jätevesien puhdistus (66.93)
alternative label: Tunnelit, vesi- ja jätevesihuolto (66.93)
alternative label: Tunnlar, vattenförsörjning och avlopp (66.93) @sv
alternative label: Vatten, vattenförsörjning och vattenrening (66.93) @sv
alternative label: Vattenbehållare, vattenförsörjning (66.93) @sv
alternative label: Vattenbesparing, vattenförsörjning (66.93) @sv
alternative label: Vattenförbrukning, vattenförsörjning (66.93) @sv
alternative label: Vattenförsörjning, kommunalteknik (66.93) @sv
alternative label: Vattenkvalitet, vattenförsörjning (66.93) @sv
alternative label: Vattenledningar, kommunalteknik (66.93) @sv
alternative label: Vattenreningsteknik (66.93) @sv
alternative label: Vattenskyddsteknik (66.93) @sv
alternative label: Vattentillgångar, vattenförsörjning (66.93) @sv
alternative label: Vattentorn (66.93) @sv
alternative label: Vattentäkt, vattenförsörjning (66.93) @sv
alternative label: Vattenverk (66.93) @sv
alternative label: Veden laatu, vesihuolto (66.93)
alternative label: Vedenkulutus, vesihuolto (66.93)
alternative label: Vedenottamot, vesihuolto (66.93)
alternative label: Vedenpuhdistustekniikka (66.93)
alternative label: Vedensäästö, vesihuolto (66.93)
alternative label: Vedet, vesihuolto ja vedenpuhdistus (66.93)
alternative label: Vesi, vesihuolto ja vedenpuhdistus (66.93)
alternative label: Vesiensuojelutekniikka, kunnallistekniikka (66.93)
alternative label: Vesihuolto, kunnallistekniikka (66.93)
alternative label: Vesijohdot, kunnallistekniikka (66.93)
alternative label: Vesilaitokset (66.93)
alternative label: Vesisäiliöt, vesihuolto (66.93)
alternative label: Vesitornit (66.93)
alternative label: Vesivarat, vesihuolto (66.93)
alternative label: Viemärilaitokset (66.93)
alternative label: Viemärit, jätevesihuolto (66.93)
alternative label: Ytvatten, vattenförsörjning (66.93) @sv
alternative label: Öljyntorjuntatekniikka (66.93)
alternative label: Öljyvahingot, torjuntatekniikka (66.93)
broader: Kunnallistekninen ympäristönhuolto
in scheme: YKL - Yleisten kirjastojen luokitusjärjestelmä
notation: 66.93
preferred label: Vattenförsörjning och avloppsvattenhantering @sv
preferred label: Water and waste water services @en
scope note: Vattenlednings- och avloppsbygge Yt- och grundvatten ur vattenförsörjningens synvinkel Vattentäkt, brunnar, vattenrening, vattnets kvalitet, vattentorn, vattencisterner och vattenledningar ur vattenförsörjningens synvinkel Avloppsvatten, avlopp, reningsverk samt vattenvårds- och vattenreningsteknik ur avloppsvattenhanteringens synvinkel Vatten- och avloppsanläggningar Hit också oljebekämpningsteknik @sv
scope note: Vesihuolto ja sen rakentaminen Pohja- ja pintavesivarat vesihuollon kannalta Vedenottamot, kaivot, veden puhdistus ja laatu, vesitornit, vesisäiliöt ja vesijohdot vesihuollon kannalta Jätevedet, viemärit, puhdistamot sekä vesiensuojelu- ja vedenpuhdistustekniikka jätevesihuollon kannalta Vesi- ja viemärilaitokset Tähän myös öljyntorjuntatekniikka

Jätehuolto. Kierrätys
type: Concept
References: Pääoma. Luonnonvarat
References: Ympäristönsuojelu. Luonnonsuojelu
References: Ydinenergia
References: Vesi- ja jätevesihuolto
type: YKL-luokka
alternative label: Avfall (66.94) @sv
alternative label: Avfall, hantering (66.94) @sv
alternative label: Avfall, transport och lagring (66.94) @sv
alternative label: Avfall, återvinning (66.94) @sv
alternative label: Avfallsfattig teknologi (66.94) @sv
alternative label: Avfallsfri teknologi (66.94) @sv
alternative label: Avfallshantering (66.94) @sv
alternative label: Avfallsproblem (66.94) @sv
alternative label: Avstjälpningsplatser (66.94) @sv
alternative label: Fasta avfall (66.94) @sv
alternative label: Glas, återvinning (66.94) @sv
alternative label: Hushållsavfall (66.94) @sv
alternative label: Industriavfall (66.94) @sv
alternative label: Jätehuolto (66.94)
alternative label: Jäteongelmat (66.94)
alternative label: Jätteet (66.94)
alternative label: Jätteet, kierrätys (66.94)
alternative label: Jätteet, kuljetus ja varastointi (66.94)
alternative label: Jätteet, käsittely (66.94)
alternative label: Jätteetön teknologia (66.94)
alternative label: Kaatopaikat (66.94)
alternative label: Kierrätys (66.94)
alternative label: Kierrätyskeskukset (66.94)
alternative label: Kiinteät jätteet (66.94)
alternative label: Kommunal avfallshantering (66.94) @sv
alternative label: Kompostering, avfallshantering (66.94) @sv
alternative label: Kompostointi, jätehuolto (66.94)
alternative label: Kotitalousjätteet (66.94)
alternative label: Kunnallinen jätehuolto (66.94)
alternative label: Laitosjätteet (66.94)
alternative label: Lasi, kierrätys (66.94)
alternative label: Lump, återvinning (66.94) @sv
alternative label: Lumppujätteet, kierrätys (66.94)
alternative label: Metaller, återvinning (66.94) @sv
alternative label: Metallit, kierrätys (66.94)
alternative label: Muovit, kierrätys (66.94)
alternative label: Nedskräpning (66.94) @sv
alternative label: Ongelmajätelaitokset (66.94)
alternative label: Ongelmajätteet (66.94)
alternative label: Paperinkeräys (66.94)
alternative label: Pappersinsamling (66.94) @sv
alternative label: Plaster, återvinning (66.94) @sv
alternative label: Problemavfall (66.94) @sv
alternative label: Problemavfallsverk (66.94) @sv
alternative label: Raaka-aineet, kierrätys ja uudelleenkäyttö (66.94)
alternative label: Roskaantuminen (66.94)
alternative label: Råmaterial, återvinning och återanvändning (66.94) @sv
alternative label: Sairaalajätteet (66.94)
alternative label: Sjukhusavfall (66.94) @sv
alternative label: Tavarankierrätys (66.94)
alternative label: Teollisuusjätteet (66.94)
alternative label: Uudelleenkäyttö, jätteet ja raaka-aineet (66.94)
alternative label: Vähäjäteteknolologia (66.94)
alternative label: Återanvändning (66.94) @sv
alternative label: Återanvändning, avfall och råvaror (66.94) @sv
alternative label: Återvinning (66.94) @sv
alternative label: Återvinningscentraler (66.94) @sv
broader: Kunnallistekninen ympäristönhuolto
in scheme: YKL - Yleisten kirjastojen luokitusjärjestelmä
notation: 66.94
preferred label: Avfallshantering. Återvinning @sv
preferred label: Waste disposal. Recycling @en
scope note: Avfall i allmänhet. Fast avfall Hushålls- och industriavfall. Miljöfarligt avfall Nedskräpning Sortering, transport, behandling och lagring av avfall Förbränning och deponering Avfallsfri och avfallsfattig teknologi Återvinning och återanvändning av råmaterial Hit t.ex. återvinning av papper, lump och glas Hit också återanvändning av föremål @sv
scope note: Jätteet yleensä. Kiinteät jätteet Kotitalous-, teollisuus-, laitos- ja ongelmajätteet Roskaantuminen Jätteiden kuljetus, käsittely ja varastointi Jätteiden poltto ja tuhoaminen Kaatopaikat ja ongelmajätelaitokset sekä niiden rakentaminen Jätteetön ja vähäjäteteknologia Raaka-aineiden ja jätteiden kierrätys ja uudelleenkäyttö Tähän esim. paperin, lasin ja lumppujätteen kierrätys Tähän myös tavarankierrätys

MAA- JA METSÄTALOUS. ELINTARVIKETEOLLISUUS. BIOTEKNIIKKA
type: Concept
modified: 2026-05-06T13:22:41
References: Maa- ja metsätalouslainsäädäntö
References: ALUESUUNNITTELU. ALUEPOLITIIKKA
References: Pääoma. Luonnonvarat
References: Tuotanto. Tuottavuus
References: KANSATIEDE. KULTTUURIANTROPOLOGIA
References: Ympäristönsuojelu. Luonnonsuojelu
References: Moottoriajoneuvot
References: Talonrakennus
type: YKL-luokka
alternative label: Aitat, maatalous (67+)
alternative label: Alkutuotanto, maataloustuotanto (67+)
alternative label: Asutustilat, maa- ja metsätalous (67+)
alternative label: Bodar, lantbruk (67+) @sv
alternative label: Ekonomibyggnader, lantbruk (67) @sv
alternative label: Elintarviketuotanto (67+)
alternative label: FAO (67+)
alternative label: Gårdsbruk (67+) @sv
alternative label: Keräilytalous (67+)
alternative label: Kolonationslägenheter, jord- och skogsbruk (67+) @sv
alternative label: Lantbruk (67) @sv
alternative label: Lantbruk (67+) @sv
alternative label: Lantbruksavbrytare (67+) @sv
alternative label: Lantbruksbyggnader (67) @sv
alternative label: Lantbruksmaskiner, användning (67+) @sv
alternative label: Lantbruksprodukter (67+) @sv
alternative label: Lantbruksredskap (67+) @sv
alternative label: Lantbruksrådgivning (67+) @sv
alternative label: Lantbrukssektorn (67) @sv
alternative label: Lantbruksutställningar (67+) @sv
alternative label: Lantgårdar, skötsel (67+) @sv
alternative label: Livsmedelsproduktion (67+) @sv
alternative label: Luontaiselinkeinot (67+)
alternative label: Maatalous (67)
alternative label: Maatalous (67+)
alternative label: Maatalousala (67)
alternative label: Maatalouskoneet, käyttö (67+)
alternative label: Maatalouslomittajat (67+)
alternative label: Maatalousneuvonta (67+)
alternative label: Maatalousnäyttelyt (67+)
alternative label: Maatalousrakennukset (67)
alternative label: Maataloustuotteet (67+)
alternative label: Maataloustyövälineet (67+)
alternative label: Maatilat, hoito (67+)
alternative label: Maatilatalous (67+)
alternative label: Matsäkerhet allm. (67) @sv
alternative label: Naturnäringar (67+) @sv
alternative label: Perustuotantoelinkeinot (67+)
alternative label: Primärproduktion, jordbruksproduktion (67+) @sv
alternative label: Primärproduktionsnäringar (67+) @sv
alternative label: Ruokaturva yl. (67)
alternative label: Samlarekonomi (67+) @sv
alternative label: Talousrakennukset, maatalous (67)
alternative label: Traktorer, lantbruk (67+) @sv
alternative label: Traktorit, maatalous (67+)
broader: TEKNIIKKA. TEOLLISUUS. KÄSITYÖ. MAA- JA METSÄTALOUS KOTITALOUS. LIIKETALOUS. LIIKENNE
in scheme: YKL - Yleisten kirjastojen luokitusjärjestelmä
narrower: Maatalouspolitiikka
narrower: Maanviljely. Puutarhanhoito. Hyötykasvit
narrower: Kotieläintalous. Kotieläinten hoito
narrower: Metsätalous
narrower: Metsästys. Kalastus
narrower: Elintarviketeollisuus
narrower: Biotekniikka
notation: 67
preferred label: AGRICULTURE AND FORESTRY. FOOD INDUSTRY. BIOTECHNOLOGY @en
preferred label: JORD- OCH SKOGSBRUK. LIVSMEDELSINDUSTRI. BIOTEKNIK @sv
scope note: Hit allmänna verk om lantbruk och gårdsbruk. Hit också allmänna verk om näringsgrenar inom primärproduktionen. Hit också allmänna verk om samlarekonomier eller naturnäringar. Hit också verk som behandlar både jord- och skogsbruk. Hit också verk som behandlar både jordbruk och husdjursskötsel. Hit också verk som behandlar både jord- eller skogsbruk och jakt, fiske, livsmedelsindustri eller bioteknik. Hit också lantbruksmaskiner och lantbruksbyggnader ur lantbrukets synvinkel i allmänhet. Lantbruksorganisationer 67.06 och lantbruksutställningar 67.063 @sv
scope note: Tähän maatalouden ja maatilatalouden yleisteokset. Tähän myös perustuotantosektorin elinkeinoja koskevat yleisteokset. Tähän myös keräilytaloutta tai luontaiselinkeinoja koskevat yleisteokset. Tähän myös teokset, jotka koskevat sekä maa- että metsätaloutta. Tähän myös teokset, jotka koskevat sekä maanviljelystä että kotieläintaloutta. Tähän myös teokset, jotka koskevat sekä maa- tai metsätaloutta että metsästystä, kalastusta, elintarviketeollisuutta tai biotekniikkaa. Tähän myös maatalouskoneet ja -rakennukset maatalouden kannalta yleensä. Maatalousjärjestöt 67.06 ja maatalousnäyttelyt 67.063

Maatalouspolitiikka
type: Concept
References: Maa- ja metsätalouslainsäädäntö
References: ALUESUUNNITTELU. ALUEPOLITIIKKA
References: Maanviljely. Puutarhanhoito. Hyötykasvit
References: Kotieläintalous. Kotieläinten hoito
References: Metsätalous
type: YKL-luokka
alternative label: EU, jordbrukspolitik (67.1) @sv
alternative label: EU, maatalouspolitiikka (67.1)
alternative label: Euroopan unioni, maatalouspolitiikka (67.1)
alternative label: Europeiska unionen, jordbrukspolitik (67.1) @sv
alternative label: Generationsskifte, lantbrukspolitik (67.1) @sv
alternative label: Hemmansstorlek, lantbrukspolitik (67.1) @sv
alternative label: Kehitysmaat, maatalouspolitiikka (67.1)
alternative label: Lantbruk, företagsekonomi och ekonomisk vetenskap (67.1) @sv
alternative label: Lantbruk, rationalisering (67.1) @sv
alternative label: Lantbruksbokföring (67.1) @sv
alternative label: Lantbrukspolitik (67.1) @sv
alternative label: Lantbruksprodukter, handel (67.1) @sv
alternative label: Lantbruksproduktion, lantbrukspolitik (67.1) @sv
alternative label: Lantbruksstöd (67.1) @sv
alternative label: Maatalous, liiketalous ja taloustiede (67.1)
alternative label: Maatalous, rationalisointi (67.1)
alternative label: Maatalouskirjanpito (67.1)
alternative label: Maatalouspolitiikka (67.1)
alternative label: Maataloustuki (67.1)
alternative label: Maataloustuotanto, maatalouspolitiikka (67.1)
alternative label: Maataloustuotteet, kauppa (67.1)
alternative label: Pienviljely, maatalouspolitiikka (67.1)
alternative label: Småbruk, lantbrukspolitik (67.1) @sv
alternative label: Sukupolvenvaihdos, maatalouspolitiikka (67.1)
alternative label: Tilakoko, maatalouspolitiikka (67.1)
alternative label: Utvecklingsländer, lantbrukspolitik (67.1) @sv
broader: MAA- JA METSÄTALOUS. ELINTARVIKETEOLLISUUS. BIOTEKNIIKKA
in scheme: YKL - Yleisten kirjastojen luokitusjärjestelmä
notation: 67.1
preferred label: Agricultural policy @en
preferred label: Lantbrukspolitik @sv
scope note: Hit allmänna verk om lantbrukspolitik Ekonomi, företagsekonomi, stödåtgärder, rationalisering och produktion som har att göra med lantbruket i allmänhet Handel med lantbruksprodukter i allmänhet Hit också lantbrukspolitiska verk som behandlar både jordbruks- och husdjursekonomi Lantbrukspolitik som behandlar ett enskilt område inom lantbruket klassificeras enligt område @sv
scope note: Tähän maatalouspolitiikan yleisteokset Maatalouden taloustiede, liiketalous, tukitoimet, rationalisointi ja tuotanto yleensä Maataloustuotteiden kauppa yleensä Tähän myös maatalouspoliittiset teokset, jotka koskevat sekä maanviljelys- että kotieläintaloutta Tiettyä maatalouden erikoisalaa koskeva maatalouspolitiikka luokitetaan alan mukaan

Maanviljely. Puutarhanhoito. Hyötykasvit
type: Concept
References: Viheralueiden suunnittelu
References: KASVITIEDE. SIENITIEDE
References: Elintarviketeollisuus
alternative label: 4H, yl. (67.3)
alternative label: 4H-kerhot, yl. (67.3)
alternative label: 4H-toiminta, yl. (67.3)
alternative label: AIV-menetelmä (67.3)
alternative label: Agronomia (67.3+)
alternative label: Harvennus, maanviljelys ja puutarhanhoito (67.3+)
alternative label: Hortonomia (67.3+)
alternative label: Hyötykasvit (67.3+)
alternative label: Idätys, maanviljelys ja puutarhanhoito (67.3+)
alternative label: Istutus, maanviljelys ja puutarhanhoito (67.3+)
alternative label: Istutuskoneet, maanviljelys (67.3+)
alternative label: Itäminen, maanviljelys ja puutarhanhoito (67.3+)
alternative label: Jalostus, hyötykasvit (67.3+)
alternative label: Kastelu, maanviljelys ja puutarhanhoito (67.3+)
alternative label: Kasvilajit, hyötykasvit (67.3+)
alternative label: Kasvinjalostus (67.3+)
alternative label: Kasvinviljely (67.3+)
alternative label: Kasviot, hyötykasvit (67.3+)
alternative label: Kasvit, hyötykasvit (67.3+)
alternative label: Kasvit, jalostus (67.3+)
alternative label: Kasvit, viljely (67.3+)
alternative label: Kauppapuutarhat (67.3+)
alternative label: Kaupunkiviljely (67.3+)
alternative label: Keittiöpuutarhat (67.3+)
alternative label: Kivipuutarhat (67.3)
alternative label: Kloonaus, kasvinjalostus (67.3+)
alternative label: Kotipuutarhat (67.3+)
alternative label: Kylvö, maanviljelys ja puutarhanhoito (67.3+)
alternative label: Kylvökoneet, maanviljelys (67.3+)
alternative label: Lajinmääritysoppaat, hyötykasvit (67.3+)
alternative label: Landsbygdskultur, jordbruk (67.3) {@sv}
alternative label: Lannoitus, maanviljelys ja puutarhanhoito (67.3+)
alternative label: Lehtipuut, puutarhanhoito (67.3+)
alternative label: Maan laatu, maanviljelys ja puutarhanhoito (67.3+)
alternative label: Maanmuokkaus, maanviljelys ja puutarhanhoito (67.3+)
alternative label: Maanparannus, maanviljelys ja puutarhanhoito (67.3+)
alternative label: Maanraivaus, maanviljelys ja puutarhanhoito (67.3+)
alternative label: Maanviljely (67.3+)
alternative label: Maanviljelysfysiikka (67.3+)
alternative label: Maanviljelyskemia (67.3+)
alternative label: Maanviljelyskoneet, käyttö (67.3+)
alternative label: Maanviljelystyökalut (67.3+)
alternative label: Maanviljelystyöt (67.3+)
alternative label: Maaperä, maanviljelys ja puutarhanhoito (67.3+)
alternative label: Maaseutukulttuuri, maanviljely (67.3)
alternative label: Maatalous, maanviljelys ja puutarhanhoito (67.3+)
alternative label: Maatalouskerhot (67.3)
alternative label: Maatalousrakennukset, maanviljelys ja puutarhanhoito (67.3+)
alternative label: Nurmikot, hoito ja perustaminen (67.3)
alternative label: Ojitus, maanviljelys ja puutarhanhoito (67.3+)
alternative label: Peltoviljely (67.3+)
alternative label: Pensaat, puutarhanhoito (67.3+)
alternative label: Pihasuunnittelu (67.3+)
alternative label: Pihat, hoito (67.3+)
alternative label: Puulajit, puutarhanhoito (67.3+)
alternative label: Puut, puutarhanhoito (67.3+)
alternative label: Puutarha-arkkitehtuuri, puutarhanhoito (67.3+)
alternative label: Puutarhakasvit (67.3+)
alternative label: Puutarhanhoito (67.3+)
alternative label: Puutarhat, puutarhanhoito (67.3+)
alternative label: Puutarhatalous (67.3+)
alternative label: Puutarhatuotteet (67.3+)
alternative label: Puutarhatyökalut (67.3+)
broader: MAA- JA METSÄTALOUS. ELINTARVIKETEOLLISUUS. BIOTEKNIIKKA
in scheme: YKL - Yleisten kirjastojen luokitusjärjestelmä
narrower: Vihannes- ja juureskasvit
narrower: Hedelmä- ja marjakasvit
narrower: Koristekasvit
narrower: Vilja- ja heinäkasvit
narrower: Yrtti- ja maustekasvit
narrower: Muut hyötykasvit
narrower: Viljelymenetelmät
narrower: Kasvinsuojelu
notation: 67.3
scope note: Hit allmänna verk om jordbruk och trädgårdsskötsel Hit också allmänna verk om nytto-, odlings-, foder- och trädgårdsväxter. Växtodlingslära. Växtförädling Åkerbruk. Trädgårdsodling Köks-, handels- och koloniträdgårdar. Plantskolor Ekonomi, produktion och produkter som har att göra med jordbruk Jordbrukskemi och jordbruksfysik. Jordens kvalitet och bördighet Arbeten och arbetsredskap som har att göra med jordbruk och trädgårdsskötsel Markröjning. Jordbearbetning. Jordförbättring. Gödsling. Sådd. Plantering. Gallring. Bevattning. Dikning. Skörd. Hantering och lagring av skörden Hit också anläggning och skötsel av gräsmattor Om verket innehåller både trädgårds- eller gårdsskötsel och planering av trädgårdar och gårdar, ges företräde åt klass 67.3+ @sv
scope note: Tähän maanviljelyn sekä puutarhan- ja pihanhoidon yleisteokset Tähän myös hyöty-, viljely-, rehu- ja puutarhakasveja koskevat yleisteokset Rehuteollisuus Kasvinviljely. Kasvinjalostus Peltoviljely. Puutarhaviljely Keittiö-, kauppa- ja siirtolapuutarhat. Taimitarhat Maanviljelyksen ja puutarhanhoidon talous, tuotanto ja tuotteet Maanviljelyskemia ja -fysiikka. Maan laatu ja viljavuus Maanviljelyksen ja puutarhanhoidon työt ja työvälineet Maanraivaus. Maanmuokkaus. Maanparannus. Lannoitus. Kylvö. Istutus. Karsinta. Harvennus. Kastelu. Ojitus Sadonkorjuu. Sadon käsittely ja varastointi Tähän myös nurmikon perustaminen ja hoito Jos teoksessa on sekä puutarhan tai pihan hoitoa että suunnittelua, annetaan etusija luokalle 67.3+

Vihannes- ja juureskasvit
type: Concept
type: YKL-luokka
alternative label: Baljväxter, odling (67.31) @sv
alternative label: Grönsaker, grönsaks- och rotfruktsodling (67.31) @sv
alternative label: Grönsaksodling (67.31) @sv
alternative label: Grönsaksväxter, odling (67.31) @sv
alternative label: Hernekasvit, viljely (67.31)
alternative label: Juurekset, viljely (67.31)
alternative label: Kasvikset, vihannes- ja juuresviljely (67.31)
alternative label: Palkokasvit, viljely (67.31)
alternative label: Peruna, viljely (67.31)
alternative label: Potatis, odling (67.31) @sv
alternative label: Rotfrukter, odling (67.31) @sv
alternative label: Sockerbeta, odling (67.31) @sv
alternative label: Sokerijuurikas, viljely (67.31)
alternative label: Vihanneskasvit, viljely (67.31)
alternative label: Vihannesviljely (67.31)
alternative label: Ärtväxter, odling (67.31) @sv
broader: Maanviljely. Puutarhanhoito. Hyötykasvit
in scheme: YKL - Yleisten kirjastojen luokitusjärjestelmä
notation: 67.31
preferred label: Grönsaker och rotfrukter @sv
preferred label: Vegetable plants @en
scope note: Hit grönsaker, baljväxter och rotfrukter samt odlings- och växtskyddsråd för dem ur åker-, trädgårds- och växthusodlingens synvinkel Hit också odling av sockerbetor Hit också odling av fodergrönsaker och foderrotsaker @sv
scope note: Tähän vihannes-, palko- ja juureskasvit sekä niiden viljely- ja kasvinsuojeluohjeet pelto-, puutarha- ja kasvihuoneviljelyn kannalta Tähän myös sokerijuurikkaan viljely Tähän myös vihannes- ja juureskasvien viljely rehuksi

Hedelmä- ja marjakasvit
type: Concept
References: Marjastus. Luonnonmarjat
type: YKL-luokka
alternative label: Bär (67.32) @sv
alternative label: Bär, nyttoväxter (67.32) @sv
alternative label: Bär, odling (67.32) @sv
alternative label: Bärbuskar, odling (67.32) @sv
alternative label: Bärodling (67.32) @sv
alternative label: Citrusfrukter, odling (67.32) @sv
alternative label: Frukter, nyttoväxter (67.32) @sv
alternative label: Fruktodling (67.32) @sv
alternative label: Fruktträd, odling (67.32) @sv
alternative label: Fruktväxter, trädgårdsskötsel (67.32) @sv
alternative label: Hedelmäkasvit, puutarhanhoito (67.32)
alternative label: Hedelmänviljely (67.32)
alternative label: Hedelmäpuut, viljely (67.32)
alternative label: Hedelmät, hyötykasvit (67.32)
alternative label: Marjanviljely (67.32)
alternative label: Marjapensaat, viljely (67.32)
alternative label: Marjat (67.32)
alternative label: Marjat, hyötykasvit (67.32)
alternative label: Marjat, viljely (67.32)
alternative label: Nötodling (67.32) @sv
alternative label: Nötter, odling (67.32) @sv
alternative label: Omenapuut, viljely (67.32)
alternative label: Pähkinänviljely (67.32)
alternative label: Pähkinät, viljely (67.32)
alternative label: Sitrushedelmät, viljely (67.32)
alternative label: Viiniköynnökset, viljely (67.32)
alternative label: Viinimarjat, viljely (67.32)
alternative label: Viininviljely (67.32)
alternative label: Viinirypäle, viljely (67.32)
alternative label: Vinbär, odling (67.32) @sv
alternative label: Vindruva, odling (67.32) @sv
alternative label: Vinodling (67.32) @sv
alternative label: Vinrankor, odling (67.32) @sv
alternative label: Äppelträd, odling (67.32) @sv
broader: Maanviljely. Puutarhanhoito. Hyötykasvit
in scheme: YKL - Yleisten kirjastojen luokitusjärjestelmä
notation: 67.32
preferred label: Fruit and berry plants @en
preferred label: Frukter och bär @sv
scope note: Hit frukter och bär samt odlings- och växtskyddsråd för dem ur åker-, trädgårds- och växthusodlingens synvinkel Odling av fruktträd, bär, bärbuskar och vinrankor Hit också verk som behandlar både odlade och vilda frukter eller bär @sv
scope note: Tähän hedelmä- ja marjakasvit sekä niiden viljely- ja kasvinsuojeluohjeet pelto-, puutarha- ja kasvihuoneviljelyn kannalta Hedelmäpuiden, marjojen, marjapensaiden ja viiniköynnöksen viljely Tähän myös teokset, jotka koskevat sekä viljeltyjä että luonnonvaraisia hedelmiä tai marjoja

Koristekasvit
type: Concept
References: Viheralueiden suunnittelu
type: YKL-luokka
alternative label: Artbestämningshandböcker, prydnadsväxter (67.33+) @sv
alternative label: Barrträd, trädgårdsskötsel (67.33+) @sv
alternative label: Blomlådor (67.33+) @sv
alternative label: Blommor, odling (67.33+) @sv
alternative label: Blommor, trädgårdsblommor (67.33) @sv
alternative label: Bonsai (67.33+)
alternative label: Dvärgträd, odling (67.33+) @sv
alternative label: Floror, prydnadsväxter (67.33+) @sv
alternative label: Förädling, prydnadsväxter (67.33+) @sv
alternative label: Havupuut, puutarhanhoito (67.33+)
alternative label: Jalostus, koristekasvit (67.33+)
alternative label: Kasvilajit, koristekasvit (67.33+)
alternative label: Kasviot, koristekasvit (67.33+)
alternative label: Kivikkokasvit, puutarhakasvit (67.33)
alternative label: Koristekasvit (67.33)
alternative label: Koristekasvit, puutarhakasvit (67.33)
alternative label: Koristepensaat (67.33)
alternative label: Koristepuut (67.33)
alternative label: Korsning, prydnadsväxter (67.33+) @sv
alternative label: Kukat, puutarhakasvit (67.33)
alternative label: Kukat, viljely (67.33+)
alternative label: Kukkalaatikot (67.33+)
alternative label: Kääpiöpuut, kasvatus (67.33+)
alternative label: Köynnöskasvisäleiköt (67.33+)
alternative label: Lajinmääritysoppaat, koristekasvit (67.33+)
alternative label: Ormbunksväxter, prydnadsväxter (67.33+) @sv
alternative label: Prydnadsbuskar (67.33) @sv
alternative label: Prydnadsträd (67.33) @sv
alternative label: Prydnadsväxter (67.33) @sv
alternative label: Prydnadsväxter, trädgårdsväxter (67.33) @sv
alternative label: Raser, prydnadsväxter (67.33+) @sv
alternative label: Risteytys, koristekasvit (67.33+)
alternative label: Rodut, koristekasvit (67.33+)
alternative label: Rosor, trädgårdsväxter (67.33) @sv
alternative label: Ruusut, puutarhakasvit (67.33)
alternative label: Saniaiset, koristekasvit (67.33+)
alternative label: Spaljéer (67.33+) @sv
alternative label: Stenpartiväxter, trädgårdsväxter (67.33) @sv
alternative label: Växtarter, prydnadsväxter (67.33+) @sv
broader: Maanviljely. Puutarhanhoito. Hyötykasvit
in scheme: YKL - Yleisten kirjastojen luokitusjärjestelmä
narrower: Huonekasvit. Kukka-asetelmat
notation: 67.33
preferred label: Ornamental plants @en
preferred label: Prydnadsväxter @sv
scope note: Hit allmänna verk om prydnadsväxter Odlings- och växtskyddsråd för prydnadsväxter och blommor samt för prydnadsbuskar och prydnadsträd @sv
scope note: Tähän koristekasveja koskevat yleisteokset Koristekasvien ja kukkien sekä koristepensaiden ja -puiden viljely- ja kasvinsuojeluohjeet pelto-, puutarha- ja kasvihuoneviljelyn kannalta

Huonekasvit. Kukka-asetelmat
type: Concept
References: Sisustusoppaat
References: Sisustusarkkitehtuuri. Huonekalutaide
type: YKL-luokka
alternative label: Balkonglådor (67.331) @sv
alternative label: Balkongväxter (67.331) @sv
alternative label: Bevattning, rumsväxter (67.331) @sv
alternative label: Blomkrukor (67.331) @sv
alternative label: Blommor, bindning och arrangemang (67.331) @sv
alternative label: Blommor, rumsväxter (67.331) @sv
alternative label: Blommor, snittblommor (67.331) @sv
alternative label: Blommor, symbolik (67.331) @sv
alternative label: Blomsterarrangemang (67.331) @sv
alternative label: Blomsterhandlar (67.331) @sv
alternative label: Blomsteruppsättningar (67.331) @sv
alternative label: Blomterrarier (67.331) @sv
alternative label: Eterneller (67.331) @sv
alternative label: Gröna växter, rumsväxter (67.331) @sv
alternative label: Gödsling, rumsväxter (67.331) @sv
alternative label: Huonekasvit (67.331)
alternative label: Ikebana (67.331)
alternative label: Kaktukset, huonekasvit (67.331)
alternative label: Kaktusar, rumsväxter (67.331) @sv
alternative label: Kastelu, huonekasvit (67.331)
alternative label: Koristekasvit, huonekasvit (67.331)
alternative label: Krukväxter (67.331) @sv
alternative label: Kuivakukat (67.331)
alternative label: Kukat, asettelu ja sidonta (67.331)
alternative label: Kukat, huonekasvit (67.331)
alternative label: Kukat, leikkokukat (67.331)
alternative label: Kukat, symboliikka (67.331)
alternative label: Kukka-asetelmat (67.331)
alternative label: Kukkakaupat (67.331)
alternative label: Kukkaruukut (67.331)
alternative label: Kukkaterraariot (67.331)
alternative label: Kukkien asettelu (67.331)
alternative label: Lannoitus, huonekasvit (67.331)
alternative label: Leikkokukat (67.331)
alternative label: Orkideat, huonekasvit (67.331)
alternative label: Orkidéer, rumsväxter (67.331) @sv
alternative label: Parvekekasvit (67.331)
alternative label: Parvekelaatikot (67.331)
alternative label: Prydnadsväxter, rumsväxter (67.331) @sv
alternative label: Rumsväxter (67.331) @sv
alternative label: Ruukkukasvit (67.331)
alternative label: Snittblommor (67.331) @sv
alternative label: Terraariot, huonekasvit (67.331)
alternative label: Terrarier, rumsväxter (67.331) @sv
alternative label: Viherkasvit, huonekasvit (67.331)
broader: Koristekasvit
in scheme: YKL - Yleisten kirjastojen luokitusjärjestelmä
notation: 67.331
preferred label: House plants. Flower arrangements @en
preferred label: Rumsväxter. Blomsterarrangemang @sv
scope note: Gröna växter och blomster för hemmet samt skötsel av dem Blomkrukor. Balkonglådor. Blomsterterrarier Blomsterbindning. Snittblomster. Eterneller Blomsterarrangemang. lkebana Handel med blomster och grönsaker Hit också blomstersymbolik @sv
scope note: Kodin viher- ja kukkakasvit sekä niiden hoito-ohjeet Kukkaruukut ja -laatikot. Parvekelaatikot. Kukkaterraariot Kukkien sidonta. Leikkokukat. Kuivakukat Kukka-asetelmat. Ikebana. Kukkien ja viherkasvien kauppa Tähän myös kukkien symboliikka

Vilja- ja heinäkasvit
type: Concept
References: Kotieläintalous. Kotieläinten hoito
type: YKL-luokka
alternative label: Gräsväxter, odling (67.34) @sv
alternative label: Heinäkasvit, viljely (67.34)
alternative label: Kuivaus, vilja- ja heinäkasvit (67.34)
alternative label: Lador, lantbruk (67.34) @sv
alternative label: Ladot, maanviljelys (67.34)
alternative label: Riihet, maanviljelys (67.34)
alternative label: Rior, lantbruk (67.34) @sv
alternative label: Sädesväxter, odling (67.34) @sv
alternative label: Torkning, sädes- och gräsväxter (67.34) @sv
alternative label: Viljakasvit, viljely (67.34)
broader: Maanviljely. Puutarhanhoito. Hyötykasvit
in scheme: YKL - Yleisten kirjastojen luokitusjärjestelmä
notation: 67.34
preferred label: Grains and grasses @en
preferred label: Sädes- och gräsväxter @sv
scope note: Sädes- och gräsväxter samt odlings- och växtskyddsråd för dem @sv
scope note: Vilja- ja heinäkasvit sekä niiden viljely- ja kasvinsuojeluohjeet

Yrtti- ja maustekasvit
type: Concept
References: Kauneudenhoito. Ulkonäkö
References: Lääkehoito. Lääkeaineoppi
References: Ruoanvalmistus. Ruokakulttuuri
type: YKL-luokka
alternative label: Kauneudenhoitokasvit, viljely ja keräily (67.35)
alternative label: Kosmetikväxter, odling och samlande (67.35) @sv
alternative label: Kryddväxter, odling och samlande (67.35) @sv
alternative label: Luonnonyrtit (67.35)
alternative label: Lääkekasvit (67.35)
alternative label: Lääkekasvit, viljely ja keräily (67.35)
alternative label: Maustekasvit, viljely ja keräily (67.35)
alternative label: Medicinalväxter (67.35) @sv
alternative label: Medicinalväxter, odling och samlande (67.35) @sv
alternative label: Officinella växter (67.35) @sv
alternative label: Officinella växter, odling och samlande (67.35) @sv
alternative label: Rohdoskasvit (67.35)
alternative label: Rohdoskasvit, viljely ja keräily (67.35)
alternative label: Ryytikasvit, viljely ja keräily (67.35)
alternative label: Vilda örter (67.35) @sv
alternative label: Villiyrtit (67.35)
alternative label: Yrtit (67.35)
alternative label: Yrtit, puutarhanhoito (67.35)
alternative label: Yrttikasvit, viljely ja keräily (67.35)
alternative label: vilda grönsaker (67.35) @sv
alternative label: villivihannekset (67.35)
alternative label: Örter (67.35) @sv
alternative label: Örter, trädgårdsskötsel (67.35) @sv
broader: Maanviljely. Puutarhanhoito. Hyötykasvit
in scheme: YKL - Yleisten kirjastojen luokitusjärjestelmä
notation: 67.35
preferred label: Herbs and spice plants @en
preferred label: Örter och kryddväxter @sv
scope note: Hit ört-, krydd-, läkemedels- och medicinalväxter samt odlings- och växtskyddsråd för dem ur åker-, trädgårds- och växthusodlingens synvinkel Hit också vilda ört-, krydd-, officinal- och medicinalväxter samt insamling av dem Hit också örter som används i skönhetsvärden samt odling och insamling av dem Om verket innehåller odling eller insamling av medicinalväxter samt farmaci, ges företräde åt klass 67.35 @sv
scope note: Tähän yrtti-, mauste-, rohdos- ja lääkekasvit sekä niiden viljely- ja kasvinsuojeluohjeet pelto-, puutarha- ja kasvihuoneviljelyn kannalta Tähän myös luonnonvaraiset yrtti-, mauste-, rohdos- ja lääkekasvit sekä niiden keräily Tähän myös kauneudenhoitoon käytetyt yrtit sekä niiden viljely ja keräily Jos teoksessa on sekä lääkekasvien viljelyä tai keräilyä että farmasiaa, annetaan etusija luokalle 67.35

Muut hyötykasvit
type: Concept
References: Kehrääminen. Karstaus. Värjäys
References: Sienestys
type: YKL-luokka
alternative label: Bomull, odling (67.36) @sv
alternative label: Champinjoner, odling (67.36) @sv
alternative label: Doftväxter, odling och insamling (67.36) @sv
alternative label: Fiberväxter, odling (67.36) @sv
alternative label: Färgväxter, odling och samlande (67.36) @sv
alternative label: Garvämnesväxter, odling (67.36) @sv
alternative label: Gummiväxter (67.36) @sv
alternative label: Hajuainekasvit, viljely ja keräily (67.36)
alternative label: Herkkusienet, viljely (67.36)
alternative label: Honungsväxter, odling (67.36) @sv
alternative label: Hunajakasvit, viljely (67.36)
alternative label: Kaakao, viljely (67.36)
alternative label: Kaffe, odling (67.36) @sv
alternative label: Kahvi, viljely (67.36)
alternative label: Kakao, odling (67.36) @sv
alternative label: Korkek (67.36) @sv
alternative label: Korkkitammi (67.36)
alternative label: Kuitukasvit, viljely (67.36)
alternative label: Kumikasvit (67.36)
alternative label: Lin, odling (67.36) @sv
alternative label: Nautintoainekasvit, viljely (67.36)
alternative label: Njutningsväxter, odling (67.36) @sv
alternative label: Oljeväxter, odling (67.36) @sv
alternative label: Parkkiainekasvit, viljely (67.36)
alternative label: Pellava, viljely (67.36)
alternative label: Puuvilla, viljely (67.36)
alternative label: Shiitake, odling (67.36) @sv
alternative label: Sienet, viljely (67.36)
alternative label: Siitake, viljely (67.36)
alternative label: Sockerrör, odling (67.36) @sv
alternative label: Sokerinruoko, viljely (67.36)
alternative label: Stärkelseväxter, odling (67.36) @sv
alternative label: Svampar, odling (67.36) @sv
alternative label: Te, odling (67.36) @sv
alternative label: Tee, viljely (67.36)
alternative label: Tekstiilikuitukasvit, viljely (67.36)
alternative label: Textilfiberväxter, odling (67.36) @sv
alternative label: Tobak, odling (67.36) @sv
alternative label: Tupakka, viljely (67.36)
alternative label: Tärkkelyskasvit, viljely (67.36)
alternative label: Väriainekasvit, viljely ja keräily (67.36)
alternative label: Öljykasvit, viljely (67.36)
broader: Maanviljely. Puutarhanhoito. Hyötykasvit
in scheme: YKL - Yleisten kirjastojen luokitusjärjestelmä
notation: 67.36
preferred label: Andra nyttoväxter @sv
preferred label: Other economic plants @en
scope note: Hit olje-, stärkelse-, gummi-, fiber-, njutnings-, färg-, doft- och garvämnesväxter samt odlings- och växtskyddsråd för dem ur åker-, trädgårds- eller växthusodlingens synvinkel Hit också svampodling Hit också t.ex. vilda gummi- och pigmentväxter samt utnyttjandet av dem Om verket behandlar både svampodling och svampplockning, ges företräde åt klass 67.36 @sv
scope note: Tähän öljy-, tärkkelys-, kumi- ja kuitukasvit sekä nautinto-, väri-, haju- ja parkkiainekasvit ja niiden viljely- ja kasvinsuojeluohjeet pelto-, puutarha- ja kasvihuoneviljelyn kannalta Tähän myös sienten viljely Tähän myös esim. luonnonvaraiset kumi- ja väriainekasvit sekä niiden hyödyntäminen Jos teos koskee sekä sienten viljelyä että sienestystä, annetaan etusija luokalle 67.36

Viljelymenetelmät
type: Concept
References: Kasvinsuojelu
type: YKL-luokka
alternative label: Akvakultur (67.38) @sv
alternative label: Biodynaaminen viljely (67.38)
alternative label: Biodynamisk odling (67.38) @sv
alternative label: Biologinen viljely (67.38)
alternative label: Biologisk odling (67.38) @sv
alternative label: Dryfarming (67.38)
alternative label: Ekologisk odling (67.38) @sv
alternative label: Kaskenviljely, viljelymenetelmät (67.38)
alternative label: Kasvihuoneviljely (67.38)
alternative label: Kateviljely (67.38)
alternative label: Kesannointi (67.38)
alternative label: Komposter (67.38) @sv
alternative label: Kompostering (67.38) @sv
alternative label: Kompostering, odling (67.38) @sv
alternative label: Kompostit (67.38)
alternative label: Kompostointi (67.38)
alternative label: Kompostointi, viljely (67.38)
alternative label: Lasinalaisviljely (67.38)
alternative label: Luomu-viljely (67.38)
alternative label: Luonnonmukainen viljely (67.38)
alternative label: Naturenlig odling (67.38) @sv
alternative label: Odling under glas (67.38) @sv
alternative label: Odlingsmetoder (67.38) @sv
alternative label: Pengerviljely (67.38)
alternative label: Svedjebruk, odlingsmetoder (67.38) @sv
alternative label: Terassodling (67.38) @sv
alternative label: Trädesläggning (67.38) @sv
alternative label: Täckodling (67.38) @sv
alternative label: Vesiviljely (67.38)
alternative label: Viljelymenetelmät (67.38)
alternative label: Vuoroviljely (67.38)
alternative label: Växelbruk (67.38) @sv
alternative label: Växthusodling (67.38) @sv
broader: Maanviljely. Puutarhanhoito. Hyötykasvit
in scheme: YKL - Yleisten kirjastojen luokitusjärjestelmä
notation: 67.38
preferred label: Cultivation methods @en
preferred label: Odlingsmetoder @sv
scope note: Hit verk om olika odlingsmetoder ur åker- eller trädgårdsodlingens synvinkel i allmänhet Biologisk och biodynamisk odling Växthusodling. Odling under glas. Täckodling. Träda. Skiftesodling. Dryfarming. Vattenodling. Terrassodling. Odling på konstgjort underlag Hit också kompostering ur odlingens synvinkel Odlingsråd och odlingsmetoder som rör en enskild växt eller växtgrupp klassificeras enligt den ifrågavarande växtens eller växtgruppens klass 67.31-67.36 @sv
scope note: Tähän teokset, jotka koskevat eri viljelymenetelmiä pelto- tai puutarhaviljelyn kannalta yleensä Biologinen, luonnonmukainen ja biodynaaminen viljely Kasvihuoneviljely. Lasinalaisviljely. Kateviljely. Kesannointi. Vuoroviljely. Dryfarming. Vesiviljely. Pengerviljely. Viljely keinoalustalla Tähän myös kompostointi viljelyn kannalta Tietyn kasvin tai kasviryhmän viljelyohjeet ja -menetelmät luokitetaan ko. kasvin tai kasviryhmän luokkaan 67.31-67.36

Kasvinsuojelu
type: Concept
References: Ympäristönsuojelu. Luonnonsuojelu
References: KASVITIEDE. SIENITIEDE
References: Kemianteollisuus
References: Metsänhoito
type: YKL-luokka
alternative label: Biologinen torjunta, kasvinsuojelu (67.39)
alternative label: Biologisk bekämpning, växtskydd (67.39) @sv
alternative label: Bristsjukdomar, kulturväxter (67.39) @sv
alternative label: Hyönteismyrkyt, kasvinsuojelu (67.39)
alternative label: Insektgifter, växtskydd (67.39) @sv
alternative label: Kasvinsuojelu (67.39)
alternative label: Kasvinsuojeluaineet, käyttö (67.39)
alternative label: Kasvitaudit, kasvinsuojelu (67.39)
alternative label: Kasvituholaiset (67.39)
alternative label: Kemiallinen torjunta, kasvinsuojelu (67.39)
alternative label: Kemisk bekämpning, växtskydd (67.39) @sv
alternative label: Ogräsväxter (67.39) @sv
alternative label: Ogräsväxter, bekämpning (67.39) @sv
alternative label: Puutostaudit, viljelykasvit (67.39)
alternative label: Rikkakasvit (67.39)
alternative label: Rikkakasvit, torjunta (67.39)
alternative label: Sienitaudit, viljelykasvit (67.39)
alternative label: Skadedjursbekämpning, lantbruk (67.39) @sv
alternative label: Skadedjursbekämpning, trädgårdsskötsel (67.39) @sv
alternative label: Svampsjukdomar, kulturväxter (67.39) @sv
alternative label: Tuholaistorjunta, maanviljelys (67.39)
alternative label: Tuholaistorjunta, puutarhanhoito (67.39)
alternative label: Växtsjukdomar, växtskydd (67.39) @sv
alternative label: Växtskadegörare (67.39) @sv
alternative label: Växtskydd (67.39) @sv
alternative label: Växtskyddsmedel, användning (67.39) @sv
broader: Maanviljely. Puutarhanhoito. Hyötykasvit
in scheme: YKL - Yleisten kirjastojen luokitusjärjestelmä
notation: 67.39
preferred label: Plant protection @en
preferred label: Växtskydd @sv
scope note: Kasvinsuojelu maanviljelyksen, puutarhanhoidon, kasvihuoneviljelyn ja muiden viljelymenetelmien kannalta yleensä Viljeltyjen kasvien taudit ja tuholaiset sekä niiden kemiallinen ja biologinen torjunta Puutos-, sieni-, bakteeri- ja virustaudit sekä kasvinsuojeluaineet ja -välineet kasvien viljelyn kannalta Rikkakasvit ja rikkakasvien torjunta Tietyn kasvin tai kasviryhmän taudit, tuholaiset ja rikkakasvit sekä niiden torjunta luokitetaan ko. kasvin tai kasviryhmän luokkaan 67.31-67.36 Jos teoksessa on sekä viljelykasvien että luonnonvaraisten kasvien tauteja tai tuholaisia, annetaan etusija luokalle 67.39
scope note: Växtskydd ur jordbrukets, trädgårdsodlingens, växthusodlingens och övriga odlingsmetoders synvinkel i allmänhet Sjukdomar och skadedjur som angriper odlade växter samt kemisk och biologisk bekämpning av dem Brist-, svamp-, bakterie- och virussjukdomar samt växtskyddsmedel och växtskyddsutrustning ur växtodlingens synvinkel Ogräs och ogräsbekämpning Sjukdomar, skadedjur och ogräs samt bekämpning av dem med hänsyn till en viss grupp av växter förs efter den berörda växten eller växtgruppen till klasserna 67.31-67.36 Om verket behandlar både sjukdomar och skadedjur som angriper odlade eller vilda växter, ges företräde åt klass 67.39 @sv

Kotieläintalous. Kotieläinten hoito
type: Concept
References: Talousoikeus
References: Eläinsuojelu
References: ELÄINTIEDE
References: URN:NBN:fi:au:ykl:58.062
References: Talonrakennus
References: Elintarviketeollisuus
alternative label: Agility (67.4+)
alternative label: Aitaukset, kotieläinten hoito (67.4+)
alternative label: Betesmarker, husdjursskötsel (67.4+) @sv
alternative label: Betning, husdjursskötsel (67.4+) @sv
alternative label: Boskapsavel (67.4+) @sv
alternative label: Boskapsskötsel (67.4+) @sv
alternative label: Djur, beteende, husdjur (67.4+) @sv
alternative label: Djur, förädling (67.4+) @sv
alternative label: Djur, husdjur (67.4+) @sv
alternative label: Djurarter, husdjur (67.4+) @sv
alternative label: Djurhandel, husdjur (67.4+) @sv
alternative label: Djurinhägnader, djurskötsel (67.4+) @sv
alternative label: Djurstall, djurskötsel (67.4+) @sv
alternative label: Däggdjur, husdjur (67.4+) @sv
alternative label: Eläimet, jalostus (67.4+)
alternative label: Eläimet, kotieläimet (67.4+)
alternative label: Eläimet, käyttäytyminen, kotieläimet (67.4+)
alternative label: Eläinkauppa, kotieläimet (67.4+)
alternative label: Eläinlajit, kotieläimet (67.4+)
alternative label: Eläinsuojat, eläinten hoito (67.4+)
alternative label: Foder, boskapsskötsel (67.4+) @sv
alternative label: Förädling, husdjur (67.4+) @sv
alternative label: Hovdjur, husdjur (67.4+) @sv
alternative label: Husdjur (67.4+) @sv
alternative label: Husdjur, skötsel och sjukdomar (67.4+) @sv
alternative label: Husdjursarter och -raser (67.4+) @sv
alternative label: Husdjursavel (67.4+) @sv
alternative label: Husdjursbyggnader, djurskötsel (67.4+) @sv
alternative label: Husdjursekonomi (67.4+) @sv
alternative label: Inhägnader, husdjursskötsel (67.4+) @sv
alternative label: Insemination, husdjur (67.4+) @sv
alternative label: Jalostus, kotieläimet (67.4+)
alternative label: Karjanhoito (67.4+)
alternative label: Karjanjalostus (67.4+)
alternative label: Karjasuojat, eläinten hoito (67.4+)
alternative label: Karjatalous (67.4+)
alternative label: Keinohedelmöitys, kotieläimet (67.4+)
alternative label: Keinosiemennys, kotieläimet (67.4+)
alternative label: Kesytys, kotieläimet (67.4+)
alternative label: Kloning, husdjursavel (67.4+) @sv
alternative label: Kloonaus, kotieläinjalostus (67.4+)
alternative label: Konstgjord befruktning, husdjur (67.4+) @sv
alternative label: Kotieläimet (67.4+)
alternative label: Kotieläimet, hoito ja sairaudet (67.4+)
alternative label: Kotieläinjalostus (67.4+)
alternative label: Kotieläinlajit ja -rodut (67.4+)
alternative label: Kotieläinrakennukset, eläinten hoito (67.4+)
alternative label: Kotieläintalous (67.4+)
alternative label: Laidunnus, kotieläinten hoito (67.4+)
alternative label: Laitumet, kotieläinten hoito (67.4+)
alternative label: Lihantuotanto, tuotantoeläimet (67.4+)
alternative label: Maatalous, karjatalous (67.4+)
alternative label: Maatalousrakennukset, karjatalous (67.4+)
alternative label: Nisäkkäät, kotieläimet (67.4+)
alternative label: Rehut, karjanhoito (67.4+)
alternative label: Risteytys, kotieläimet (67.4+)
alternative label: Rodut, kotieläimet (67.4+)
alternative label: Ruokinta, kotieläinten hoito (67.4+)
alternative label: Sorkkaeläimet, kotieläimet (67.4+)
broader: MAA- JA METSÄTALOUS. ELINTARVIKETEOLLISUUS. BIOTEKNIIKKA
in scheme: YKL - Yleisten kirjastojen luokitusjärjestelmä
narrower: Hevosten hoito
narrower: Nautojen, lampaiden ja vuohien hoito
narrower: Sikojen hoito
narrower: Siipikarjan hoito
narrower: Lemmikkieläinten hoito
narrower: Poronhoito
narrower: Mehiläisten hoito. Hyönteisten kasvatus
narrower: Turkistarhaus
narrower: Eläinlääketiede
notation: 67.4
scope note: Husdjur och deras skötsel i allmänhet Husdjursekonomi och boskapsskötsel samt företagsekonomi som har att göra med husdjurs- och boskapsskötsel i allmänhet Hit och till underklasserna också husdjursarter och husdjursraser, husdjurens ursprung samt tämjning, avel och konstbefruktning av husdjur och deras förökning Byggnader, inhägnader och betesmarker för husdjur samt utfodring och annan skötsel av dem Om verket behandlar både husdjursskötsel och zoologi, ges företräde åt klass 67.4+ @sv
scope note: Kotieläimet ja kotieläinten hoito yleensä Kotieläin- ja karjatalous sekä kotieläin- ja karjatalouden liiketalous yleensä Tähän ja alaluokkiin myös kotieläinlajit ja -rodut, kotieläinten alkuperä, kesytys ja jalostus, kotieläinten lisääminen ja keinosiemennys, kotieläinten rakennukset, aitaukset ja laitumet, kotieläinten ruokinta ja muu hoito Jos teos koskee sekä kotieläintaloutta tai kotieläinten hoitoa että eläintiedettä, annetaan etusija luokalle 67.4+

Hevosten hoito
type: Concept
References: Nisäkkäät
References: Hevosurheilu. Ratsastus
type: YKL-luokka
alternative label: Aasit, kotieläimet (67.41)
alternative label: Arbetshästar, husdjur (67.41) @sv
alternative label: Hevoset (67.41)
alternative label: Hevoset, hoito ja sairaudet (67.41)
alternative label: Hevoset, kotieläimet (67.41)
alternative label: Hevosrodut (67.41)
alternative label: Hevostallit, hevosten hoito (67.41)
alternative label: Hovdjur, husdjur (67.41) @sv
alternative label: Hovslageri (67.41) @sv
alternative label: Hästar (67.41) @sv
alternative label: Hästar, husdjur (67.41) @sv
alternative label: Hästar, vård och sjukdomar (67.41) @sv
alternative label: Hästraser (67.41) @sv
alternative label: Kapplöpningshästar, skötsel och sjukdomar (67.41) @sv
alternative label: Kavioeläimet, kotieläimet (67.41)
alternative label: Kengitys (67.41)
alternative label: Kilpahevoset, hoito ja sairaudet (67.41)
alternative label: Mulor, husdjur (67.41) @sv
alternative label: Muulit, kotieläimet (67.41)
alternative label: Ponit, kotieläimet (67.41)
alternative label: Ponnyer, husdjur (67.41) @sv
alternative label: Ratsuhevoset, hoito (67.41)
alternative label: Ridhästar, skötsel (67.41) @sv
alternative label: Stall, hästskötsel (67.41) @sv
alternative label: Työhevoset, kotieläimet (67.41)
alternative label: Åsnor, husdjur (67.41) @sv
broader: Kotieläintalous. Kotieläinten hoito
in scheme: YKL - Yleisten kirjastojen luokitusjärjestelmä
notation: 67.41
preferred label: Horse husbandry @en
preferred label: Hästskötsel @sv
scope note: Hevoset yleensä. Hevosrodut. Ponit Työ-, ratsu- ja kilpahevosten hoito Hevosten kasvatus. Hevostallit Hevostenhoitovälineet Hevosten sairaudet ja niiden hoito Tähän myös aasit, muulit ja muut kavioeläimet kotieläiminä Jos teoksessa on sekä hevosten hoitoa että ratsastusta tai hevosurheilua, annetaan etusija luokalle 67.41
scope note: Hästar i allmänhet. Hästraser. Ponnyer Skötsel av arbets-, rid- och tävlingshästar Hästuppfödning. Stall Redskap för hästskötsel Hästsjukdomar och deras vård Hit också åsnor, mulor och andra hovdjur Om verket behandlar både hästskötsel och ritt eller hästsport ges företräde åt klass 67.41 @sv

Nautojen, lampaiden ja vuohien hoito
type: Concept
References: Nisäkkäät
References: Poronhoito
References: Elintarviketeollisuus
type: YKL-luokka
alternative label: Bufflar, husdjur (67.42) @sv
alternative label: Får, husdjur (67.42) @sv
alternative label: Får, skötsel och sjukdomar (67.42) @sv
alternative label: Fårhus, fårskötsel (67.42) @sv
alternative label: Fårskötsel (67.42) @sv
alternative label: Getskötsel (67.42) @sv
alternative label: Getter, husdjur (67.42) @sv
alternative label: Getter, skötsel och sjukdomar (67.42) @sv
alternative label: Härät, karjanhoito (67.42)
alternative label: Idisslare, husdjur (67.42) @sv
alternative label: Kameler, husdjur (67.42) @sv
alternative label: Kamelit, kotieläimet (67.42)
alternative label: Keritseminen (67.42)
alternative label: Klippning, får (67.42) @sv
alternative label: Kor, husdjur (67.42) @sv
alternative label: Kor, skötsel och sjukdomar (67.42) @sv
alternative label: Köttboskap, skötsel och sjukdomar (67.42) @sv
alternative label: Kötthushållning, boskapsskötsel (67.42) @sv
alternative label: Laamat, kotieläimet (67.42)
alternative label: Ladugårdar, boskapsskötsel (67.42) @sv
alternative label: Lammastalous (67.42)
alternative label: Lamor, husdjur (67.42) @sv
alternative label: Lampaat, hoito ja sairaudet (67.42)
alternative label: Lampaat, kotieläimet (67.42)
alternative label: Lampolat, lampaiden hoito (67.42)
alternative label: Lehmät, hoito ja sairaudet (67.42)
alternative label: Lehmät, kotieläimet (67.42)
alternative label: Lihakarja, hoito ja sairaudet (67.42)
alternative label: Lihatalous, karjatalous (67.42)
alternative label: Lypsy (67.42)
alternative label: Lypsykarja, hoito ja sairaudet (67.42)
alternative label: Lypsykoneet (67.42)
alternative label: Maidontuotanto, lypsykarja (67.42)
alternative label: Maitotalous, karjanhoito (67.42)
alternative label: Mjölkboskap, skötsel och sjukdomar (67.42) @sv
alternative label: Mjölkhushållning, boskapsskötsel (67.42) @sv
alternative label: Mjölkning (67.42) @sv
alternative label: Mjölkningsmaskiner (67.42) @sv
alternative label: Mjölkproduktion, mjölkboskap (67.42) @sv
alternative label: Märehtijät, kotieläimet (67.42)
alternative label: Naudat, karjanhoito (67.42)
alternative label: Nautaeläimet, karjanhoito (67.42)
alternative label: Nautarodut (67.42)
alternative label: Nautatalous (67.42)
alternative label: Navetat, karjanhoito (67.42)
alternative label: Nöt, boskapsskötsel (67.42) @sv
alternative label: Nötboskapsskötsel (67.42) @sv
alternative label: Nötdjur, boskapsskötsel (67.42) @sv
alternative label: Nötraser (67.42) @sv
alternative label: Oxar, boskapsskötsel (67.42) @sv
alternative label: Puhvelit, kotieläimet (67.42)
alternative label: Sonnit, karjanhoito (67.42)
alternative label: Tjurar, boskapsskötsel (67.42) @sv
alternative label: Ullfår, skötsel och sjukdomar (67.42) @sv
alternative label: Ullproduktion, fårskötsel (67.42) @sv
alternative label: Villakarja, hoito ja sairaudet (67.42)
alternative label: Villatalous, lampaiden hoito (67.42)
alternative label: Vuohet, hoito ja sairaudet (67.42)
alternative label: Vuohet, kotieläimet (67.42)
alternative label: Vuohitalous (67.42)
broader: Kotieläintalous. Kotieläinten hoito
in scheme: YKL - Yleisten kirjastojen luokitusjärjestelmä
notation: 67.42
preferred label: Cattle, sheep and goat husbandry @en
preferred label: Skötsel av nötkreatur, får och getter @sv
scope note: Maito-, liha- ja villakarjan hoito ja hoitovälineet Nauta-, lammas- ja vuohitalous Nauta-, lammas- ja vuohirodut Karjasuojat, navetat ja lampolat Lypsy ja lypsykoneet. Keritseminen Nautojen, lampaiden ja vuohien sairaudet ja niiden hoito Tähän myös puhvelit, laamat, kamelit ja muut märehtijät kotieläiminä
scope note: Skötsel av mjölk- och köttboskap och redskap för boskapsskötsel Nöt-, får- och gethushållning Nöt-, får- och getraser Ladugårdar och fårhus Mjölkning och mjölkmaskiner. Klippning Sjukdomar hos nötkreatur, får och getter samt behandling av dem Hit också bufflar, lamor, kameler och andra idisslare som husdjur @sv

Sikojen hoito
type: Concept
References: Nisäkkäät
type: YKL-luokka
alternative label: Siat, hoito ja sairaudet (67.43)
alternative label: Siat, kotieläimet (67.43)
alternative label: Sika, kotieläimet (67.43)
alternative label: Sikalat, sikojen hoito (67.43)
alternative label: Sikatalous (67.43)
alternative label: Svin, husdjur (67.43) @sv
alternative label: Svin, skötsel och sjukdomar (67.43) @sv
alternative label: Svinhus, svinskötsel (67.43) @sv
alternative label: Svinhushållning (67.43) @sv
broader: Kotieläintalous. Kotieläinten hoito
in scheme: YKL - Yleisten kirjastojen luokitusjärjestelmä
notation: 67.43
preferred label: Pig husbandry @en
preferred label: Svinuppfödning @sv
scope note: Sikojen hoito ja hoitovälineet Sikatalous. Sikalat. Sikarodut
scope note: Svinskötsel och redskap för svinskötsel Svinhushållning. Svinhus. Svinraser @sv

Siipikarjan hoito
type: Concept
References: Linnut
References: Häkkilinnut
type: YKL-luokka
alternative label: Ankat, kotieläimet (67.44)
alternative label: Ankor, husdjur (67.44) @sv
alternative label: Fjäderfä, skötsel och sjukdomar (67.44) @sv
alternative label: Fjäderfähushållning (67.44) @sv
alternative label: Fågelvilt, farmuppfödning (67.44) @sv
alternative label: Fåglar, fjäderfäskötsel (67.44) @sv
alternative label: Gäss, husdjur (67.44) @sv
alternative label: Hanhet, kotieläimet (67.44)
alternative label: Hönor, husdjur (67.44) @sv
alternative label: Hönor, vård och sjukdomar (67.44) @sv
alternative label: Hönsfåglar, fjäderfäskötsel (67.44) @sv
alternative label: Hönshus, hönsskötsel (67.44) @sv
alternative label: Hönsraser, hönsskötsel (67.44) @sv
alternative label: Kalkkunat, kotieläimet (67.44)
alternative label: Kalkoner, husdjur (67.44) @sv
alternative label: Kanalat, kanojen hoito (67.44)
alternative label: Kanalinnut, siipikarjan hoito (67.44)
alternative label: Kanarodut, kanojen hoito (67.44)
alternative label: Kanat, hoito ja sairaudet (67.44)
alternative label: Kanat, kotieläimet (67.44)
alternative label: Kukot, siipikarjanhoito (67.44)
alternative label: Linnut, siipikarjan hoito (67.44)
alternative label: Riistalinnut, tarhaus (67.44)
alternative label: Siipikarja, hoito ja sairaudet (67.44)
alternative label: Siipikarjatalous (67.44)
alternative label: Tuppar, fjäderfäskötsel (67.44) @sv
alternative label: Vaktlar, husdjur (67.44) @sv
alternative label: Viiriäiset, kotieläimet (67.44)
broader: Kotieläintalous. Kotieläinten hoito
in scheme: YKL - Yleisten kirjastojen luokitusjärjestelmä
notation: 67.44
preferred label: Poultry husbandry @en
preferred label: Uppfödning av fjäderfä @sv
scope note: Höns, kalkoner, vaktlar, ankor, gäss och andra fåglar som fjäderfä Uppfödning av fjäderfä. Hönshus och hönsgårdar Hit också uppfödning av vildfågel @sv
scope note: Kanat, kalkkunat, viiriäiset, ankat, hanhet ja muut linnut siipikarjana Siipikarjatalous. Kanalat Tähän myös riistalintujen tarhaus

Lemmikkieläinten hoito
type: Concept
References: Talousoikeus
References: Eläinsuojelu
References: ELÄINTIEDE
References: URN:NBN:fi:au:ykl:58.062
References: Eläinlääketiede
type: YKL-luokka
alternative label: Djurhandel, sällskapsdjur (67.45+) @sv
alternative label: Däggdjur, sällskapsdjur (67.45+) @sv
alternative label: Eläinkauppa, lemmikkieläimet (67.45+)
alternative label: Förädling, sällskapsdjur (67.45+) @sv
alternative label: Hemterrarier, sällskapsdjur (67.45+) @sv
alternative label: Husdjur, sällskapsdjur (67.45+) @sv
alternative label: Hyönteiset, lemmikkieläimet (67.45)
alternative label: Insekter, sällskapsdjur (67.45) @sv
alternative label: Jalostus, lemmikkieläimet (67.45+)
alternative label: Kotieläimet, lemmikkieläimet (67.45+)
alternative label: Kotiterraariot, lemmikkieläimet (67.45+)
alternative label: Lemmikkieläimet (67.45+)
alternative label: Lemmikkieläimet, hoito ja sairaudet (67.45+)
alternative label: Lemmikkieläinkauppa (67.45+)
alternative label: Lemmikkieläinlajit ja -rodut (67.45+)
alternative label: Nisäkkäät, lemmikkieläimet (67.45+)
alternative label: Sällskapsdjur (67.45+) @sv
alternative label: Sällskapsdjur, arter och raser (67.45+) @sv
alternative label: Sällskapsdjur, handel (67.45+) @sv
alternative label: Sällskapsdjur, skötsel och sjukdomar (67.45+) @sv
alternative label: Terraariot, lemmikkieläimet (67.45+)
alternative label: Terrarier, sällskapsdjur (67.45+) @sv
broader: Kotieläintalous. Kotieläinten hoito
in scheme: YKL - Yleisten kirjastojen luokitusjärjestelmä
narrower: Koirat
narrower: Kissat
narrower: Häkkilinnut
narrower: Akvaariot
narrower: Pikkunisäkkäät
narrower: Matelijat. Sammakkoeläimet
notation: 67.45
preferred label: Pet care @en
preferred label: Sällskapsdjur @sv
scope note: Hit och till underklasserna sällskapsdjur, skötsel av dem och redskap därtill, sjukdomar hos sällskapsdjur och behandling av dem samt avel av och handel med sällskapsdjur Hit hemterrarier i allmänhet Om verket behandlar både skötsel av sällskapsdjur och zoologi, ges företräde åt klass 67.45+ @sv
scope note: Tähän ja alaluokkiin lemmikkieläimet, lemmikkieläinten hoito ja hoitovälineet, lemmikkieläinten sairaudet ja niiden hoito sekä lemmikkieläinten jalostus ja kauppa Tähän kotiterraariot yleensä Jos teoksessa on sekä lemmikkieläinten hoitoa että eläintiedettä, annetaan etusija luokalle 67.45+

Koirat
type: Concept
References: Nisäkkäät
References: Julkiset huvit
type: YKL-luokka
alternative label: Agility, hundar (67.451) @sv
alternative label: Agility, koirat (67.451)
alternative label: Draghundar (67.451) @sv
alternative label: Hundar, husdjur (67.451) @sv
alternative label: Hundar, skolning och beteende (67.451) @sv
alternative label: Hundar, skötsel och sjukdomar (67.451) @sv
alternative label: Hundparker (67.451) @sv
alternative label: Hundraser (67.451) @sv
alternative label: Hundsport (67.451) @sv
alternative label: Huumekoirat (67.451)
alternative label: Jakthundar (67.451) @sv
alternative label: Kenneltoiminta (67.451)
alternative label: Kennelverksamhet (67.451) @sv
alternative label: Koirapuistot (67.451)
alternative label: Koirarodut (67.451)
alternative label: Koirat, hoito ja sairaudet (67.451)
alternative label: Koirat, kotieläimet (67.451)
alternative label: Koirat, koulutus ja käyttäytyminen (67.451)
alternative label: Koiraurheilu (67.451)
alternative label: Ledarhundar (67.451) @sv
alternative label: Lukukoirat (67.451)
alternative label: Läshundar (67.451) @sv
alternative label: Metsästyskoirat (67.451)
alternative label: Narkotikahundar (67.451) @sv
alternative label: Opaskoirat (67.451)
alternative label: Paimenkoirat (67.451)
alternative label: Palveluskoirat (67.451)
alternative label: Poliisikoirat (67.451)
alternative label: Polishundar (67.451) @sv
alternative label: Rauniokoirat (67.451)
alternative label: Räddningshundar (67.451) @sv
alternative label: Seurakoirat (67.451)
alternative label: Sällskapshundar (67.451) @sv
alternative label: Tjänstehundar (67.451) @sv
alternative label: Vallhundar (67.451) @sv
alternative label: Vetokoirat (67.451)
broader: Lemmikkieläinten hoito
in scheme: YKL - Yleisten kirjastojen luokitusjärjestelmä
notation: 67.451
preferred label: Dogs @en
preferred label: Hundar @sv
scope note: Hundar i allmänhet. Hundraser Sällskaps- och brukshundar samt deras skötsel Jakthundar. Vallhundar. Ledarhundar. Draghundar. Polishundar. Narkotikahundar. Räddningshundar Kennelverksamhet. Uppfödning av och handel med hundar Hundens beteende. Skolning av hunden. Agility Hundsjukdomar och behandling av dem Hundutställningar 67.451063 @sv
scope note: Koirat yleensä. Koirarodut Seura- ja palveluskoirat ja niiden hoito Metsästyskoirat. Paimenkoirat. Opaskoirat. Vetokoirat. Poliisikoirat. Huumekoirat. Rauniokoirat Kenneltoiminta. Koirien kasvatus ja kauppa Koiran käyttäytyminen. Koiran koulutus. Agility Koiran sairaudet ja niiden hoito Koiranäyttelyt 67.451063

Kissat
type: Concept
References: Nisäkkäät
type: YKL-luokka
alternative label: Katter, beteende (67.452) @sv
alternative label: Katter, husdjur (67.452) @sv
alternative label: Katter, vård och sjukdomar (67.452) @sv
alternative label: Kattraser (67.452) @sv
alternative label: Kissarodut (67.452)
alternative label: Kissat, hoito ja sairaudet (67.452)
alternative label: Kissat, kotieläimet (67.452)
alternative label: Kissat, käyttäytyminen (67.452)
broader: Lemmikkieläinten hoito
in scheme: YKL - Yleisten kirjastojen luokitusjärjestelmä
notation: 67.452
preferred label: Cats @en
preferred label: Katter @sv
scope note: Katter i allmänhet. Kattraser Skötsel av katter. Kattens beteende Sjukdomar hos katten och behandling av dem Kattutställningar 67.452063 @sv
scope note: Kissat yleensä. Kissarodut Kissan hoito. Kissan käyttäytyminen Kissan sairaudet ja niiden hoito Kissanäyttelyt 67.452063

Häkkilinnut
type: Concept
References: Linnut
References: Siipikarjan hoito
References: Metsästys
References: Julkiset huvit
type: YKL-luokka
alternative label: Burfåglar (67.453) @sv
alternative label: Burfåglar, arter och raser (67.453) @sv
alternative label: Burfåglar, vård och sjukdomar (67.453) @sv
alternative label: Duvor, sällskapsdjur (67.453) @sv
alternative label: Duvsport (67.453) @sv
alternative label: Fågelburar (67.453) @sv
alternative label: Fåglar, burfåglar (67.453) @sv
alternative label: Häkkilinnut (67.453)
alternative label: Häkkilinnut, hoito ja sairaudet (67.453)
alternative label: Häkkilintulajit ja -rodut (67.453)
alternative label: Kanarialinnut, häkkilinnut (67.453)
alternative label: Kanariefåglar, burfåglar (67.453) @sv
alternative label: Kyyhkysurheilu (67.453)
alternative label: Kyyhkyt, lemmikkieläimet (67.453)
alternative label: Linnut, häkkilinnut (67.453)
alternative label: Lintuhäkit (67.453)
alternative label: Papegojor, burfåglar (67.453) @sv
alternative label: Papukaijat, häkkilinnut (67.453)
alternative label: Undulaatit, häkkilinnut (67.453)
alternative label: Undulater, burfåglar (67.453) @sv
broader: Lemmikkieläinten hoito
in scheme: YKL - Yleisten kirjastojen luokitusjärjestelmä
notation: 67.453
preferred label: Burfåglar @sv
preferred label: Cage birds @en
scope note: Burfågelarter och burfågelraser Skötsel av burfåglar och redskap därtill Fågelburar Sjukdomar hos burfåglar och behandling av dem @sv
scope note: Häkkilintulajit ja -rodut Häkkilintujen hoito ja hoitovälineet Lintuhäkit Häkkilintujen sairaudet ja niiden hoito

Akvaariot
type: Concept
References: URN:NBN:fi:au:ykl:58.062
References: Kalat
References: Kalastus
type: YKL-luokka
alternative label: Akvaariokalat (67.454)
alternative label: Akvaariokasvit (67.454)
alternative label: Akvaarioliikkeet (67.454)
alternative label: Akvaariot, hoito ja sisustus (67.454)
alternative label: Akvaariot, lemmikkieläimet (67.454)
alternative label: Akvarieaffärer (67.454) @sv
alternative label: Akvariefiskar (67.454) @sv
alternative label: Akvarier, skötsel och inredning (67.454) @sv
alternative label: Akvarier, sällskapsdjur (67.454) @sv
alternative label: Akvarieväxter (67.454) @sv
alternative label: Hemakvarier (67.454) @sv
alternative label: Kotiakvaariot (67.454)
alternative label: Saltvattensakvarier, akvarier för hemmabruk (67.454) @sv
alternative label: Suolavesiakvaariot, kotiakvaariot (67.454)
broader: Lemmikkieläinten hoito
in scheme: YKL - Yleisten kirjastojen luokitusjärjestelmä
notation: 67.454
preferred label: Akvarier @sv
preferred label: Aquaria @en
scope note: Hit akvarier för hemmabruk, skötsel av dem och tillbehör för skötseln Sötvattensakvarier. Saltvattensakvarier Akvariefiskar samt avel av och handel med dem Övriga akvariedjur Akvariets inredning. Akvarieväxter Sjukdomar hos akvariefiskar och behandling av dem @sv
scope note: Tähän kotiakvaariot sekä niiden hoito ja hoitovälineet Makeavesiakvaariot. Suolavesiakvaariot Akvaariokalat sekä niiden jalostus ja kauppa Muut akvaariossa pidettävät eläimet Akvaarion sisustus. Akvaariokasvit Akvaariokalojen sairaudet ja niiden hoito

Pikkunisäkkäät
type: Concept
References: Nisäkkäät
References: Turkistarhaus
type: YKL-luokka
alternative label: Aavikkorotat, lemmikkieläimet (67.455)
alternative label: Chinchilla, sällskapsdjur (67.455) @sv
alternative label: Chinchillat, lemmikkieläimet (67.455)
alternative label: Fretit, lemmikkieläimet (67.455)
alternative label: Fretter, sällskapsdjur (67.455) @sv
alternative label: Gerbiilit, lemmikkieläimet (67.455)
alternative label: Gerbiler, sällskapsdjur (67.455) @sv
alternative label: Gnagare, sällskapsdjur (67.455) @sv
alternative label: Hamsterit, lemmikkieläimet (67.455)
alternative label: Hamstrar, sällskapsdjur (67.455) @sv
alternative label: Harmöss, sällskapsdjur (67.455) @sv
alternative label: Hiiret, lemmikkieläimet (67.455)
alternative label: Jyrsijät, lemmikkieläimet (67.455)
alternative label: Kaniner, sällskapsdjur (67.455) @sv
alternative label: Kanit, lemmikkieläimet (67.455)
alternative label: Marsut, lemmikkieläimet (67.455)
alternative label: Marsvin, sällskapsdjur (67.455) @sv
alternative label: Möss, sällskapsdjur (67.455) @sv
alternative label: Pikkujyrsijät, lemmikkieläimet (67.455)
alternative label: Pikkunisäkkäät, lemmikkieläimet (67.455)
alternative label: Rotat, lemmikkieläimet (67.455)
alternative label: Råttor, sällskapsdjur (67.455) @sv
alternative label: Sinsillat, lemmikkieläimet (67.455)
alternative label: Små däggdjur, sällskapsdjur (67.455) @sv
alternative label: Smågnagare, sällskapsdjur (67.455) @sv
alternative label: Ökenråttor, sällskapsdjur (67.455) @sv
broader: Lemmikkieläinten hoito
in scheme: YKL - Yleisten kirjastojen luokitusjärjestelmä
notation: 67.455
preferred label: Small mammals @en
preferred label: Små däggdjur @sv
scope note: Marsut, hamsterit, rotat, aavikkorotat, hiiret, kanit, fretit sekä muut pikkunisäkkäät ja jyrsijät lemmikkieläiminä Pikkunisäkkäiden sairaudet ja niiden hoito
scope note: Marsvin, hamstrar, råttor, ökenråttor, möss, kaniner, fretter samt andra små däggdjur och gnagare som sällskapsdjur Sjukdomar hos små däggdjur och behandling av dem @sv

Matelijat. Sammakkoeläimet
type: Concept
References: Matelijat. Sammakkoeläimet
type: YKL-luokka
alternative label: Groddjur, sällskapsdjur (67.456) @sv
alternative label: Grodor, sällskapsdjur (67.456) @sv
alternative label: Kilpikonnat, lemmikkieläimet (67.456)
alternative label: Krokodiler, sällskapsdjur (67.456) @sv
alternative label: Krokotiilit, lemmikkieläimet (67.456)
alternative label: Käärmeet, lemmikkieläimet (67.456)
alternative label: Liskot, lemmikkieläimet (67.456)
alternative label: Matelijat, lemmikkieläimet (67.456)
alternative label: Ormar, sällskapsdjur (67.456) @sv
alternative label: Reptiler, sällskapsdjur (67.456) @sv
alternative label: Salamandrar, sällskapsdjur (67.456) @sv
alternative label: Salamanterit, lemmikkieläimet (67.456)
alternative label: Sammakkoeläimet, lemmikkieläimet (67.456)
alternative label: Sammakot, lemmikkieläimet (67.456)
alternative label: Sköldpaddor, sällskapsdjur (67.456) @sv
alternative label: Ödlor, sällskapsdjur (67.456) @sv
broader: Lemmikkieläinten hoito
in scheme: YKL - Yleisten kirjastojen luokitusjärjestelmä
notation: 67.456
preferred label: Kräldjur. Groddjur @sv
preferred label: Reptiles. Amphibians @en
scope note: Liskot, käärmeet, kilpikonnat, krokotiilit, sammakot ja salamanterit lemmikkieläiminä Matelijoiden ja sammakkoeläinten sairaudet ja niiden hoito
scope note: Ödlor, ormar, sköldpaddor, krokodiler, grodor och salamandrar som sällskapsdjur Sjukdomar hos reptiler och groddjur samt behandling av dem @sv

Poronhoito
type: Concept
References: Nisäkkäät
type: YKL-luokka
alternative label: Paliskunnat (67.46)
alternative label: Poroaidat (67.46)
alternative label: Poroelinkeino (67.46)
alternative label: Poroerotus (67.46)
alternative label: Porokilpailut (67.46)
alternative label: Poronhoito (67.46)
alternative label: Porot, hoito ja sairaudet (67.46)
alternative label: Porot, laitumet (67.46)
alternative label: Porotalous (67.46)
alternative label: Renar, betesmarker (67.46) @sv
alternative label: Renar, skötsel och sjukdomar (67.46) @sv
alternative label: Renavel (67.46) @sv
alternative label: Renbeteslag (67.46) @sv
alternative label: Rengärden (67.46) @sv
alternative label: Renkapplöpningar (67.46) @sv
alternative label: Rennäring (67.46) @sv
alternative label: Renskiljning (67.46) @sv
alternative label: Renskötsel (67.46) @sv
broader: Kotieläintalous. Kotieläinten hoito
in scheme: YKL - Yleisten kirjastojen luokitusjärjestelmä
notation: 67.46
preferred label: Reindeer husbandry @en
preferred label: Renskötsel @sv
scope note: Poroelinkeino. Porotalous Porojen laitumet. Paliskunnat Porojen sairaudet ja niiden hoito
scope note: Rennäring. Renhushållning Betesmarker för renar. Renbeteslag Sjukdomar hos renar och behandling av dem @sv

Mehiläisten hoito. Hyönteisten kasvatus
type: Concept
References: Hyönteiset
type: YKL-luokka
alternative label: Bigårdar (67.47) @sv
alternative label: Bin, biskötsel (67.47) @sv
alternative label: Biodling (67.47) @sv
alternative label: Biskötsel (67.47) @sv
alternative label: Honung, biodling (67.47) @sv
alternative label: Hunaja, mehiläisten hoito (67.47)
alternative label: Hyönteiset, kasvatus (67.47)
alternative label: Insekter, uppfödning (67.47) @sv
alternative label: Mehiläiset, mehiläisten hoito (67.47)
alternative label: Mehiläistalous (67.47)
alternative label: Mehiläistarhat (67.47)
alternative label: Mehiläistenhoito (67.47)
alternative label: Silkesfjärilens larver, skötsel (67.47) @sv
alternative label: Silkkiperhosen toukat, hoito (67.47)
broader: Kotieläintalous. Kotieläinten hoito
in scheme: YKL - Yleisten kirjastojen luokitusjärjestelmä
notation: 67.47
preferred label: Beekeeping. Insect breeding @en
preferred label: Biodling. Upfödning av insekter @sv
scope note: Biodling. Bigårdar Bikupor och bisamhällen ur biodlingens synvinkel Hit också silkesmaskens larver och andra insekter som husdjur @sv
scope note: Mehiläistalous. Mehiläistarhat Mehiläispesät ja -yhdyskunnat mehiläistenhoidon kannalta Tähän myös silkkiperhosten toukkien ja muiden hyönteisten pito kotieläiminä

Turkistarhaus
type: Concept
References: Eläinsuojelu
References: Nisäkkäät
References: Nahka- ja jalkineteollisuus
References: Nahkatyö
References: Metsästys
type: YKL-luokka
alternative label: Chinchilla, pälsdjur (67.48) @sv
alternative label: Chinchillat, turkiseläimet (67.48)
alternative label: Däggdjur, pälsdjursuppfödning (67.48) @sv
alternative label: Harmöss, pälsdjur (67.48) @sv
alternative label: Kaniner, pälsdjursuppfödning (67.48) @sv
alternative label: Kanit, turkistarhaus (67.48)
alternative label: Ketut, turkistarhaus (67.48)
alternative label: Minkar, pälsdjursuppfödning (67.48) @sv
alternative label: Minkit, turkistarhaus (67.48)
alternative label: Mårddjur, pälsdjursuppfödning (67.48) @sv
alternative label: Nisäkkäät, turkistarhaus (67.48)
alternative label: Näätäeläimet, turkistarhaus (67.48)
alternative label: Pälsdjur, pälsdjursuppfödning (67.48) @sv
alternative label: Pälsdjur, skötsel och sjukdomar (67.48) @sv
alternative label: Pälsdjursarter och -raser (67.48) @sv
alternative label: Pälsdjursuppfödning (67.48) @sv
alternative label: Rävar, pälsdjursuppfödning (67.48) @sv
alternative label: Sinsillat, turkiseläimet (67.48)
alternative label: Turkiseläimet, hoito ja sairaudet (67.48)
alternative label: Turkiseläimet, turkistarhaus (67.48)
alternative label: Turkiseläinlajit ja -rodut (67.48)
alternative label: Turkistarhaus (67.48)
broader: Kotieläintalous. Kotieläinten hoito
in scheme: YKL - Yleisten kirjastojen luokitusjärjestelmä
notation: 67.48
preferred label: Fur farming @en
preferred label: Pälsdjursuppfödning @sv
scope note: Pälsdjur samt skötsel och uppfödning av dem Pälsdjurshushållning. Pälsdjursfarmer Rävar, minkar, kaniner och andra däggdjur som pälsdjur Pälsdjursraser och pälsdjursavel Sjukdomar hos pälsdjur och behandling av dem @sv
scope note: Turkiseläimet sekä niiden hoito ja kasvatus Turkistalous. Turkistarhat Ketut, minkit, kanit ja muut nisäkkäät turkiseläiminä Turkiseläinrodut ja -jalostus Turkiseläinten sairaudet ja niiden hoito

Eläinlääketiede
type: Concept
References: Talousoikeus
References: Eläinsuojelu
References: ELÄINTIEDE
References: URN:NBN:fi:au:ykl:58.062
References: URN:NBN:fi:au:ykl:59.101
References: Elimet. Taudit
References: Lemmikkieläinten hoito
type: YKL-luokka
alternative label: Bristsjukdomar, veterinärmedicin (67.49) @sv
alternative label: Djur, mediciner (67.49) @sv
alternative label: Djur, sjukdomar, veterinärmedicin (67.49) @sv
alternative label: Djurmediciner (67.49) @sv
alternative label: Djurparker, djurskötsel (67.49) @sv
alternative label: Djursjukdomar, veterinärmedicin (67.49) @sv
alternative label: Djurskötarens arbete (67.49) @sv
alternative label: Doping, eläinlääketiede (67.49)
alternative label: Dopning, veterinärmedicin (67.49) @sv
alternative label: Eläimet, lääkkeet (67.49)
alternative label: Eläimet, sairaudet, eläinlääketiede (67.49)
alternative label: Eläinhoitajan työ (67.49)
alternative label: Eläinlääketiede (67.49)
alternative label: Eläinlääkkeet (67.49)
alternative label: Eläinlääkärin työ (67.49)
alternative label: Eläintarhat, eläinten hoito (67.49)
alternative label: Eläintaudit, eläinlääketiede (67.49)
alternative label: Eläinten lääkkeet (67.49)
alternative label: Försöksdjur, skötsel (67.49) @sv
alternative label: Karanteeni, eläinlääketiede (67.49)
alternative label: Karantän, veterinärmedicin (67.49) @sv
alternative label: Koe-eläimet, hoito (67.49)
alternative label: Loiset, eläinlääketiede (67.49)
alternative label: Lääkkeet, eläimet (67.49)
alternative label: Mediciner för djur (67.49) @sv
alternative label: Mediciner, djur (67.49) @sv
alternative label: Parasiter, veterinärmedicin (67.49) @sv
alternative label: Parasitologi, veterinärmedicin (67.49) @sv
alternative label: Parasitologia, eläinlääketiede (67.49)
alternative label: Puutostaudit, eläinlääketiede (67.49)
alternative label: Sairaudet, eläinlääketiede (67.49)
alternative label: Sjukdomar, veterinärmedicin (67.49) @sv
alternative label: Taudit, eläinlääketiede (67.49)
alternative label: Veterinärens arbete (67.49) @sv
alternative label: Veterinärmedicin (67.49) @sv
alternative label: Vilda djur, veterinärmedicin (67.49) @sv
alternative label: Villieläimet, eläinlääketiede (67.49)
alternative label: Zoonoosit, eläinlääketiede (67.49)
alternative label: Zoonoser, veterinärmedicin (67.49) @sv
broader: Kotieläintalous. Kotieläinten hoito
in scheme: YKL - Yleisten kirjastojen luokitusjärjestelmä
notation: 67.49
preferred label: Veterinary medicine @en
preferred label: Veterinärmedicin @sv
scope note: Hit allmänna verk om veterinärmedicin Veterinärens och djurskötarens arbete i allmänhet Djurmediciner i allmänhet Skötsel av försöksdjur. Skötsel av djur i zoologiska trädgårdar Sjukdomar hos husdjur och behandling av dem Hit också behandling av sjukdomar hos vilda djur samt bekämpning av sjukdomar som smittar från djur till människa Sjukdomar hos ett visst djur eller en viss grupp av djur förs till respektive djurs eller djurgrupps klass @sv
scope note: Tähän eläinlääketieteen yleisteokset Eläinlääkärin ja eläinhoitajan työ yleensä Eläinlääkkeet yleensä Koe-eläinten hoito. Eläintarhaeläinten hoito Kotieläinten sairaudet ja niiden hoito Tähän myös villieläinten sairauksien hoito sekä eläimistä ihmiseen tarttuvien tautien torjunta Tietyn eläimen tai eläinryhmän sairaudet ja niiden hoito luokitetaan ko. eläimen tai eläinryhmän luokkaan

Metsätalous
type: Concept
References: Maa- ja metsätalouslainsäädäntö
References: Ympäristönsuojelu. Luonnonsuojelu
References: Ekologia. Eliömaantiede
References: Puut. Pensaat
References: Kasviekologia. Kasvimaantiede
References: Puunjalostusteollisuus
type: YKL-luokka
alternative label: Ekonomiskogar, skogsbruk (67.5+) @sv
alternative label: Metsänomistus (67.5)
alternative label: Metsäpolitiikka (67.5)
alternative label: Metsäpuut, metsätalous (67.5+)
alternative label: Metsät (67.5)
alternative label: Metsät, talouskäyttö (67.5+)
alternative label: Metsätalous (67.5+)
alternative label: Metsätalous, liiketalous (67.5)
alternative label: Metsätalous, organisaatio ja rationalisointi (67.5)
alternative label: Metsätalous, tukitoimet (67.5)
alternative label: Metsätalouspolitiikka (67.5)
alternative label: Metsätaloustuotanto (67.5)
alternative label: Metsätaloustuotteet (67.5)
alternative label: Metsätiede (67.5+)
alternative label: Puu, metsätalous (67.5+)
alternative label: Skogar (67.5) @sv
alternative label: Skogar, ekonomiskt utnyttjande (67.5+) @sv
alternative label: Skogsbruk (67.5+) @sv
alternative label: Skogsbruk, företagsekonomi (67.5) @sv
alternative label: Skogsbruk, organisation och rationalisering (67.5) @sv
alternative label: Skogsbruk, stödåtgärder (67.5) @sv
alternative label: Skogsbrukspolitik (67.5) @sv
alternative label: Skogsbruksprodukter (67.5) @sv
alternative label: Skogsbruksproduktion (67.5) @sv
alternative label: Skogspolitik (67.5) @sv
alternative label: Skogsträd, skogsbruk (67.5+) @sv
alternative label: Skogsvetenskap (67.5+) @sv
alternative label: Skogsägande (67.5) @sv
alternative label: Talousmetsät, metsätalous (67.5+)
alternative label: Träd, skogsbruk (67.5+) @sv
broader: MAA- JA METSÄTALOUS. ELINTARVIKETEOLLISUUS. BIOTEKNIIKKA
in scheme: YKL - Yleisten kirjastojen luokitusjärjestelmä
narrower: Metsänhoito
narrower: Puunkorjuu. Puukauppa. Metsänarviointi
narrower: Metsien monikäyttö
notation: 67.5
preferred label: Forestry @en
preferred label: Skogsbruk @sv
scope note: Hit allmänna verk om skogsbruk Skogspolitik. Skogsinnehav Skogsbrukets ekonomi, företagsekonomi och organisation samt stödåtgärder för skogsbruk Rationalisering av skogsbruk. Skogsbruksproduktion och -produkter Hit också allmänna verk som handlar om skogen ur naturskyddets, biologins och skogsbrukets synvinkel @sv
scope note: Tähän metsätalouden yleisteokset Metsätalouspolitiikka. Metsänomistusolot Metsätalouden taloustiede, liiketalous, organisaatio, tukitoimet, rationalisointi, tuotanto ja tuotteet Tähän myös yleisteokset, jotka koskevat metsää sekä luonnonsuojelun, biologian että metsätalouden kannalta

Metsänhoito
type: Concept
References: Ympäristönsuojelu. Luonnonsuojelu
References: Ekologia. Eliömaantiede
References: Puut. Pensaat
References: Kasviekologia. Kasvimaantiede
References: Puunkorjuu. Puukauppa. Metsänarviointi
References: Metsien monikäyttö
alternative label: Avohakkuu, metsänhoito (67.51)
alternative label: Barrträd, skogsvård (67.51) @sv
alternative label: Biologinen torjunta, metsätuholaisten torjunta (67.51)
alternative label: Biologisk bekämpning, skogsskadeinsekter (67.51) @sv
alternative label: Dikning, skogsvård (67.51) @sv
alternative label: Forstmästarens arbete (67.51) @sv
alternative label: Fröbanker, skogsskötsel (67.51+) @sv
alternative label: Fröträd, skogsvård (67.51) @sv
alternative label: Försumpning, skogsvård (67.51) @sv
alternative label: Förädling, skogsträd (67.51) @sv
alternative label: Gallring, skogsvård (67.51) @sv
alternative label: Gödsling, skogsvård (67.51) @sv
alternative label: Hakkuut, metsänhoito (67.51)
alternative label: Harvennus, metsänhoito (67.51)
alternative label: Havupuut, metsänhoito (67.51)
alternative label: Huggningar, skogsvård (67.51) @sv
alternative label: Hyggesbränning, skogsvård (67.51) @sv
alternative label: Hyönteismyrkyt, metsänhoito (67.51)
alternative label: Insektgifter, skogsvård (67.51) @sv
alternative label: Istutus, metsänhoito (67.51)
alternative label: Jalostus, metsäpuut (67.51)
alternative label: Jordmån, skogsvård (67.51) @sv
alternative label: Kalhuggning, skogsvård (67.51) @sv
alternative label: Kemiallinen torjunta, metsätuholaisten torjunta (67.51)
alternative label: Kemisk bekämpning, bekämpning av skogsskadeinsekter (67.51) @sv
alternative label: Kloning, skogsträdsförädling (67.51) @sv
alternative label: Kloonaus, metsäpuiden jalostus (67.51)
alternative label: Korsning, skogsträd (67.51) @sv
alternative label: Kuivatus, suot (67.51)
alternative label: Kulotus, metsänhoito (67.51)
alternative label: Kylvö, metsänhoito (67.51)
alternative label: Kärr, dikning (67.51) @sv
alternative label: Lannoitus, metsänhoito (67.51)
alternative label: Lehtipuut, metsänhoito (67.51)
alternative label: Luontainen uudistaminen, metsänhoito (67.51)
alternative label: Maaperä, metsänhoito (67.51)
alternative label: Metsien suojelu, tuholaisten ja tautien torjunta (67.51)
alternative label: Metsiensuojelu, tuholaisten ja tautien torjunta (67.51)
alternative label: Metsänhoitajan työ (67.51)
alternative label: Metsänhoito (67.51)
alternative label: Metsänistutus (67.51)
alternative label: Metsänjalostus (67.51)
alternative label: Metsänkasvatus (67.51)
alternative label: Metsänlannoitus (67.51)
alternative label: Metsänsuojelu, tuholaisten ja tautien torjunta (67.51)
alternative label: Metsänuudistus (67.51)
alternative label: Metsäpalot, metsänhoito (67.51)
alternative label: Metsät, maanmuokkaus ja -raivaus (67.51)
alternative label: Metsät, perustaminen (67.51)
alternative label: Metsät, tuholaiset ja tuholaistorjunta (67.51)
alternative label: Metsätuhot (67.51)
alternative label: Metsätyypit, metsänhoito (67.51)
alternative label: Ojitus, metsänhoito (67.51)
alternative label: Puulajit, metsänhoito (67.51)
alternative label: Puut, metsänhoito (67.51)
alternative label: Risteytys, metsäpuut (67.51)
alternative label: Rodut, metsänhoito (67.51)
alternative label: Siemenpankit, metsänhoito (67.51+)
alternative label: Siemenpuut, metsänhoito (67.51)
alternative label: Soiden ojitus, metsänhoito (67.51)
alternative label: Soistuminen, metsänhoito (67.51)
alternative label: Suojametsät, metsänhoito (67.51)
alternative label: Suot, metsänhoito (67.51)
alternative label: Suot, ojitus (67.51)
alternative label: Suotyypit, metsänhoito (67.51)
alternative label: Taimikon hoito, metsänhoito (67.51)
alternative label: Tuholaistorjunta, metsänhoito (67.51)
alternative label: Vesakontorjunta, metsänhoito (67.51)
broader: Metsätalous
in scheme: YKL - Yleisten kirjastojen luokitusjärjestelmä
notation: 67.51
scope note: Kasvupaikkojen luokittelu, metsä- ja suotyypit sekä puulajit metsänhoidon kannalta Metsikön perustaminen, kasvatus ja uudistaminen Taimikon hoito ja harventaminen. Vesakontorjunta Luontainen uudistaminen. Metsänviljely Metsämaan muokkaus ja raivaus. Kulotus Metsän kylvö ja istutus. Siemenpuut. Metsänjalostus Metsän ojitus ja lannoitus. Suometsien hoito Metsätuhot, metsän tuholaiset ja metsäpuiden taudit sekä niiden biologinen ja kemiallinen torjunta
scope note: Klassificering av växtplatser, skogs- och myrtyper samt trädarter ur skogsvårdens synvinkel Anläggning, odling och föryngring av skogsbestånd Skötsel och gallring av skogsbeståndet. Slybekämpning Naturlig förnyelse. Skogsodling Beredning och röjning av skogsmark. Hyggesbränning Sådd och plantering av skog. Fröträd. Skogsförädling Dikning och gödsling av skog. Skötsel av våtmarksskogar Skogsskador, skadedjur och sjukdomar hos träd samt biologisk och kemisk bekämpning av dem @sv

Puunkorjuu. Puukauppa. Metsänarviointi
type: Concept
References: Orgaaniset ja fossiiliset polttoaineet
References: Metsänhoito
type: YKL-luokka
alternative label: Aisaus (67.52)
alternative label: Avohakkuu, metsurin työ (67.52)
alternative label: Drivning, skogsbruk (67.52) @sv
alternative label: Flottningsteknik (67.52) @sv
alternative label: Hakkuu, metsurin työ (67.52)
alternative label: Halonhakkuu (67.52)
alternative label: Huggning, skogsarbetarens arbete (67.52) @sv
alternative label: Kalhuggning, skogsarbetarens arbete (67.52) @sv
alternative label: Kantohinnat, puukauppa (67.52)
alternative label: Kasvun laskenta, metsäteknologia (67.52)
alternative label: Metsurin työ (67.52)
alternative label: Metsänarviointi (67.52)
alternative label: Metsänhakkuu (67.52)
alternative label: Metsät, mittaus ja arviointi (67.52)
alternative label: Metsätalouskoneet, käyttö (67.52)
alternative label: Metsäteknologia (67.52)
alternative label: Metsätyöt (67.52)
alternative label: Moottorisahat (67.52)
alternative label: Motorsågar (67.52) @sv
alternative label: Puu, arviointi ja mittaus (67.52)
alternative label: Puu, karsinta, katkonta ja halkaisu (67.52)
alternative label: Puu, kuljetus ja varastointi (67.52)
alternative label: Puu, leimaus ja kaato (67.52)
alternative label: Puukauppa (67.52)
alternative label: Puunkorjuu (67.52)
alternative label: Puutavara, arviointi, mittaus ja kauppa (67.52)
alternative label: Randbarkning (67.52) @sv
alternative label: Rotpriser, trähandel (67.52) @sv
alternative label: Skogar, mätning och taxering (67.52) @sv
alternative label: Skogsarbetarens arbete (67.52) @sv
alternative label: Skogsarbeten (67.52) @sv
alternative label: Skogsavverkning (67.52) @sv
alternative label: Skogsbruksmaskiner, användning (67.52) @sv
alternative label: Skogstaxering (67.52) @sv
alternative label: Skogsteknologi (67.52) @sv
alternative label: Tillväxtberäkning, skogsteknologi (67.52) @sv
alternative label: Timmerflottning (67.52) @sv
alternative label: Träd, gallring, kapning och klyvning (67.52) @sv
alternative label: Träd, stämpling och fällning (67.52) @sv
alternative label: Trävara, värdering, mätning och handel (67.52) @sv
alternative label: Trävaruhandel (67.52) @sv
alternative label: Tukinuitto (67.52)
alternative label: Uittotekniikka (67.52)
alternative label: Vedhuggning (67.52) @sv
alternative label: Virke, transport och lagring (67.52) @sv
alternative label: Virke, värdering och mätning (67.52) @sv
broader: Metsätalous
in scheme: YKL - Yleisten kirjastojen luokitusjärjestelmä
notation: 67.52
preferred label: Drivning. Virkeshandel. Skogstaxering @sv
preferred label: Logging. Lumber trade. Forest mensuration @en
scope note: Metsäteknologia. Metsurin työ Puunkorjuumenetelmät sekä puunkorjuuvälineiden ja -koneiden käyttö Puun mittaus. Metsikön mittaus. Kasvun laskenta Puun leimaus, kaato, karsinta, katkonta, halkominen, aisaus ja kasaus Puun varastointi, kuljetus ja uitto
scope note: Skogsteknologi. Skogsarbetarens arbete Metoder för skogsavverkning samt användning av redskap och maskiner för avverkning Mätning av träd. Beräkning av virkesförrådet. Uträkning av tillväxt Stämpling, fällning, gallring, kapning, klyvning, barkning och stapling av virke Lagring, transport och flottning av virke @sv

Metsien monikäyttö
type: Concept
References: Maa- ja vesioikeus
References: Ympäristönsuojelu. Luonnonsuojelu
References: Luonto-oppaat
References: Orgaaniset ja fossiiliset polttoaineet
References: Poronhoito
References: Metsästys. Kalastus
References: Retkeily. Ulkoilu
type: YKL-luokka
alternative label: Ekonomiskogar, mångbruk (67.58+) @sv
alternative label: Metsät, monikäyttö (67.58+)
alternative label: Metsät, virkistyskäyttö (67.58+)
alternative label: Pakuri, kasvatus (67.58)
alternative label: Pakuri, keräily (67.58)
alternative label: Skogar, mångsidigt utnyttjande (67.58+) @sv
alternative label: Skogar, rekreation (67.58+) @sv
alternative label: Sprängticka, odling (67.58) @sv
alternative label: Sprängticka, plockning (67.58) @sv
alternative label: Talousmetsät, monikäyttö (67.58+)
broader: Metsätalous
in scheme: YKL - Yleisten kirjastojen luokitusjärjestelmä
narrower: Marjastus. Luonnonmarjat
narrower: Sienestys
notation: 67.58
preferred label: Multiple-use forestry @en
preferred label: Mångsidigt utnyttjande av skogen @sv
scope note: Metsien ja talousmetsien käyttö muuhun kuin puun tuotantoon. Metsien virkistyskäyttö yleensä. Käävät esim. pakuri luokkaan 67.58
scope note: Utnyttjande av skogar och ekonomiskogar till annat än virkesproduktion. Utnyttjande av skog för rekreation i allmänhet. Tickor, t.ex. sprängticka till klass 67.58 @sv

Marjastus. Luonnonmarjat
type: Concept
References: KASVITIEDE. SIENITIEDE
References: Hedelmä- ja marjakasvit
References: Ruoanvalmistus. Ruokakulttuuri
References: Säilöntä
type: YKL-luokka
alternative label: Artbestämningshandböcker, bärplockning (67.581) @sv
alternative label: Bär, bärplockning (67.581) @sv
alternative label: Bärplockning (67.581) @sv
alternative label: Lajinmääritysoppaat, marjastus (67.581)
alternative label: Luonnonmarjat, kauppa (67.581)
alternative label: Luonnonmarjat, marjastus (67.581)
alternative label: Marjastus (67.581)
alternative label: Marjat, marjastus (67.581)
alternative label: Metsämarjat, marjastus (67.581)
alternative label: Skogsbär, bärplockning (67.581) @sv
alternative label: Vilda bär, bärplockning (67.581) @sv
alternative label: Vilda bär, handel (67.581) @sv
broader: Metsien monikäyttö
in scheme: YKL - Yleisten kirjastojen luokitusjärjestelmä
notation: 67.581
preferred label: Berry picking. Wild berries @en
preferred label: Bärplockning. Vilda bär @sv
scope note: Igenkänning och plockning av vilda bär Handel med vilda bär och deras ekonomiska betydelse Utnyttjande av vilda bär i allmänhet Om verket behandlar både vilda och odlade bär, ges företräde åt klass 67.32 @sv
scope note: Luonnonmarjojen tunnistaminen, keräily, kauppa ja taloudellinen merkitys Luonnonmarjojen hyväksikäyttö yleensä Jos teos koskee sekä luonnonvaraisia että viljeltyjä marjoja, annetaan etusija luokalle 67.32

Sienestys
type: Concept
References: Levät. Jäkälät. Sienet. Sammalet
References: Muut hyötykasvit
References: Säilöntä
References: Kasvisruoat. Sieniruoat
type: YKL-luokka
alternative label: Artbestämningshandböcker, svampplockning (67.582) @sv
alternative label: Giftsvampar, svampplockning (67.582) @sv
alternative label: Handelssvampar (67.582) @sv
alternative label: Kauppasienet (67.582)
alternative label: Käävät (67.582)
alternative label: Lajinmääritysoppaat, sienestys (67.582)
alternative label: Matsvampar, svampplockning (67.582) @sv
alternative label: Myrkkysienet, sienestys (67.582)
alternative label: Ruokasienet, sienestys (67.582)
alternative label: Sienestys (67.582)
alternative label: Sienet (67.582)
alternative label: Sienet, keräily ja tunnistaminen (67.582)
alternative label: Sienikauppa (67.582)
alternative label: Sienineuvonta (67.582)
alternative label: Sienioppaat (67.582)
alternative label: Svampar (67.582) @sv
alternative label: Svampar, samlande och igenkännande (67.582) @sv
alternative label: Svamphandböcker (67.582) @sv
alternative label: Svamphandel (67.582) @sv
alternative label: Svampplockning (67.582) @sv
alternative label: Svamprådgivning (67.582) @sv
alternative label: Tickor (67.582) @sv
broader: Metsien monikäyttö
in scheme: YKL - Yleisten kirjastojen luokitusjärjestelmä
notation: 67.582
preferred label: Mushroom picking @en
preferred label: Svampplockning @sv
scope note: Sienten tunnistaminen, keräily, kauppa ja taloudellinen merkitys Ruoka- ja kauppasienet. Myrkkysienet Sienineuvonta Jos teos koskee sekä sienestystä että sienten viljelyä, annetaan etusija luokalle 67.36 Jos teos koskee sekä sienestystä että sieniruokia, annetaan etusija luokalle 68.22
scope note: Svampkännedom och svampplockning Handel med svampar och svamparnas ekonomiska betydelse Mat- och handelssvampar. Giftsvampar Svamprådgivning Om verket behandlar både svampplockning och svampodling, ges företräde åt klass 67.36 Om verket behandlar både svampplockning och svamprätter, ges företräde åt klass 68.22 @sv

Metsästys. Kalastus
type: Concept
References: Talousoikeus
References: Maa- ja metsätalouslainsäädäntö
References: KANSATIEDE. KULTTUURIANTROPOLOGIA
References: Uhanalaiset lajit. Luonnonsuojelualueet
References: Eläinsuojelu
References: Liha-, lintu- ja kalaruoat
References: Retkeily. Ulkoilu
References: KERTOMAKIRJALLISUUS
type: YKL-luokka
alternative label: Eräkirjallisuus, muistelmat (67.6+)
alternative label: Vildmarkslitteratur, memoarer (67.6+) @sv
broader: MAA- JA METSÄTALOUS. ELINTARVIKETEOLLISUUS. BIOTEKNIIKKA
in scheme: YKL - Yleisten kirjastojen luokitusjärjestelmä
narrower: Metsästys
narrower: Kalastus
notation: 67.6
preferred label: Hunting. Fishing @en
preferred label: Jakt. Fiske @sv
scope note: Hit verk som behandlar både jakt och fiske Om verket innehåller både jakt eller fiske och matrecept, ges företräde åt klass 68.23 @sv
scope note: Tähän teokset, joissa on sekä metsästystä että kalastusta Jos teoksessa on sekä metsästystä tai kalastusta että ruoanvalmistusohjeita, annetaan etusija luokalle 68.23

Metsästys
type: Concept
References: Aseistus. Asevarustelu. Asekauppa
References: Koirat
References: Kalastus
References: Liha-, lintu- ja kalaruoat
type: YKL-luokka
alternative label: Ammattimetsästys (67.61)
alternative label: Ampuma-aseet, metsästys (67.61)
alternative label: Andfåglar, jakt (67.61) @sv
alternative label: Ansapyynti (67.61)
alternative label: Aseet, metsästys (67.61)
alternative label: Däggdjur, jakt (67.61) @sv
alternative label: Falkjakt (67.61) @sv
alternative label: Fredningstider, jakt (67.61) @sv
alternative label: Fågelvilt, jakt (67.61) @sv
alternative label: Fåglar, jakt (67.61) @sv
alternative label: Fångstmedel, jakt (67.61) @sv
alternative label: Fångstmetoder, jakt (67.61) @sv
alternative label: Gevär, jakt (67.61) @sv
alternative label: Hagelgevär, jakt (67.61) @sv
alternative label: Harar, jakt (67.61) @sv
alternative label: Haukkametsästys (67.61)
alternative label: Haulikot, metsästys (67.61)
alternative label: Hirvet, metsästys (67.61)
alternative label: Hönsfåglar, jakt (67.61) @sv
alternative label: Jakt (67.61) @sv
alternative label: Jakt, yrkesmässig (67.61) @sv
alternative label: Jaktfalkar (67.61) @sv
alternative label: Jakthushållning (67.61) @sv
alternative label: Jaktredskap (67.61) @sv
alternative label: Jakttider och -licenser (67.61) @sv
alternative label: Jaktvapen (67.61) @sv
alternative label: Jägarexamen (67.61) @sv
alternative label: Jänikset, metsästys (67.61)
alternative label: Kanalinnut, metsästys (67.61)
alternative label: Kiväärit, metsästys (67.61)
alternative label: Linnut, metsästys (67.61)
alternative label: Metsästys (67.61)
alternative label: Metsästysajat ja -luvat (67.61)
alternative label: Metsästysaseet (67.61)
alternative label: Metsästyshaukat (67.61)
alternative label: Metsästystalous (67.61)
alternative label: Metsästysvälineet (67.61)
alternative label: Metsästäjän tutkinto (67.61)
alternative label: Nisäkkäät, metsästys (67.61)
alternative label: Nöjesjakt (67.61) @sv
alternative label: Pyyntitavat, metsästys (67.61)
alternative label: Pyyntivälineet, metsästys (67.61)
alternative label: Pälsdjur, jakt (67.61) @sv
alternative label: Pälsjakt (67.61) @sv
alternative label: Rauhoitusajat, metsästys (67.61)
alternative label: Riistakannat, metsästys (67.61)
alternative label: Riistalajit, metsästys (67.61)
alternative label: Riistalinnut, metsästys (67.61)
alternative label: Riistanhoito (67.61)
alternative label: Riistatalous (67.61)
alternative label: Skjutvapen, jakt (67.61) @sv
alternative label: Snarfångst (67.61) @sv
alternative label: Sorsalinnut, metsästys (67.61)
alternative label: Turkiseläimet, metsästys (67.61)
alternative label: Turkismetsästys (67.61)
alternative label: Urheilumetsästys (67.61)
alternative label: Vapen, jakt (67.61) @sv
alternative label: Villebrådsarter, jakt (67.61) @sv
alternative label: Villebrådsbestånd, jakt (67.61) @sv
alternative label: Vilthushållning (67.61) @sv
alternative label: Viltvård (67.61) @sv
alternative label: Älgar, jakt (67.61) @sv
broader: Metsästys. Kalastus
in scheme: YKL - Yleisten kirjastojen luokitusjärjestelmä
notation: 67.61
preferred label: Hunting @en
preferred label: Jakt @sv
scope note: Riistatalous. Riistanhoito. Riistalajit Riistakannat. Metsästys- ja rauhoitusajat Metsästysluvat. Metsästäjän tutkinto Metsästys- ja pyyntitavat Metsästysvälineet. Metsästysaseet. Ansapyynti Metsästyksen taloudellinen merkitys Turkismetsästys. Urheilumetsästys Haukkametsästys. Metsästyshaukat Nisäkkäiden, lintujen ja matelijoiden metsästys Jos teoksessa on sekä metsästystä että ruoanvalmistusohjeita, annetaan etusija luokalle 68.23
scope note: Vilthushållning. Viltvård. Villebrådsarter Viltstammar. Jakt- och fridlysningstider Jaktlicenser. Jaktprov Jakt- och fångstmetoder Jaktredskap. Jaktvapen. Fångst med snaror Jaktens ekonomiska betydelse Pälsdjursjakt. Sportjakt Jakt med falkar. Jaktfalkar Jakt på däggdjur, fågel och kräldjur Om verket innehåller både jakt och matrecept, ges företräde åt klass 68.23 @sv

Kalastus
type: Concept
References: Vesiensuojelu
References: Hydrologia
References: Ekologia. Eliömaantiede
References: Kalat
References: Vesikulkuneuvot
References: Liha-, lintu- ja kalaruoat
alternative label: Ammattikalastus (67.62)
alternative label: Beten, fiske (67.62) @sv
alternative label: Fiskar, fiske (67.62) @sv
alternative label: Fiskbestånd, skötsel (67.62) @sv
alternative label: Fiske (67.62) @sv
alternative label: Fiskelicenser och begränsningar av fiske (67.62) @sv
alternative label: Fiskemetoder (67.62) @sv
alternative label: Fiskeredskap (67.62) @sv
alternative label: Fiskeri (67.62) @sv
alternative label: Fiskevattnen, vård (67.62) @sv
alternative label: Fiskodling (67.62) @sv
alternative label: Fisktrappor (67.62) @sv
alternative label: Fiskutplantering (67.62) @sv
alternative label: Fiskvägar (67.62) @sv
alternative label: Flugfiske (67.62) @sv
alternative label: Fredningstider, fiske (67.62) @sv
alternative label: Fritidsfiske (67.62) @sv
alternative label: Fångstmedel, fiske (67.62) @sv
alternative label: Fångstmetoder, fiske (67.62) @sv
alternative label: Havsdjur, fångst (67.62) @sv
alternative label: Havsfiske (67.62) @sv
alternative label: Helmenpyynti (67.62)
alternative label: Hylkeenpyynti (67.62)
alternative label: Inplantering, fiskar och kräftor (67.62) @sv
alternative label: Insjöfiske (67.62) @sv
alternative label: Istutus, kalat ja ravut (67.62)
alternative label: Kalakannat, hoito (67.62)
alternative label: Kalanistutus (67.62)
alternative label: Kalankasvatus (67.62)
alternative label: Kalanpyydykset (67.62)
alternative label: Kalanviljely (67.62)
alternative label: Kalaportaat (67.62)
alternative label: Kalastus (67.62)
alternative label: Kalastusluvat ja -rajoitukset (67.62)
alternative label: Kalastustavat (67.62)
alternative label: Kalastusvälineet (67.62)
alternative label: Kalat, kalastus (67.62)
alternative label: Kalatalous (67.62)
alternative label: Kalatiet (67.62)
alternative label: Kalavedet, hoito (67.62)
alternative label: Katkaravut, pyynti (67.62)
alternative label: Kräftfångst (67.62) @sv
alternative label: Kräfthushållning (67.62) @sv
alternative label: Kräftor, inplantering (67.62) @sv
alternative label: Merieläimet, pyynti (67.62)
alternative label: Merikalastus (67.62)
alternative label: Mete (67.62) @sv
alternative label: Musslor, fångst (67.62) @sv
alternative label: Nät, fiske (67.62) @sv
alternative label: Nöjesfiske (67.62) @sv
alternative label: Onkiminen (67.62)
alternative label: Osterit, pyynti (67.62)
alternative label: Perhokalastus (67.62)
alternative label: Pilkkionginta (67.62)
alternative label: Pyyntitavat, kalastus (67.62)
alternative label: Pyyntivälineet, kalastus (67.62)
alternative label: Raputalous (67.62)
alternative label: Rauhoitusajat, kalastus (67.62)
alternative label: Ravustus (67.62)
alternative label: Ravut, istutus (67.62)
alternative label: Simpukat, pyynti (67.62)
alternative label: Sisävesikalastus (67.62)
alternative label: Troolaus (67.62)
alternative label: Urheilukalastus (67.62)
alternative label: Valaanpyynti (67.62)
alternative label: Vapaa-ajan kalastus (67.62)
alternative label: Verkot, kalastus (67.62)
alternative label: Vieheet, kalastus (67.62)
broader: Metsästys. Kalastus
in scheme: YKL - Yleisten kirjastojen luokitusjärjestelmä
notation: 67.62
scope note: Fiskeri. Vård av fiskstammar och fiskevatten Fiskutplantering. Fiskodling. Fiskodlingsanstalter Fiskelicenser och fiskebegränsningar Fiskemetoder. Fiskeredskap. Fiskebragder. Fisktrappor och fiskvägar och byggande av dem Fiskets ekonomiska betydelse Yrkesfiske. Sportfiske. Fritidsfiske Havsfiske. Insjöfiske Hit också säl- och valfångst Hit också fångst och uppfödning av kräftor, räkor, ostron, snäckor och andra vatten- och havsdjur Om verket behandlar både fiske och matrecept, ges företräde åt klass 68.23 @sv
scope note: Kalatalous. Kalakannan ja kalavesien hoito Kalanistutus. Kalanviljely. Kalanviljelylaitokset Kalastusluvat ja -rajoitukset Kalastustavat. Kalastusvälineet. Kalanpyydykset Kalaportaat ja kalatiet sekä niiden rakentaminen Kalastuksen taloudellinen merkitys Ammattikalastus. Urheilukalastus. Vapaa-ajan kalastus Merikalastus. Sisävesikalastus Tähän myös hylkeen- ja valaanpyynti Tähän myös rapujen, katkarapujen, ostereiden ja simpukoiden sekä muiden vesi- ja merieläinten kasvatus ja pyynti Jos teoksessa on sekä kalastusta että ruoan- valmistusohjeita, annetaan etusija luokalle 68.23

Elintarviketeollisuus
type: Concept
modified: 2026-05-06T13:13:02
References: Elinkeino-oikeus
References: Sosiaalilääketiede. Ympäristölääketiede
References: Ravinto-oppi. Ruokavaliot
References: MAA- JA METSÄTALOUS. ELINTARVIKETEOLLISUUS. BIOTEKNIIKKA
References: Maatalouspolitiikka
References: Maanviljely. Puutarhanhoito. Hyötykasvit
References: Kotieläintalous. Kotieläinten hoito
References: Ruoanvalmistus. Ruokakulttuuri
alternative label: Einesteollisuus (67.7)
alternative label: Elintarvikekauppa (67.7)
alternative label: Elintarvikekemia, elintarviketeollisuus (67.7)
alternative label: Elintarvikemikrobiologia, elintarviketeollisuus (67.7)
alternative label: Elintarvikerasvat, elintarviketeollisuus (67.7)
alternative label: Elintarviketeknologia (67.7)
alternative label: Elintarviketeollisuus (67.7)
alternative label: Elintarviketuotanto, elintarviketeollisuus (67.7+)
alternative label: Elintarvikkeet, laatututkimukset (67.7)
alternative label: Geenitekniikka, elintarviketeollisuus (67.7+)
alternative label: Hedelmät, elintarviketeollisuus (67.7)
alternative label: Hilloaminen, elintarviketeollisuus (67.7)
alternative label: Hunajatuotteet, elintarviketeollisuus (67.7)
alternative label: Iskukuumennus, elintarviketeollisuus (67.7)
alternative label: Juomat, teollinen valmistus (67.7+)
alternative label: Juustot, elintarviketeollisuus (67.7)
alternative label: Jäätelöteollisuus (67.7)
alternative label: Kalakauppa (67.7)
alternative label: Kalanjalostusteollisuus (67.7)
alternative label: Kalat, elintarviketeollisuus (67.7)
alternative label: Kasvistuotteet, elintarviketeollisuus (67.7)
alternative label: Kasviöljyt, elintarviketeollisuus (67.7)
alternative label: Kemia, elintarviketeollisuus (67.7)
alternative label: Konservointi, elintarviketeollisuus (67.7)
alternative label: Ksylitoli, elintarviketeollisuus (67.7)
alternative label: Kylmäsäilytys, elintarviketeollisuus (67.7)
alternative label: Kylmätuotteet, elintarviketeollisuus (67.7)
alternative label: Leipomot (67.7)
alternative label: Leipä, elintarviketeollisuus (67.7)
alternative label: Leivonnaiset, teollinen valmistus (67.7)
alternative label: Lihakauppa (67.7)
alternative label: Lihanjalostusteollisuus (67.7)
alternative label: Lihantuotanto, elintarviketeollisuus (67.7)
alternative label: Lihateknologia (67.7)
alternative label: Lihatuotteet, elintarviketeollisuus (67.7)
alternative label: Lisäaineet, elintarviketeollisuus (67.7)
alternative label: Luomu-tuotteet, luontaistuotekauppa (67.7)
alternative label: Luontaistuotekauppa (67.7)
alternative label: Maidontuotanto, meijerit (67.7)
alternative label: Maito, elintarviketeollisuus (67.7)
alternative label: Maitotuotteet, elintarviketeollisuus (67.7)
alternative label: Makeisteollisuus (67.7)
alternative label: Makeutusaineet, elintarviketeollisuus (67.7)
alternative label: Margariiniteollisuus (67.7)
alternative label: Marjat, elintarviketeollisuus (67.7)
alternative label: Mausteet, elintarviketeollisuus (67.7)
alternative label: Mehut, elintarviketeollisuus (67.7)
alternative label: Meijerit (67.7)
alternative label: Mikrobiologia, elintarviketeollisuus (67.7)
alternative label: Muuntogeeniset elintarvikkeet, elintarviketeollisuus (67.7+)
alternative label: Myllyt, elintarviketeollisuus (67.7)
alternative label: Pakasteet, elintarviketeollisuus (67.7)
alternative label: Pastörointi (67.7)
alternative label: Rasvat, elintarviketeollisuus (67.7)
alternative label: Ruoka-aineteollisuus (67.7)
alternative label: Sitrushedelmät, elintarviketeollisuus (67.7)
alternative label: Sokeri, elintarviketeollisuus (67.7)
alternative label: Suolateollisuus (67.7)
alternative label: Säilykkeet, elintarviketeollisuus (67.7)
alternative label: Säilymiskäsittely, elintarviketeollisuus (67.7)
alternative label: Säilöntäaineet, elintarviketeollisuus (67.7)
alternative label: Säteilytys, elintarviketeollisuus (67.7)
alternative label: Teurastamot (67.7)
alternative label: Teurastus (67.7)
broader: MAA- JA METSÄTALOUS. ELINTARVIKETEOLLISUUS. BIOTEKNIIKKA
in scheme: YKL - Yleisten kirjastojen luokitusjärjestelmä
narrower: Nautintoaineteollisuus
notation: 67.7
scope note: Födoämnes-, färdigmats- och konservindustri Mejerier. Slakterier. Kvarnar. Bagerier Sötsaksindustri. Läskedrycksindustri Spannmåls-, mjölk-, kött-, fisk-, grönsaks-, frukt-, socker-, näringsfett- och växtoljeprodukter ur industriell synvinkel Livsmedelsteknologi. Livsmedelsmikrobiologi Konservering. Tillsatsämnen. Konserveringsmedel. Bestrålning Livsmedelshandel. Naturkosthandel Om verket behandlar både industriell framställning av livsmedel och användning av livsmedel, ges företräde åt klass enligt användning @sv
scope note: Ruoka-aine-, eines- ja säilyketeollisuus Meijerit. Teurastamot. Myllyt. Leipomot Makeisteollisuus. Virvoitusjuomateollisuus Vilja-, maito-, liha-, kala-, kasvis-, hedelmä-, sokeri-, elintarvikerasva- ja kasviöljytuotteet teollisuuden kannalta Elintarviketeknologia. Elintarvikemikrobiologia Säilymiskäsittely. Lisäaineet. Säilöntäaineet. Säteilytys Elintarvikekauppa. Luontaistuotekauppa Jos teos koskee sekä elintarvikkeiden teollista valmistusta että niiden käyttöä, annetaan etusija käytön mukaiselle luokalle

Nautintoaineteollisuus
type: Concept
References: Elinkeino-oikeus
References: Alkoholipolitiikka
References: Tupakointi
References: Alkoholiriippuvuus. Alkoholinkäyttö
References: Juomat
type: YKL-luokka
alternative label: Alkoholbutiker (67.73) @sv
alternative label: Alkoholdrycker, handel och industri (67.73) @sv
alternative label: Alkoholijuomat, kauppa ja teollisuus (67.73)
alternative label: Alkoholiliikkeet (67.73)
alternative label: Alkoholindustri (67.73) @sv
alternative label: Alkoholiteollisuus (67.73)
alternative label: Bryggeriindustri (67.73) @sv
alternative label: Etikkateollisuus (67.73)
alternative label: Gårdsviner, tillverkning och handel (67.73) @sv
alternative label: Hiivateollisuus (67.73)
alternative label: Jäsningsindustri (67.73) @sv
alternative label: Jästindustri (67.73) @sv
alternative label: Kaakao, nautintoaineteollisuus (67.73)
alternative label: Kaffe, njutningsmedelsindustri (67.73) @sv
alternative label: Kafferosterier (67.73) @sv
alternative label: Kahvi, nautintoaineteollisuus (67.73)
alternative label: Kahvipaahtimot (67.73)
alternative label: Kakao, njutningsmedelsindustri (67.73) @sv
alternative label: Ksylitoli, makeisteollisuus (67.73)
alternative label: Käymisteollisuus (67.73)
alternative label: Lisäaineet, nautintoaineteollisuus (67.73)
alternative label: Mallasjuomateollisuus (67.73)
alternative label: Maltdrycksindustri (67.73) @sv
alternative label: Mikrobiologi, bryggeri- och alkoholindustri (67.73) @sv
alternative label: Mikrobiologia, panimo- ja alkoholiteollisuus (67.73)
alternative label: Nautintoaineet, teknologia ja teollisuus (67.73)
alternative label: Njutningsmedel, teknologi och industri (67.73) @sv
alternative label: Oluet, teollinen valmistus (67.73)
alternative label: Panimoteollisuus (67.73)
alternative label: Spritdrycker, alkoholindustri (67.73) @sv
alternative label: Te, njutningsmedelsindustri (67.73) @sv
alternative label: Tee, nautintoaineteollisuus (67.73)
alternative label: Tilaviinit, valmistus ja kauppa (67.73)
alternative label: Tillsatsämnen, njutningsmedelsindustri (67.73) @sv
alternative label: Tobaksindustri (67.73) @sv
alternative label: Tupakkateollisuus (67.73)
alternative label: Viinit, alkoholiteollisuus (67.73)
alternative label: Viner, alkoholindustri (67.73) @sv
alternative label: Väkijuomat, alkoholiteollisuus (67.73)
alternative label: Xylitol, sötsaksindustri (67.73) @sv
alternative label: Xylitoli, makeisteollisuus (67.73)
alternative label: Ättiksindustri (67.73) @sv
alternative label: Öl, industriell framställning (67.73) @sv
broader: Elintarviketeollisuus
in scheme: YKL - Yleisten kirjastojen luokitusjärjestelmä
notation: 67.73
preferred label: Manufacture of stimulants @en
preferred label: Njutningsmedelsindustri @sv
scope note: Alkohol- och bryggeriindustri Kaffe, te, kakao, tobak, jäst, alkohol och alkoholdrycker ur industriell synvinkel Njutningsmedelsteknologi. Handel med njutningsmedel Tillsatsämnen ur njutningsmedelsindustrins synvinkel Om verket behandlar både industriell framställning och användning av njutningsmedel, ges företräde åt klass enligt användning @sv
scope note: Alkoholi-, käymis- ja panimoteollisuus Kahvi, tee, kaakao, tupakka, hiiva, alkoholi ja alkoholijuomat teollisuuden kannalta Nautintoaineteknologia. Nautintoaineiden kauppa Lisäaineet nautintoaineteollisuuden kannalta Jos teos koskee sekä nautintoaineiden teollista valmistusta että niiden käyttöä, annetaan etusija käytön mukaiselle luokalle

Biotekniikka
type: Concept
References: Biokemia. Biofysiikka. Molekyylibiologia
References: Yleinen mikrobiologia
References: Perinnöllisyystiede
References: Elintarviketeollisuus
type: YKL-luokka
alternative label: Biokemi, bioteknik (67.8) @sv
alternative label: Biokemia, biotekniikka (67.8)
alternative label: Biotekniikka (67.8)
alternative label: Bioteknik (67.8) @sv
alternative label: DNA-tekniikka, biotekniikka (67.8)
alternative label: DNA-teknik, bioteknik (67.8) @sv
alternative label: Geenitekniikka, biotekniikka (67.8)
alternative label: Genteknik, bioteknik (67.8) @sv
alternative label: Kloning, bioteknik (67.8) @sv
alternative label: Kloonaus, biotekniikka (67.8)
alternative label: Kudosteknologia, biotekniikka (67.8)
alternative label: Mikrober, bioteknik (67.8) @sv
alternative label: Mikrobiologi, bioteknik (67.8) @sv
alternative label: Mikrobiologia, biotekniikka (67.8)
alternative label: Mikrobit, biotekniikka (67.8)
alternative label: RNA-tekniikka, biotekniikka (67.8)
alternative label: RNA-teknik, bioteknik (67.8) @sv
alternative label: Vävnadsteknik, bioteknik (67.8) @sv
alternative label: biomateriaalit, biotekniikka (67.8)
alternative label: biomaterial, bioteknik (67.8) @sv
broader: MAA- JA METSÄTALOUS. ELINTARVIKETEOLLISUUS. BIOTEKNIIKKA
in scheme: YKL - Yleisten kirjastojen luokitusjärjestelmä
notation: 67.8
preferred label: Biotechnology @en
preferred label: Bioteknik @sv
scope note: Allmänna verk om bioteknik Utnyttjande av biologiska processer, genteknik och mikrobiologi i industrin och inom produktionen i allmänhet Tillämpningar av bioteknik, genteknik och mikrobiologi inom en viss gren av industrin eller produktionen klassificeras enligt område @sv
scope note: Biotekniikan yleisteokset Biologisten prosessien, geenitekniikan ja mikrobiologian hyväksikäyttö teollisuudessa ja tuotannossa yleensä Biotekniikan, geenitekniikan ja mikrobiologian sovellukset tietylle teollisuuden tai tuotannon alalle luokitetaan alan mukaan

KOTITALOUS. LAITOSTALOUS
type: Concept
References: Sosiaalipalvelut
References: Sosiaalilääketiede. Ympäristölääketiede
References: KÄSITYÖ. KOTITEOLLISUUS
References: Talonrakennus
References: Rakennuksen kunnossapito
type: YKL-luokka
alternative label: Ekonomisk planering, privathushåll (68+) @sv
alternative label: Hembiträdets arbete (68+) @sv
alternative label: Hemmets arbeten (68+) @sv
alternative label: Hemmets bokföring (68+) @sv
alternative label: Hemmets ekonomi (68+) @sv
alternative label: Henkilökohtainen taloudenhoito, kodin talous (68)
alternative label: Hushållning (68+) @sv
alternative label: Hushållsarbeten (68+) @sv
alternative label: Hushållshandböcker (68+) @sv
alternative label: Hushållsrådgivning (68+) @sv
alternative label: Kodin kirjanpito (68+)
alternative label: Kodin talous (68+)
alternative label: Kodin työt (68+)
alternative label: Kodinhoito (68+)
alternative label: Kodinhoito-oppaat (68+)
alternative label: Kotiapulaisen työ (68+)
alternative label: Kotitalous (68+)
alternative label: Kotitalousneuvonta (68+)
alternative label: Kotitalousoppaat (68+)
alternative label: Kotitaloustyöt (68+)
alternative label: Laitostalous (68+)
alternative label: Personlig ekonomi, hemmets ekonomi (68) @sv
alternative label: Skötsel av hemmet (68+) @sv
alternative label: Skötsel av hemmet, handböcker (68+) @sv
alternative label: Storhushållsekonomi (68+) @sv
alternative label: Taloussuunnittelu, kotitaloudet (68+)
broader: TEKNIIKKA. TEOLLISUUS. KÄSITYÖ. MAA- JA METSÄTALOUS KOTITALOUS. LIIKETALOUS. LIIKENNE
in scheme: YKL - Yleisten kirjastojen luokitusjärjestelmä
narrower: Ruoanvalmistus. Ruokakulttuuri
narrower: Huonetilojen ja irtaimiston hoito
narrower: Sisustusoppaat
narrower: Hotelli- ja ravintolatalous. Suurkeittiöt. Ateriapalvelut
notation: 68
preferred label: DOMESTIC SCIENCE. INSTITUTIONAL HOUSEKEEPING @en
preferred label: PRIVATHUSHÅLL. STORHUSHÅLL @sv
scope note: Hit allmänna verk om privathushåll och storhushåll. Hit också handböcker och knep om hur man sköter hem och hushåll som behandlar både matlagning och skötsel av hem och lösöre eller heminredning. Hit och till underklasserna arbete i hemmet och hemmets ekonomi, planering, organisering och rationalisering av arbetet i hemmet, ekonomisk planering och bokföring. Hit och till underklasserna också hushållsrådgivning. Till exempel Marthaföreningar 68.06 @sv
scope note: Tähän koti- ja laitostalouden yleisteokset. Tähän myös kotitalous- ja kodinhoito-oppaat sekä kodin niksikirjat, jotka koskevat sekä ruoanvalmistusta että kodin tilojen ja irtaimiston hoitoa tai kodinsisustusta . Tähän ja alaluokkiin kodin työt ja talous, kodin töiden suunnittelu, organisointi ja rationalisointi, kodin taloussuunnittelu ja kirjanpito. Tähän ja alaluokkiin myös kotitalousneuvonta. Esimerkiksi Marttayhdistykset 68.06

Ruoanvalmistus. Ruokakulttuuri
type: Concept
References: KANSATIEDE. KULTTUURIANTROPOLOGIA
References: Ravinto-oppi. Ruokavaliot
References: URN:NBN:fi:au:ykl:59.3408
References: Elimet. Taudit
References: Maanviljely. Puutarhanhoito. Hyötykasvit
References: Kotieläintalous. Kotieläinten hoito
References: Metsien monikäyttö
References: Metsästys. Kalastus
References: Elintarviketeollisuus
References: Hotelli- ja ravintolatalous. Suurkeittiöt. Ateriapalvelut
alternative label: Aromi, gastronomia (68.2+)
alternative label: Ateriat, ruoanvalmistus (68.2+)
alternative label: Elintarvikerasvat, ruoanvalmistus (68.2+)
alternative label: Elintarvikkeet, ruoanvalmistus (68.2+)
alternative label: Eturuoat, ruoanvalmistus (68.2+)
alternative label: Gastronomia (68.2+)
alternative label: Grillaus, ruoanvalmistus (68.2+)
alternative label: Hernekasvit, ruoanvalmistus (68.2+)
alternative label: Jouluruoat, ruoanvalmistus (68.2+)
alternative label: Juurekset, ruoanvalmistus (68.2+)
alternative label: Juustot, ruoanvalmistus (68.2+)
alternative label: Kastikkeet, ruoanvalmistus (68.2+)
alternative label: Kasvikset, ruoanvalmistus (68.2+)
alternative label: Keitot, ruoanvalmistus (68.2+)
alternative label: Keittiömestarin työ (68.2+)
alternative label: Keittokirjat (68.2+)
alternative label: Keittotaito (68.2+)
alternative label: Keittäminen, ruoanvalmistus (68.2+)
alternative label: Kokin työ (68.2+)
alternative label: Lastenruoat, ruuanvalmistus (68.2+)
alternative label: Liedet, ruoanvalmistus (68.2+)
alternative label: Maito, ruoanvalmistus (68.2+)
alternative label: Marjaruoat, ruoanvalmistus (68.2+)
alternative label: Marjat, ruoanvalmistus (68.2+)
alternative label: Maustaminen (68.2+)
alternative label: Mausteet, ruoanvalmistus (68.2+)
alternative label: Mikroaaltouunit, ruoanvalmistus (68.2+)
alternative label: Molekyyligastronomia (68.2+)
alternative label: Mysli (68.2+)
alternative label: Paistaminen, ruoanvalmistus (68.2+)
alternative label: Palkokasvit, ruoanvalmistus (68.2+)
alternative label: Peruna, ruoanvalmistus (68.2+)
alternative label: Puurot (68.2+)
alternative label: Pääruoat, ruoanvalmistus (68.2+)
alternative label: Pääsiäisruoat, ruoanvalmistus (68.2+)
alternative label: Rasvat, ruoanvalmistus (68.2+)
alternative label: Reseptit, ruoanvalmistus (68.2+)
alternative label: Ruoanvalmistusohjeet (68.2+)
alternative label: Ruoka, gastronomia (68.2+)
alternative label: Ruoka-aineet, ruoanvalmistus (68.2+)
alternative label: Ruokailu (68.2+)
alternative label: Ruokakasvatus (68.2+)
alternative label: Ruokakulttuuri (68.2+)
alternative label: Ruokalajit (68.2+)
alternative label: Ruokaohjeet (68.2+)
alternative label: Ruokasienet, ruoanvalmistus (68.2+)
alternative label: Ruokatavarat (68.2+)
alternative label: Ruokavaliot, ruoanvalmistus (68.2+)
alternative label: Ryytikasvit, maustaminen (68.2+)
alternative label: Salaatit, ruoanvalmistus (68.2+)
alternative label: Savustus, ruoanvalmistus (68.2+)
alternative label: Sienet, ruoanvalmistus (68.2+)
alternative label: Sieniruoat (68.2+)
alternative label: Sitrushedelmät, ruokien ja juomien valmistus (68.2+)
alternative label: Sokeri, ruoanvalmistus (68.2+)
alternative label: Suola, ruoanvalmistus (68.2+)
alternative label: Tuoksu, gastronomia (68.2+)
broader: KOTITALOUS. LAITOSTALOUS
in scheme: YKL - Yleisten kirjastojen luokitusjärjestelmä
narrower: Säilöntä
narrower: Kasvisruoat. Sieniruoat
narrower: Liha-, lintu- ja kalaruoat
narrower: Leipominen. Makeiset. Jälkiruoat
narrower: Eri maiden ja alueiden ruokalajit ja ruokakulttuuri
narrower: Tarjoilu
narrower: Juomat
notation: 68.2
scope note: Hit och till underklasserna kokböcker, maträtter, kokkonst och gastronomi, matrecept och matlagningsmetoder samt användning av köksmaskiner vid matlagning Hit och till underklasserna kokböcker resp. födoämne, ingen näringslära Hit och till underklasserna också matvaror och ingredienser ur matlagningens synvinkel Hit och till underklasserna också kryddning av maten samt användning av örter i matlagningen Hit kockens och köksmästarens arbete i allmänhet Om verket förutom matrecept innehåller allmän skildring, odling eller insamling av nyttoväxter, t.ex. bär- eller svampplockning, ges företräde åt klass 68.2+ @sv
scope note: Tähän ja alaluokkiin keittokirjat, ruokalajit, keittotaito ja gastronomia, ruoanvalmistusohjeet ja -menetelmät sekä keittiökoneiden käyttö ruoanvalmistuksessa Tähän ja alaluokkiin keittokirjat ruoka-aineen mukaan, ei ravinto-oppia Tähän ja alaluokkiin myös ruokatavarat ja ruoka-aineet ruoanvalmistuksen kannalta Tähän ja alaluokkiin myös ruoan maustaminen sekä yrttien käyttö ruoanvalmistuksessa Tähän kokin ja keittiömestarin työ yleensä Jos teoksessa on sekä ruoanvalmistusohjeita että hyötykasvien esittelyä, viljelyä tai keräilyä, esim. sienestystä tai marjastusta, annetaan etusija luokalle 68.2+

Säilöntä
type: Concept
References: Paineilmatekniikka. Tyhjötekniikka. Kylmätekniikka
type: YKL-luokka
alternative label: Bär, konservering (68.21) @sv
alternative label: Djupfrysning, hushållning (68.21) @sv
alternative label: Etikkasäilöntä (68.21)
alternative label: Frysar, användning och service (68.21) @sv
alternative label: Hilloaminen, kotitalous (68.21)
alternative label: Inkokning, konservering (68.21) @sv
alternative label: Jääkaapit, käyttö ja huolto (68.21)
alternative label: Kallskänkans arbete (68.21) @sv
alternative label: Kellarit, säilöntä (68.21)
alternative label: Konserver, konserveringshandböcker (68.21) @sv
alternative label: Konservering, hushållning (68.21) @sv
alternative label: Kuivaus, säilöntä (68.21)
alternative label: Kylförvaring, hushållning (68.21) @sv
alternative label: Kylmiöt, käyttö ja huolto (68.21)
alternative label: Kylmäkön työ (68.21)
alternative label: Kylmäsäilytys, kotitalous (68.21)
alternative label: Kylrum, användning och service (68.21) @sv
alternative label: Kylskåp, användning och service (68.21) @sv
alternative label: Källare, konservering (68.21) @sv
alternative label: Marjat, säilöntä (68.21)
alternative label: Mehustus, säilöntä (68.21)
alternative label: Pakastaminen, kotitalous (68.21)
alternative label: Pakastimet, käyttö ja huolto (68.21)
alternative label: Saftning, konservering (68.21) @sv
alternative label: Saltning, konservering (68.21) @sv
alternative label: Sienet, säilöntä (68.21)
alternative label: Suolaus, säilöntä (68.21)
alternative label: Svampar, konservering (68.21) @sv
alternative label: Syltning, hushållning (68.21) @sv
alternative label: Säilykkeet, säilöntäoppaat (68.21)
alternative label: Säilöntä, kotitalous (68.21)
alternative label: Torkning, konservering (68.21) @sv
alternative label: Umpiointi, säilöntä (68.21)
alternative label: Ättikskonservering (68.21) @sv
broader: Ruoanvalmistus. Ruokakulttuuri
in scheme: YKL - Yleisten kirjastojen luokitusjärjestelmä
notation: 68.21
preferred label: Konservering @sv
preferred label: Preservation @en
scope note: Konserveringsrecept och konserveringsmetoder Utrustning, köksmaskiner och utrymmen för konservering och förvaring av matvaror ur privat- och storhushållets synvinkel Kallförvaring. Djupfrysning. Frysar. Kylskåp. Källare. Kylrum Torrförvaring. Torkning. Torkningsapparater Syltning. Saftning. Saltning. Inkokning @sv
scope note: Säilöntäohjeet ja -menetelmät Ruokatavaroiden säilöntään ja säilyttämiseen tarkoitetut tarvikkeet, keittiökoneet ja tilat koti- ja laitostalouden kannalta Kylmäsäilytys. Pakastaminen. Pakastimet. Jääkaapit. Kellarit. Kylmiöt Kuivasäilytys. Kuivaus. Kuivurit Hilloaminen. Mehustus. Suolaus. Umpiointi

Kasvisruoat. Sieniruoat
type: Concept
References: Ravinto-oppi. Ruokavaliot
type: YKL-luokka
alternative label: Kasvisruoat, ruoanvalmistus (68.22+)
alternative label: Kasvissyönti, ruoanvalmistus (68.22+)
alternative label: Lakto-ovo-vegetarism, matlagning (68.22) @sv
alternative label: Lakto-ovo-vegetarismi, ruoanvalmistus (68.22)
alternative label: Lakto-vegetarism, matlagning (68.22) @sv
alternative label: Laktovegetarismi, ruoanvalmistus (68.22)
alternative label: Ovo-vegetarism, matlagning (68.22) @sv
alternative label: Ovovegetarismi, ruoanvalmistus (68.22)
alternative label: Sieniruoat, ilman lihaa (68.22+)
alternative label: Svamprätter, utan kött (68.22+) @sv
alternative label: Vegetarianism, matlagning (68.22+) @sv
alternative label: Vegetarisk mat, matrecept (68.22+) @sv
alternative label: Vegetarism, matlagning (68.22+) @sv
alternative label: Vegetarismi, ruoanvalmistus (68.22+)
broader: Ruoanvalmistus. Ruokakulttuuri
in scheme: YKL - Yleisten kirjastojen luokitusjärjestelmä
narrower: Vegaaniruoat
notation: 68.22
preferred label: Vegetarian dishes. Mushroom dishes @en
preferred label: Vegetariska rätter. Svamprätter @sv
scope note: Hit och till underklassen kokböcker och matrecept som huvudsakligen rör rätter som inte innehåller kött, fågelkött, fisk eller andra köttprodukter Hit kokböcker och matrecept som rör lakto-vegetariska, lakto-ovo-vegetariska och ovo-vegetariska rätter Hit och till underklassen kokböcker och matrecept som rör vegetariska rätter Hit och till underklassen vegetarisk matkultur och gastronomi Om verket förutom matrecept innehåller allmän skildring, odling eller insamling av nyttoväxter, t.ex. svamp- eller bärplockning, ges företräde åt klass 68.2+ @sv
scope note: Tähän ja alaluokkaan keittokirjat ja ruoanvalmistusohjeet, joissa esitellään pääosin ruokalajeja, jotka eivät sisällä lihaa, lintua, kalaa tai muita lihatuotteita Tähän laktovegetaristisia, lakto-ovo-vegetaristisia ja ovovegetaristisia ruokia koskevat keittokirjat ja ruoanvalmistusohjeet Tähän ja alauokkaan vegetaristisia ruokia koskevat keittokirjat ja ruoanvalmistusohjeet Tähän ja alaluokkkaan kasvissyönnin ruokakulttuuri ja gastronomia Jos teoksessa on sekä ruoanvalmistusohjeita että hyötykasvien esittelyä, viljelyä tai keräilyä, esim. sienestystä tai marjastusta, annetaan etusija luokalle 68.2+

Vegaaniruoat
type: Concept
References: Eläinsuojelu
References: Ravinto-oppi. Ruokavaliot
type: YKL-luokka
alternative label: Bakning, vegansk (68.221) @sv
alternative label: Bakningsinstruktioner, veganska (68.221) @sv
alternative label: Leipominen, vegaaninen (68.221)
alternative label: Leivonta, vegaaninen (68.221)
alternative label: Leivontaohjeet, vengaaniset (68.221)
alternative label: Vegaaniruoat, ruoanvalmistus (68.221)
alternative label: Vegaaniset ruoat, ruoanvalmistus (68.221)
alternative label: Veganism, bakning (68.221) @sv
alternative label: Veganism, matlagning (68.221) @sv
alternative label: Veganismi, leivonta (68.221)
alternative label: Veganismi, ruoanvalmistus (68.221)
alternative label: Veganrätter, matlagning (68.221) @sv
alternative label: Veganska rätter, matlagning (68.221) @sv
broader: Kasvisruoat. Sieniruoat
in scheme: YKL - Yleisten kirjastojen luokitusjärjestelmä
notation: 68.221
preferred label: Vegan dishes @en
preferred label: Veganrätter @sv
scope note: Kokböcker, bakningsinstruktioner och matrecept som enbart rör rätter som innehåller inga animaliska produkter @sv
scope note: Ruoka- ja leivontaohjeet sekä keittokirjat, jotka koskevat yksinomaan ruokia, jotka eivät sisällä mitään eläinkunnan tuotteita

Liha-, lintu- ja kalaruoat
type: Concept
References: Kotieläintalous. Kotieläinten hoito
References: Metsästys. Kalastus
References: Eri maiden ja alueiden ruokalajit ja ruokakulttuuri
type: YKL-luokka
alternative label: Fiskar, matlagning (68.23) @sv
alternative label: Fiskrätter, matlagning (68.23) @sv
alternative label: Fågelrätter (68.23) @sv
alternative label: Fågelvilt, matlagning (68.23) @sv
alternative label: Fåglar, matlagning (68.23) @sv
alternative label: Hyönteiset, ruokaohjeet (68.23)
alternative label: Hönsrätter, matlagning (68.23) @sv
alternative label: Insekter, matrecept (68.23) @sv
alternative label: Kalaruoat, ruoanvalmistus (68.23)
alternative label: Kalat, ruoanvalmistus (68.23)
alternative label: Kanaruoat, ruoanvalmistus (68.23)
alternative label: Katkaravut, ruoanvalmistus (68.23)
alternative label: Kräftor, matlagning (68.23) @sv
alternative label: Kötträtter, matlagning (68.23) @sv
alternative label: Liharuoat, ruoanvalmistus (68.23)
alternative label: Linnut, ruoanvalmistus (68.23)
alternative label: Linturuoat, ruoanvalmistus (68.23)
alternative label: Musslor, matlagning (68.23) @sv
alternative label: Osterit, ruoanvalmistus (68.23)
alternative label: Ostron, matlagning (68.23) @sv
alternative label: Ravut, ruoanvalmistus (68.23)
alternative label: Riista, ruoanvalmistus (68.23)
alternative label: Riistalajit, ruoanvalmistus (68.23)
alternative label: Riistalinnut, ruoanvalmistus (68.23)
alternative label: Riistaruoat (68.23)
alternative label: Räkor, matlagning (68.23) @sv
alternative label: Simpukat, ruoanvalmistus (68.23)
alternative label: Skaldjursrätter (68.23) @sv
alternative label: Villebrådsarter, matlagning (68.23) @sv
alternative label: Vilt, matlagning (68.23) @sv
alternative label: Vilträtter (68.23) @sv
alternative label: Äyriäisruoat (68.23)
broader: Ruoanvalmistus. Ruokakulttuuri
in scheme: YKL - Yleisten kirjastojen luokitusjärjestelmä
notation: 68.23
preferred label: Kött-, fågel- och fiskrätter @sv
preferred label: Meat, poultry and fish dishes @en
scope note: Hit tillredning av kött-, fågel-, vilt-, fisk- och skaldjursrätter Om verket innehåller både matrecept och jakt eller fiske ges företräde åt klass 68.23 @sv
scope note: Tähän liha-, lintu-, riista-, kala- ja äyriäisruokien valmistusohjeet Jos teoksessa on sekä ruuanvalmistusohjeita että metsästystä tai kalastusta, annetaan etusija luokalle 68.23

Leipominen. Makeiset. Jälkiruoat
type: Concept
References: Vilja- ja heinäkasvit
References: Elintarviketeollisuus
References: Vegaaniruoat
References: Eri maiden ja alueiden ruokalajit ja ruokakulttuuri
type: YKL-luokka
alternative label: Bagarens arbete (68.24) @sv
alternative label: Bakelser, hemtillverkning (68.24) @sv
alternative label: Bakmaskiner, användning och service (68.24) @sv
alternative label: Bakning (68.24) @sv
alternative label: Bakningsinstruktioner (68.24) @sv
alternative label: Bröd, hemtillverkning (68.24) @sv
alternative label: Bärrätter, efterrätter (68.24) @sv
alternative label: Efterrätter, matlagning (68.24) @sv
alternative label: Frukter, efterrätter (68.24) @sv
alternative label: Glass, hemtillverkning (68.24) @sv
alternative label: Hedelmät, jälkiruoat (68.24)
alternative label: Jälkiruoat, valmistus (68.24)
alternative label: Jäätelö, kotivalmistus (68.24)
alternative label: Kondiittorin työ (68.24)
alternative label: Konditorns arbete (68.24) @sv
alternative label: Leipominen (68.24)
alternative label: Leipurin työ (68.24)
alternative label: Leipä, kotivalmistus (68.24)
alternative label: Leipäkoneet, käyttö ja huolto (68.24)
alternative label: Leivonnaiset, kotivalmistus (68.24)
alternative label: Leivonta (68.24)
alternative label: Leivontaohjeet (68.24)
alternative label: Makeiset, kotivalmistus (68.24)
alternative label: Marjaruoat, jälkiruoat (68.24)
alternative label: Sockerbagarens arbete (68.24) @sv
alternative label: Sokerileipurin työ (68.24)
alternative label: Sötsaker, hemtillverkning (68.24) @sv
broader: Ruoanvalmistus. Ruokakulttuuri
in scheme: YKL - Yleisten kirjastojen luokitusjärjestelmä
notation: 68.24
preferred label: Baking. Sweets. Desserts @en
preferred label: Bakning. Sötsaker. Efterrätter @sv
scope note: Bröd- och bakelserecept Efterrätts-, sötsaks- och glassrecept Hit också bagarens och konditorns arbete @sv
scope note: Leivän ja leivonnaisten leipomisohjeet Jälkiruokien, makeisten ja jäätelön valmistusohjeet Tähän myös leipurin ja kondiittorin työ

Eri maiden ja alueiden ruokalajit ja ruokakulttuuri
type: Concept
type: YKL-luokka
alternative label: Etniset keittokirjat (68.25+)
alternative label: Etniska kokböcker (68.25+) @sv
alternative label: Gastronomi, olika länder (68.25+) @sv
alternative label: Gastronomia, eri maiden (68.25+)
alternative label: Kansallisruoat, ruokaohjeet (68.25+)
alternative label: Keittokirjat, eri maiden (68.25+)
alternative label: Keittokirjat, etniset (68.25+)
alternative label: Kokböcker, etniska (68.25+) @sv
alternative label: Kokböcker, olika länders (68.25+) @sv
alternative label: Landskapsrätter, recept (68.25+) @sv
alternative label: Maakuntaruoat, ruokaohjeet (68.25+)
alternative label: Matkultur, olika länder (68.25+) @sv
alternative label: Matrecept, olika länder (68.25+) @sv
alternative label: Maträtter, olika länder (68.25+) @sv
alternative label: Mattradition, kokböcker (68.25+) @sv
alternative label: Nationalrätter, recept (68.25+) @sv
alternative label: Perinneruoat, ruokaohjeet (68.25+)
alternative label: Pizzat, ruoanvalmistus (68.25)
alternative label: Pizzor, matlagning (68.25) @sv
alternative label: Ruokakulttuuri, eri maiden (68.25+)
alternative label: Ruokalajit, eri maiden (68.25+)
alternative label: Ruokaohjeet, eri maiden (68.25+)
alternative label: Ruokaperinne, keittokirjat (68.25+)
alternative label: Traditionsrätter, recept (68.25+) @sv
broader: Ruoanvalmistus. Ruokakulttuuri
in scheme: YKL - Yleisten kirjastojen luokitusjärjestelmä
narrower: Ruokalajit ja ruokakulttuuri, Suomi
notation: 68.25
preferred label: Cooking and culinary art of different countries and regions @en
preferred label: Maträtter och matkultur i olika länder och regioner @sv
scope note: Hit kokböcker som behandlar enskilda länders, landskaps eller regionens maträtter samt verk som presenterar matkultur eller kök i ett enskilt land eller en enskild region. Etniska kokböcker. Matkulturen i ett visst land och internationella influenser i den. Kokböcker där maträtterna är odnade enligt land eller etniskt ursprung. Hit också vegetariska rätter, svamp-, kött-, fågel-, vilt-, fisk-, skaldjurs- och efterrätter samt bakverk och sötsaker i enskilda länders, landskaps eller regionens matkultur och kök. Om verket innehåller både matrecept och etnologi, ges företräde åt klass 68.25 @sv
scope note: Tähän tietyn maan, maakunnan tai alueen ruokalajeja koskevat keittokirjat sekä teokset, jotka esittelevät jonkin tietyn maan tai alueen ruokakulttuuria tai keittiötä. Etniset keittokirjat. Tietyn maan ruokakulttuuri kansainvälisine vaikutteineen. Keittokirjat, joissa ruokalajit on ryhmitelty maittain tai etnisen alkuperän mukaan. Tähän myös tietyn maan, maakunnan tai alueen kasvis-, sieni-, liha-, lintu-, riista-, kala-, äyriäis- ja jälkiruoat sekä leivonnaiset ja makeiset. Jos teoksessa on sekä ruokaohjeita että kansatiedettä, annetaan etusija luokalle 68.25+

Ruokalajit ja ruokakulttuuri, Suomi
type: Concept
References: Suomen ja suomalais-ugrilaisten kansojen kansatiede, Juhlaperinne, ruoka- ja juomaperinne
References: Kasvisruoat. Sieniruoat
References: Liha-, lintu- ja kalaruoat
References: Leipominen. Makeiset. Jälkiruoat
References: Juomat
type: YKL-luokka
alternative label: Kansallisruoat, ruokaohjeet, Suomi (68.252)
alternative label: Landskapsrätter, recept, Finland (68.252) @sv
alternative label: Maakuntaruoat, ruokaohjeet, Suomi (68.252)
alternative label: Nationalrätter, recept, Finland (68.252) @sv
alternative label: Perinneruoat, ruokaohjeet, Suomi (68.252)
alternative label: Traditionsrätter, recept, Finland (68.252) @sv
broader: Eri maiden ja alueiden ruokalajit ja ruokakulttuuri
in scheme: YKL - Yleisten kirjastojen luokitusjärjestelmä
notation: 68.252
preferred label: Cooking and culinary art, Finland @en
preferred label: Maträtter och matkultur, Finland @sv
scope note: Kokböcker och recept som innehåller traditionella finländska rätter och landskapsrätter Finsk matkultur. Finskt kök. Finlandssvensk matkultur Hit också finska och finlandssvenska vegetariska rätter, svamp-, kött-, fågel-, vilt-, fisk-, skaldjurs- och efterrätter samt bakverk och sötsaker Om verket innehåller både matrecept och etnologi, ges företräde åt klass 68.252 @sv
scope note: Suomalaisia perinne- ja maakuntaruokia koskevat keittokirjat ja ruoanvalmistusohjeet Suomalainen ruokakulttuuri. Suomalainen keittiö Tähän myös suomalaiset kasvis-, sieni-, liha-, lintu-, riista-, kala-, äyriäis- ja jälkiruoat sekä leivonnaiset ja makeiset Jos teoksessa on sekä ruokaohjeita että kansatiedettä, annetaan etusija luokalle 68.252

Tarjoilu
type: Concept
References: Juhlien järjestäminen
References: KANSATIEDE. KULTTUURIANTROPOLOGIA
References: Elintarviketeollisuus
References: Juomat
type: YKL-luokka
alternative label: Annostelu, ruokien tarjoilu (68.26)
alternative label: Astiat, kattaus (68.26)
alternative label: Ateriat, suunnittelu ja kattaus (68.26)
alternative label: Bestick, råd för servering (68.26) @sv
alternative label: Borddukning (68.26) @sv
alternative label: Bordsdekoration (68.26) @sv
alternative label: Dekoration, dukning (68.26) @sv
alternative label: Dukning (68.26) @sv
alternative label: Hovimestarin työ (68.26)
alternative label: Hovmästarens arbete (68.26) @sv
alternative label: Juustot, tarjoilu (68.26)
alternative label: Kattaus (68.26)
alternative label: Koristelu, pöydän kattaus (68.26)
alternative label: Kärl, dukning (68.26) @sv
alternative label: Menyer (68.26) @sv
alternative label: Måltider, planering och dukning (68.26) @sv
alternative label: Måltider, råd för servering (68.26) @sv
alternative label: Ostar, servering (68.26) @sv
alternative label: Portionering, matservering (68.26) @sv
alternative label: Pöydän kattaus (68.26)
alternative label: Pöydän koristelu (68.26)
alternative label: Ruokailu, tarjoiluohjeet (68.26)
alternative label: Ruokailuvälineet, tarjoiluohjeet (68.26)
alternative label: Ruokalistat (68.26)
alternative label: Servering (68.26) @sv
alternative label: Servitörens arbete (68.26) @sv
alternative label: Tarjoilijan työ (68.26)
alternative label: Tarjoilu (68.26)
broader: Ruoanvalmistus. Ruokakulttuuri
in scheme: YKL - Yleisten kirjastojen luokitusjärjestelmä
notation: 68.26
preferred label: Servering @sv
preferred label: Serving @en
scope note: Aterioiden suunnittelu. Pöydän kattaus Pöydän koristelu. Ruokailuvälineet Ruokalajien ja juomien yhteensopivuus Ruokalistat. Annostelu Tähän myös tarjoilijan ja hovimestarin työ Jos teoksessa on sekä aterioiden että juomien tarjoilua, annetaan etusija luokalle 68.26
scope note: Planering av måltider. Dukning Bordsdekorationer. Bestick Hur maträtter och drycker kombineras Menyer. Matportioner Hit också servitrisens och hovmästarens arbete Om verket innehåller servering av både mat och dryck, ges företräde åt klass 68.26 @sv

Juomat
type: Concept
References: Juhlien järjestäminen
References: Alkoholipolitiikka
References: KANSATIEDE. KULTTUURIANTROPOLOGIA
References: Elintarviketeollisuus
References: Nautintoaineteollisuus
alternative label: Alkoholdrycker (68.27) @sv
alternative label: Alkoholdrycker, dryckeskultur (68.27) @sv
alternative label: Alkoholdrycker, hemtillverkning (68.27) @sv
alternative label: Alkoholijuomat (68.27)
alternative label: Alkoholijuomat, juomakulttuuri (68.27)
alternative label: Alkoholijuomat, kotivalmistus (68.27)
alternative label: Alkoholikulttuuri, juomat (68.27)
alternative label: Alkoholkultur, drycker (68.27) @sv
alternative label: Annostelu, juomien tarjoilu (68.27)
alternative label: Boolit, valmistus ja tarjoilu (68.27)
alternative label: Bålar, tillredning och servering (68.27) @sv
alternative label: Cocktailar, tillredning och servering (68.27) @sv
alternative label: Cocktailit, valmistus ja tarjoilu (68.27)
alternative label: Drinkar, tillredning och servering (68.27) @sv
alternative label: Drinkit, valmistus ja tarjoilu (68.27)
alternative label: Drycker (68.27) @sv
alternative label: Drycker, hemtillverkning (68.27) @sv
alternative label: Drycker, servering (68.27) @sv
alternative label: Dryckeskultur, drycker (68.27) @sv
alternative label: Gårdsviner, drycker (68.27) @sv
alternative label: Hemvin, tillverkning (68.27) @sv
alternative label: Juomakulttuuri, juomat (68.27)
alternative label: Juomat (68.27)
alternative label: Juomat, kotivalmistus (68.27)
alternative label: Juomat, tarjoilu (68.27)
alternative label: Kaakao, juomakulttuuri (68.27)
alternative label: Kaakao, valmistus ja tarjoilu (68.27)
alternative label: Kaffe, dryckeskultur (68.27) @sv
alternative label: Kaffe, kokning och servering (68.27) @sv
alternative label: Kahvi, juomakulttuuri (68.27)
alternative label: Kahvi, valmistus ja tarjoilu (68.27)
alternative label: Kakao, dryckeskultur (68.27) @sv
alternative label: Kakao, tillverkning och servering (68.27) @sv
alternative label: Kotiviini, valmistus (68.27)
alternative label: Läskedrycker, dryckeskultur (68.27) @sv
alternative label: Läskedrycker, servering (68.27) @sv
alternative label: Maito, juomakulttuuri (68.27)
alternative label: Mallasjuomat, kotivalmistus (68.27)
alternative label: Maltdrycker, hemtillverkning (68.27) @sv
alternative label: Mehut, kotivalmistus ja tarjoilu (68.27)
alternative label: Mjölk, dryckeskultur (68.27) @sv
alternative label: Måltidsdrycker, dryckeskultur (68.27) @sv
alternative label: Måltidsdrycker, serveringsanvisningar (68.27) @sv
alternative label: Oluet, juomakulttuuri (68.27)
alternative label: Oluet, kotivalmistus ja tarjoilu (68.27)
alternative label: Portionering, dryckesservering (68.27) @sv
alternative label: Ruokajuomat, juomakulttuuri (68.27)
alternative label: Ruokajuomat, tarjoiluohjeet (68.27)
alternative label: Safter, hemtillverkning och servering (68.27) @sv
alternative label: Servering, drycker (68.27) @sv
alternative label: Smoothies (68.27) @sv
alternative label: Smoothiet (68.27)
alternative label: Spritdrycker, dryckeskultur (68.27) @sv
alternative label: Tarjoilu, juomat (68.27)
alternative label: Te, beredning och servering (68.27) @sv
alternative label: Te, dryckeskultur (68.27) @sv
alternative label: Tee, juomakulttuuri (68.27)
alternative label: Tee, valmistus ja tarjoilu (68.27)
alternative label: Tilaviinit, juomat (68.27)
alternative label: Viinikirjat (68.27)
alternative label: Viinikulttuuri (68.27)
alternative label: Viinilistat (68.27)
alternative label: Viinit (68.27)
alternative label: Viinit, juomakulttuuri (68.27)
alternative label: Viinit, kotivalmistus (68.27)
alternative label: Vinböcker (68.27) @sv
alternative label: Virvoitusjuomat, juomakulttuuri (68.27)
alternative label: Virvoitusjuomat, tarjoilu (68.27)
alternative label: Väkijuomat, juomakulttuuri (68.27)
broader: Ruoanvalmistus. Ruokakulttuuri
in scheme: YKL - Yleisten kirjastojen luokitusjärjestelmä
notation: 68.27
scope note: Drycker. Beredning och blandning av drycker Dryckeskultur. Servering av drycker Alkoholdrycker. Viner. Vinlistor. Böcker om vin Öl. Drinkar. Bål. Cocktaildrycker Kaffe. Te. Kakao. Saft. Mjölk Matdrycker. Läskedrycker Om verket innehåller både dryckeskultur och industri, ges företräde åt klass 68.27. Om verket innehåller servering av både drycker och måltider, ges företräde åt klass 68.26 @sv
scope note: Juomat, juomien valmistus ja sekoittaminen Juomakulttuuri. Juomien tarjoilu Alkoholijuomat. Viinit. Viinilistat. Viinikirjat Oluet. Drinkit. Boolit. Cocktailit Kahvi. Tee. Kaakao. Mehut. Maito Ruokajuomat. Virvoitusjuomat Jos teoksessa on sekä juomakulttuuria että teollisuutta, annetaan etusija luokalle 68.27 Jos teoksessa on sekä juomien että aterioiden tarjoilua, annetaan etusija luokalle 68.26

Huonetilojen ja irtaimiston hoito
type: Concept
References: Paineilmatekniikka. Tyhjötekniikka. Kylmätekniikka
References: Hienomekaaninen teollisuus
References: Talonrakennus
References: Rakennuksen kunnossapito
References: Sisustusoppaat
type: YKL-luokka
alternative label: Flyttningar, hem- och storhushållsekonomi (68.3) @sv
alternative label: Fläckuttagningsmedel, användning (68.3+) @sv
alternative label: Hemreparationer (68.3) @sv
alternative label: Hemreparationer, reparationer av lösöre (68.3) @sv
alternative label: Hemteknik, skötsel av lägenheter och lösöre (68.3+) @sv
alternative label: Huoltamot, kodinkoneet (68.3)
alternative label: Huonetilat, hoito (68.3+)
alternative label: Hushållsapparater, användning och service (68.3) @sv
alternative label: Hushållsmaskiner, användning och service (68.3) @sv
alternative label: Hushållsmaskintest (68.3) @sv
alternative label: Irtaimisto, hoito (68.3+)
alternative label: Kodin korjaustyöt (68.3)
alternative label: Kodin korjaustyöt, irtaimiston korjaus (68.3)
alternative label: Kodinkoneet, käyttö ja huolto (68.3)
alternative label: Kodinkonetestit (68.3)
alternative label: Kodintekniikka, huonetilojen ja irtaimiston hoito (68.3+)
alternative label: Koneet, korjaus, kodinkoneet (68.3)
alternative label: Korjaustyöt (68.3)
alternative label: Kotitalouskoneet, käyttö ja huolto (68.3)
alternative label: Kotitalouskonetestit (68.3)
alternative label: Lösöre, skötsel (68.3+) @sv
alternative label: Maskiner, reparation, hushållsmaskiner (68.3) @sv
alternative label: Muutot, koti- ja laitostalous (68.3)
alternative label: Reparationsarbeten (68.3) @sv
alternative label: Rum, skötsel (68.3+) @sv
alternative label: Serviceverkstäder, hushållsmaskiner (68.3) @sv
alternative label: Tahranpoistoaineet, käyttö (68.3+)
broader: KOTITALOUS. LAITOSTALOUS
in scheme: YKL - Yleisten kirjastojen luokitusjärjestelmä
narrower: Vaatteiden pesu ja hoito
narrower: Siivous
notation: 68.3
preferred label: Maintenance of rooms and movables @en
preferred label: Skötsel av lägenheter och lösöre @sv
scope note: Huonetilojen ja irtaimiston hoito koti- ja laitostalouden kannalta yleensä Yleiset kodin korjaustyöohjeet ja -oppaat Esineiden korjaaminen yleensä Kodinkoneiden käyttö, huolto ja testit kotitalouden kannalta yleensä Muutot ja niiden organisointi Erikoisalojen korjaus- ja huoltotyöt luokitetaan alan mukaan
scope note: Skötsel av lägenheter, lokaler och lösöre ur privat- och storhushållets synvinkel i allmänhet Allmänna handböcker och arbetsinstruktioner för reparationer i hemmet Reparation av föremål i allmänhet Användning, underhåll och test av hushållsmaskiner ur privathushållets synvinkel i allmänhet Flyttningar och organisation av dem Reparations- och servicearbeten inom specialområden klassificeras enligt område @sv

Vaatteiden pesu ja hoito
type: Concept
References: Kemianteollisuus
References: Rakennusten erillistilat
type: YKL-luokka
alternative label: Bykning (68.31) @sv
alternative label: Fläckuttagning, textilier och kläder (68.31) @sv
alternative label: Kemiallinen pesu (68.31)
alternative label: Kemisk tvätt (68.31) @sv
alternative label: Kläder, skötsel och förvaring (68.31) @sv
alternative label: Kläder, tvätt och strykning (68.31) @sv
alternative label: Klädvård (68.31) @sv
alternative label: Liinavaatteet, pesu ja hoito (68.31)
alternative label: Linne (68.31) @sv
alternative label: Manglar, användning och service (68.31) @sv
alternative label: Mankelit, käyttö ja huolto (68.31)
alternative label: Pesuaineet, käyttö (68.31)
alternative label: Pesukoneet, käyttö ja huolto (68.31)
alternative label: Pesulat (68.31)
alternative label: Puhdistusaineet, vaatteiden pesu (68.31)
alternative label: Pyykinpesu (68.31)
alternative label: Rengöringsmedel, klädtvätt (68.31) @sv
alternative label: Saippua, vaatteiden pesu (68.31)
alternative label: Silitys (68.31)
alternative label: Silityslaitteet, käyttö ja huolto (68.31)
alternative label: Strykmaskiner, användning och service (68.31) @sv
alternative label: Strykning (68.31) @sv
alternative label: Sängkläder, tvätt och skötsel (68.31) @sv
alternative label: Tahrojen poisto, tekstiilit ja vaatteet (68.31)
alternative label: Tekstiilit, hoito ja säilytys (68.31)
alternative label: Tekstiilit, pesu ja silitys (68.31)
alternative label: Textilier, skötsel och förvaring (68.31) @sv
alternative label: Textilier, tvätt och strykning (68.31) @sv
alternative label: Tvätterier (68.31) @sv
alternative label: Tvättmaskiner, användning och service (68.31) @sv
alternative label: Tvättmedel, användning (68.31) @sv
alternative label: Tvål, tvättning (68.31) @sv
alternative label: Vaatehuolto (68.31)
alternative label: Vaatteet, hoito ja säilytys (68.31)
alternative label: Vaatteet, pesu ja silitys (68.31)
alternative label: Vuodevaatteet, pesu ja hoito (68.31)
broader: Huonetilojen ja irtaimiston hoito
in scheme: YKL - Yleisten kirjastojen luokitusjärjestelmä
notation: 68.31
preferred label: Skötsel och tvätt av kläder @sv
preferred label: Washing and maintenance of clothes @en
scope note: Klädvård. Tvätt, strykning och förvaring av kläder, sängkläder och textilier Användning av tvättmedel och fläckurtagningsmedel Användning av tvättmaskiner, strykjärn och manglar Hit också tvätteriverksamhet @sv
scope note: Vaatehuolto. Vaatteiden, vuodevaatteiden ja tekstiilien pesu, silitys ja säilytys Pesu- ja tahranpoistoaineiden käyttö Pesukoneiden, silityslaitteiden ja mankelin käyttö Tähän myös pesulatoiminta

Siivous
type: Concept
References: Kemianteollisuus
type: YKL-luokka
alternative label: Anläggningsunderhåll, städbranschen (68.33) @sv
alternative label: Dammsugare, städarbete (68.33) @sv
alternative label: Fläckuttagning, möbler (68.33) @sv
alternative label: Fläckuttagning, rum (68.33) @sv
alternative label: Huonekalut, puhdistus (68.33)
alternative label: Huonetilat, siivous (68.33)
alternative label: Laitoshuolto, siivousala (68.33)
alternative label: Möbler, rengöring (68.33) @sv
alternative label: Puhdistusaineet, huonetilojen pesu (68.33)
alternative label: Pölynimurit, siivoustyö (68.33)
alternative label: Rengöringsmedel, rumsrengöring (68.33) @sv
alternative label: Rum, städning (68.33) @sv
alternative label: Saippua, siivous (68.33)
alternative label: Siivoojan työ (68.33)
alternative label: Siivous (68.33)
alternative label: Siivouskoneet, käyttö ja huolto (68.33)
alternative label: Siivousliikkeet (68.33)
alternative label: Siivousvälineet (68.33)
alternative label: Städarens arbete (68.33) @sv
alternative label: Städfirmor (68.33) @sv
alternative label: Städmaskiner, användning och service (68.33) @sv
alternative label: Städning (68.33) @sv
alternative label: Städredskap (68.33) @sv
alternative label: Tahrojen poisto, huonekalut (68.33)
alternative label: Tahrojen poisto, huonetilat (68.33)
alternative label: Tvål, städning (68.33) @sv
broader: Huonetilojen ja irtaimiston hoito
in scheme: YKL - Yleisten kirjastojen luokitusjärjestelmä
notation: 68.33
preferred label: Cleaning @en
preferred label: Städning @sv
scope note: Huonetilojen ja huonekalujen siivous ja puhdistus Siivoustyökalujen ja -koneiden sekä puhdistusaineiden käyttö Tähän myös siivoojan työ ja siivousliikkeet
scope note: Städning och rengöring av rum och möbler Användning av städredskap och städutrustning samt rengöringsmedel Hit också städarens arbete och städföretag @sv

Sisustusoppaat
type: Concept
References: Huonekaluteollisuus
References: Paperi- ja selluloosateollisuus
References: Talonrakennus
References: Huonekasvit. Kukka-asetelmat
References: Toimistotyö. Toimistotekniikka
References: Sisustusarkkitehtuuri. Huonekalutaide
type: YKL-luokka
alternative label: Asunnot, sisustusoppaat (68.4)
alternative label: Badrum, inredningshandböcker (68.4) @sv
alternative label: Balkonger, inredningshandböcker (68.4) @sv
alternative label: Belysningsanordningar, inredningshandböcker (68.4) @sv
alternative label: Bostäder, inredningshandböcker (68.4) @sv
alternative label: Gardiner, inredningshandböcker (68.4) @sv
alternative label: Handikappbostäder, inredningshandböcker (68.4) @sv
alternative label: Heminredningshandböcker (68.4) @sv
alternative label: Huonekalut, sisustusoppaat (68.4)
alternative label: Huonetilat, sisustusoppaat (68.4)
alternative label: Huvilat, sisustusoppaat (68.4)
alternative label: Inredningshandböcker, bostäder för handikappade (68.4) @sv
alternative label: Inredningshandböcker, heminredning (68.4) @sv
alternative label: Inredningshandböcker, kontor (68.4) @sv
alternative label: Inredningshandböcker, kök (68.4) @sv
alternative label: Inredningshandböcker, offentliga utrymmen (68.4) @sv
alternative label: Julkiset tilat, sisustusoppaat (68.4)
alternative label: Keittiöt (68.4)
alternative label: Keittiöt, sisustusoppaat (68.4)
alternative label: Kodinsisustusoppaat (68.4)
alternative label: Kontor, inredningshandböcker (68.4) @sv
alternative label: Kylpyhuoneet, sisustusoppaat (68.4)
alternative label: Kök (68.4) @sv
alternative label: Kök, inredningshandböcker (68.4) @sv
alternative label: Lampor, inredningshandböcker (68.4) @sv
alternative label: Lamput, sisustusoppaat (68.4)
alternative label: Matot, sisustusoppaat (68.4)
alternative label: Mattor, inredningshandböcker (68.4) @sv
alternative label: Möbler, inredningshandböcker (68.4) @sv
alternative label: Offentliga lokaler, inredningshandböcker (68.4) @sv
alternative label: Parvekkeet, sisustusoppaat (68.4)
alternative label: Rum, inredningshandböcker (68.4) @sv
alternative label: Sisustusoppaat, julkiset tilat (68.4)
alternative label: Sisustusoppaat, keittiöt (68.4)
alternative label: Sisustusoppaat, kodinsisustus (68.4)
alternative label: Sisustusoppaat, toimistot (68.4)
alternative label: Sisustusoppaat, vammaisten asunnot (68.4)
alternative label: Stilar, inredningshandböcker (68.4) @sv
alternative label: Toimistot, sisustusoppaat (68.4)
alternative label: Tyylit, sisustusoppaat (68.4)
alternative label: Valaisimet, sisustusoppaat (68.4)
alternative label: Vammaisten asunnot, sisustusoppaat (68.4)
alternative label: Verhot, sisustusoppaat (68.4)
alternative label: Villor, inredningshandböcker (68.4) @sv
broader: KOTITALOUS. LAITOSTALOUS
in scheme: YKL - Yleisten kirjastojen luokitusjärjestelmä
notation: 68.4
preferred label: Inredningshandböcker @sv
preferred label: Interior decoration handbooks @en
scope note: Heminredningshandböcker. Handböcker om inredning av offentliga lokaler och kontor Handböcker som rör inredning och ommöblering av rum i hemmet såsom vardagsrum, sovrum, barnkammare, kök eller badrum Möbler samt balkong-, ute- och trädgårdsmöblemang ur heminredningssynvinkel Inredningshandböcker för sommarstugor Handböcker om inredning av bostäder för specialgrupper Om verket innehåller både praktiska inredningsguider och inredningskonst, ges företräde åt klass 68.4 @sv
scope note: Kodinsisustusoppaat. Julkisten tilojen ja toimistojen sisustusoppaat Kodin tilojen, kuten olohuoneen, makuuhuoneen, lastenhuoneen, keittiön tai kylpyhuoneen kalustamista tai sisustamista koskevat ohjeet Huonekalut sekä parveke-, piha- ja puutarhakalusteet kodinsisustuksen kannalta Kesämökin sisustusoppaat Erityisryhmien asuntojen sisustusoppaat Jos teoksessa on sekä käytännön sisustusohjeita että sisustusarkkitehtuuria, annetaan etusija luokalle 68.4

Hotelli- ja ravintolatalous. Suurkeittiöt. Ateriapalvelut
type: Concept
References: Sosiaalipalvelut
References: Yleiset matkaoppaat
References: Ruoanvalmistus. Ruokakulttuuri
References: Tarjoilu
References: Huonetilojen ja irtaimiston hoito
type: YKL-luokka
alternative label: Ammattikeittiöt (68.8)
alternative label: Anniskelu, ravintolatalous (68.8)
alternative label: Ateriapalvelut (68.8)
alternative label: Baarit, hoito ja talous (68.8)
alternative label: Barer, skötsel och ekonomi (68.8) @sv
alternative label: Catering (68.8)
alternative label: Centralkök (68.8) @sv
alternative label: Hotell, skötsel och ekonomi (68.8) @sv
alternative label: Hotellit, hoito ja talous (68.8)
alternative label: Joukkoruokailu (68.8)
alternative label: Kaféer, skötsel och ekonomi (68.8) @sv
alternative label: Kahvilat, hoito ja talous (68.8)
alternative label: Keittiöt, suurkeittiöt (68.8)
alternative label: Keskuskeittiöt (68.8)
alternative label: Konditoriat, hoito ja talous (68.8)
alternative label: Konditorier, skötsel och ekonomi (68.8) @sv
alternative label: Koulukeittiöt (68.8)
alternative label: Kouluruokailu (68.8)
alternative label: Kök, storkök (68.8) @sv
alternative label: Laitoskeittiöt (68.8)
alternative label: Laitosruokailu (68.8)
alternative label: Lomakylät, hoito ja talous (68.8)
alternative label: Majatalot, hoito ja talous (68.8)
alternative label: Massbespisning (68.8) @sv
alternative label: Matkustajakodit, hoito ja talous (68.8)
alternative label: Matleverantörer (68.8) @sv
alternative label: Matserveringar, skötsel och ekonomi (68.8) @sv
alternative label: Motell, skötsel och ekonomi (68.8) @sv
alternative label: Motellit, hoito ja talous (68.8)
alternative label: Måltidsservice (68.8) @sv
alternative label: Personalbespisning (68.8) @sv
alternative label: Pitopalvelu (68.8)
alternative label: Pizzeriat, hoito ja talous (68.8)
alternative label: Pizzerior, skötsel och ekonomi (68.8) @sv
alternative label: Portieerin työ (68.8)
alternative label: Portierens arbete (68.8) @sv
alternative label: Professionella kök (68.8) @sv
alternative label: Pubar, skötsel och ekonomi (68.8) @sv
alternative label: Pubit, hoito ja talous (68.8)
alternative label: Ravintolakulttuuri (68.8)
alternative label: Ravintolat, hoito ja talous (68.8)
alternative label: Ravintolatalous (68.8)
alternative label: Resandehem, skötsel och ekonomi (68.8) @sv
alternative label: Restaurangekonomi (68.8) @sv
alternative label: Restauranger, skötsel och ekonomi (68.8) @sv
alternative label: Restaurangkultur (68.8) @sv
alternative label: Retkeilymajat, hoito ja talous (68.8)
alternative label: Ruokalat, hoito ja talous (68.8)
alternative label: Ruokapalvelut (68.8)
alternative label: Sairaalakeittiöt (68.8)
alternative label: Sairaalaruokailu (68.8)
alternative label: Semesterbyar, skötsel och ekonomi (68.8) @sv
alternative label: Sjukhusbespisning (68.8) @sv
alternative label: Sjukhuskök (68.8) @sv
alternative label: Skolbespisning (68.8) @sv
alternative label: Skolkök (68.8) @sv
alternative label: Storkök (68.8) @sv
alternative label: Suurkeittiöt (68.8)
alternative label: Työpaikkaruokailu (68.8)
alternative label: Utskänkning, restauranghushållning (68.8) @sv
alternative label: Vandrarhem, skötsel och ekonomi (68.8) @sv
alternative label: Värdshus, skötsel och ekonomi (68.8) @sv
alternative label: korttidsuthyrning, inkvarteringsverksamhet (68.8) @sv
alternative label: lyhytvuokraus, majoitustoiminta (68.8)
broader: KOTITALOUS. LAITOSTALOUS
in scheme: YKL - Yleisten kirjastojen luokitusjärjestelmä
notation: 68.8
preferred label: Hotel and restaurant business. Institutional kitchens. Catering @en
preferred label: Hotell- och restaurangverksamhet. Storkök. Måltidsservice @sv
scope note: Hotellien, motellien, matkustajakotien, retkeilymajojen, lomakylien, ravintoloiden, baarien ja kahviloiden organisointi, talous ja hoito Sairaaloiden, koulujen ja muiden laitosten tai työpaikkojen keittiöiden organisointi, talous ja hoito Ateriapalvelut. Ruokapalvelut. Pitopalvelut. Catering. Joukko-, työpaikka- ja kouluruokailu
scope note: Organisation, ekonomi och skötsel av hotell, motell, resandehem, vandrarhem, semesterbyar, restauranger, barer och kaféer Organisation, ekonomi och skötsel av kök i sjukhus, skolor och andra anstalter eller arbetsplatser Bespisning. Personal- och skolbespisning Måltidsservice. Matleverantörer. Catering @sv

LIIKETALOUS. MARKKINOINTI. KAUPPA. LIIKENNE
type: Concept
References: Siviili- ja kauppaoikeus
References: TALOUSTIEDE. KANSANTALOUSTIEDE
type: YKL-luokka
alternative label: Företagsekonomi, ekonomisk vetenskap (69) @sv
alternative label: Handelsvetenskaper (69) @sv
alternative label: Kaupalliset aineet (69)
alternative label: Kauppatieteet (69)
alternative label: Liiketaloustiede (69)
alternative label: Merkantila ämnen (69) @sv
broader: TEKNIIKKA. TEOLLISUUS. KÄSITYÖ. MAA- JA METSÄTALOUS KOTITALOUS. LIIKETALOUS. LIIKENNE
in scheme: YKL - Yleisten kirjastojen luokitusjärjestelmä
narrower: Liiketalous
narrower: Liiketaloudellinen laskentatoimi
narrower: Markkinointi. Kauppa
narrower: Liikenne
narrower: Posti
notation: 69
preferred label: BUSINESS ECONOMY. MARKETING. TRADE. TRAFFIC @en
preferred label: FÖRETAGSEKONOMI. MARKNADSFÖRING. HANDEL. TRAFIK @sv
scope note: Hit allmänna verk om företagsekonomi Hit också verk som behandlar både företagsekonomi och marknadsföring i allmänhet Företagsekonomiska frågor inom specialområden klassificeras enligt område Om verket innehåller både företagsekonomi och nationalekonomi, ges företräde åt klass 36+ @sv
scope note: Tähän liiketaloustieteen yleisteokset Tähän myös teokset, jotka koskevat sekä liiketaloutta että markkinointia yleensä Erikoisalojen liiketaloudelliset kysymykset luokitetaan alan mukaan Jos teoksessa on sekä liiketalous- että kansantaloustiedettä, annetaan etusija luokalle 36+

Liiketalous
type: Concept
References: Organisaatiososiologia
References: Siviili- ja kauppaoikeus
References: Ulosotto- ja konkurssilainsäädäntö
References: HALLINTO
References: TALOUSTIEDE. KANSANTALOUSTIEDE
References: Julkinen talous. Finanssioppi
References: Kansainvälinen talous. Maailmankauppa
References: Liiketaloudellinen laskentatoimi
References: Liiketaloudellinen kirjanpito ja tilintarkastus
References: Markkinointi. Kauppa
alternative label: Fuusiot, liiketalous (69.1)
alternative label: Fuusiot, yritykset ja organisaatiot (69.1)
alternative label: Hajautus, liiketalous (69.1)
alternative label: Hajautus, yritykset ja organisaatiot (69.1)
alternative label: Hallinnollinen saneeraus, yritykset (69.1)
alternative label: Hallinto, liiketaloudellinen (69.1)
alternative label: Hallinto, yritykset ja organisaatiot (69.1)
alternative label: Investoinnit, liiketalous (69.1)
alternative label: Investoinnit, yritykset ja organisaatiot (69.1)
alternative label: Investointitoiminta, liiketalous (69.1)
alternative label: Investointitoiminta, yritykset ja organisaatiot (69.1)
alternative label: Kannattavuus, liiketalous (69.1)
alternative label: Kannattavuus, yritykset ja organisaatiot (69.1)
alternative label: Keskittäminen, liiketalous (69.1)
alternative label: Keskittäminen, yritykset ja organisaatiot (69.1)
alternative label: Kilpailu, liiketalous (69.1)
alternative label: Kilpailu, yritykset ja organisaatiot (69.1)
alternative label: Kilpailuttaminen (69.1)
alternative label: Kirjallinen viestintä, yritysviestintä (69.1+)
alternative label: Konkurssit, liiketalous (69.1)
alternative label: Konkurssit, yritykset ja organisaatiot (69.1)
alternative label: Konsulttitoiminta (69.1)
alternative label: Liikeorganisaatio (69.1)
alternative label: Liiketalous (69.1)
alternative label: Liiketoiminta (69.1)
alternative label: Luova talous, yritystoiminta (69.1)
alternative label: Oppiva organisaatio (69.1)
alternative label: Organisaatiokaaviot (69.1)
alternative label: Organisaatiot, fuusioituminen (69.1)
alternative label: Organisaatiot, hajauttaminen (69.1)
alternative label: Organisaatiot, hallinto (69.1)
alternative label: Organisaatiot, investointitoiminta (69.1)
alternative label: Organisaatiot, kannattavuus (69.1)
alternative label: Organisaatiot, kehittäminen (69.1)
alternative label: Organisaatiot, keskittäminen (69.1)
alternative label: Organisaatiot, koordinointi (69.1)
alternative label: Organisaatiot, rahoitus (69.1)
alternative label: Organisaatiot, rakenne (69.1)
alternative label: Organisaatiot, rationalisointi (69.1)
alternative label: Organisaatiot, strategia (69.1)
alternative label: Organisaatiot, suunnittelu (69.1)
alternative label: Organisaatioteoriat, liiketalous (69.1)
alternative label: Organisaatiotutkimus, liiketalous (69.1)
alternative label: Organisaatioviestintä (69.1+)
alternative label: Osaaminen, yritystoiminta (69.1+)
alternative label: PR-toiminta (69.1+)
alternative label: Palveluliiketoiminta (69.1)
alternative label: Palvelut, palveluliiketoiminta (69.1)
alternative label: Projektinhallinta (69.1)
alternative label: Projektityöskentely (69.1)
alternative label: Rahoitus, liiketalous (69.1)
alternative label: Rahoitus, yritykset ja organisaatiot (69.1)
alternative label: Rahoitusmarkkinat, yritystoiminta (69.1)
alternative label: Rahoituspalvelut, yritystoiminta (69.1)
alternative label: Rationalisointi (69.1)
alternative label: Rationalisointi, liiketalous (69.1)
alternative label: Rationalisointi, yritykset ja organisaatiot (69.1)
alternative label: Riskianalyysi, liiketalous (69.1)
alternative label: Riskienhallinta, liiketalous (69.1)
broader: LIIKETALOUS. MARKKINOINTI. KAUPPA. LIIKENNE
in scheme: YKL - Yleisten kirjastojen luokitusjärjestelmä
narrower: Johtamisen tekniikka ja menetelmät
narrower: Tuotannon organisointi ja suunnittelu
narrower: Henkilöstöpolitiikka
narrower: Työntutkimukset. Työanalyysi. Työn suunnittelu
narrower: Toimistotyö. Toimistotekniikka
notation: 69.1
scope note: Hit allmänna verk om företags- och industriekonomi samt om företags- och organisationsadministration Hit och till underklasserna organisation och sociologi i olika typer av privata och offentliga företag i allmänhet. Generationsskifte i allmänhet Hur företag eller organisationer planeras och grundas Administration, struktur, strategier, rationalisering, utveckling och samordning inom företag och organisationer. Företagets image Centralisering och decentralisering av företag eller organisationer Internationalisering av företag Finansiering och lönsamhet inom företag eller organisationer Företagens placeringsverksamhet Konkurrens och fusioner mellan företag eller organisationer. Konkurser Hit och till underklasserna informations- och PR-verksamhet i privata eller offentliga företag eller organisationer i allmänhet Organisations- och företagskommunikation i allmänhet Organisationsteori och organisationsforskning. Organisationsscheman Hit också konsultverksamhet i allmänhet Företag, organisationer och företagsekonomiska frågor inom specialområden klassificeras enligt område @sv
scope note: Tähän liike-, yritys- ja teollisuustalouden sekä yritys- ja organisaatiohallinnon yleisteokset Tähän ja alaluokkiin erityyppisten yksityisten ja julkisten yritysten organisaatio ja sosiologia yleensä. Sukupolvenvaihdos yleensä Yrityksen tai organisaation suunnittelu, perustaminen, hallinta, rakenne, strategia, rationalisointi, kehittäminen ja koordinointi. Yrityskuva Yrityksen tai organisaation keskittäminen ja hajautus Yrityksen kansainvälistyminen Yrityksen tai organisaation rahoitus ja kannattavuus Yrityksen harjoittama sijoitustoiminta Yritysten tai organisaatioiden keskinäinen kilpailu ja fuusioituminen. Konkurssit Tähän ja alaluokkiin yksityisen tai julkisen yrityksen tai organisaation harjoittama tiedotus- ja suhdetoiminta yleensä Organisaatio-, yritys ja yhteisöviestintä yleensä Organisaatioteoria ja -tutkimus. Organisaatiokaaviot Tähän myös konsulttitoiminta yleensä Erikoisalojen yritykset, organisaatiot ja liiketaloudelliset kysymykset luokitetaan alan mukaan

Johtamisen tekniikka ja menetelmät
type: Concept
References: Sosiaalipsykologia
References: Kansalaistoiminta ja –aktivismi. Järjestötoiminta. Kokoustekniikka.
References: Työ. Työelämä
References: Henkilöstöpolitiikka
References: Työntutkimukset. Työanalyysi. Työn suunnittelu
type: YKL-luokka
alternative label: Ansvarsfördelning (69.11) @sv
alternative label: Arbetsledning (69.11) @sv
alternative label: Befälsrätt (69.11) @sv
alternative label: Beslutsfattning, ledarskap (69.11) @sv
alternative label: Delegering (69.11) @sv
alternative label: Delegointi (69.11)
alternative label: Esihenkilötyö (69.11)
alternative label: Esimiestyö (69.11)
alternative label: Företag, ledarskap (69.11) @sv
alternative label: Företagsledning (69.11) @sv
alternative label: Förmansarbete (69.11) @sv
alternative label: Henkilöstöjohtaminen, johtamistaito (69.11)
alternative label: Johtaminen, liiketalous (69.11)
alternative label: Johtaminen, psykologia (69.11)
alternative label: Johtaminen, tekniikka ja menetelmät (69.11)
alternative label: Johtaminen, työnjohto (69.11)
alternative label: Johtaminen, yritykset ja organisaatiot (69.11)
alternative label: Johtamistaito (69.11)
alternative label: Knowledge management (69.11)
alternative label: Kunskapshantering (69.11) @sv
alternative label: Kunskapsledning (69.11) @sv
alternative label: Käskyvalta (69.11)
alternative label: Ledarskap (69.11) @sv
alternative label: Ledarskap, arbetsledning (69.11) @sv
alternative label: Ledarskap, företag och organisationer (69.11) @sv
alternative label: Ledarskap, företagsekonomi (69.11) @sv
alternative label: Ledarskap, psykologi (69.11) @sv
alternative label: Ledarskap, teknik och metoder (69.11) @sv
alternative label: Liikkeenjohto (69.11)
alternative label: Markkinointi, sisäinen (69.11)
alternative label: Marknadsföring, intern (69.11) @sv
alternative label: Miljöledarskap (69.11) @sv
alternative label: Målstyrning (69.11) @sv
alternative label: Organisaatiot, johtaminen (69.11)
alternative label: Organisationer, ledarskap (69.11) @sv
alternative label: Personalledning, ledarförmåga (69.11) @sv
alternative label: Päätöksenteko, johtaminen (69.11)
alternative label: Resultatansvar (69.11) @sv
alternative label: Resultatstyrning (69.11) @sv
alternative label: Tavoitejohtaminen (69.11)
alternative label: Tietojohtaminen (69.11)
alternative label: Tietämyshallinta (69.11)
alternative label: Tulosjohtaminen (69.11)
alternative label: Tulosvastuu (69.11)
alternative label: Työnjohto (69.11)
alternative label: Vastuunjako (69.11)
alternative label: Ympäristöjohtaminen (69.11)
alternative label: Yritykset, johtaminen (69.11)
broader: Liiketalous
in scheme: YKL - Yleisten kirjastojen luokitusjärjestelmä
notation: 69.11
preferred label: Leadership techniques and methods @en
preferred label: Ledarskap. Teknik och metoder @sv
scope note: Johtamisen tekniikka ja menetelmät sekä yksityisen että julkisen yrityksen tai organisaation kannalta yleensä Johtamistaito. Sisäinen markkinointi Tavoitejohtaminen. Tulosjohtaminen. Tulosvastuu Johtamisen psykologia Työnjohtaminen. Päätöksenteko. Delegointi Erikoisalojen johtamistaito luokitetaan alan mukaan
scope note: Teknik och metoder för ledarskap i privata och offentliga företag och organisationer i allmänhet Ledarskap. Intern marknadsföring Målstyrning. Resultatorienterad styrning. Resultatansvar Psykologiska aspekter på ledarskap Arbetsledning. Beslutsfattning. Delegering Ledarförmåga inom specialområden klassificeras enligt område @sv

Tuotannon organisointi ja suunnittelu
type: Concept
References: Kauppaoikeus
References: Tuotanto. Tuottavuus
References: Standardit. Normit. Mittayksiköt
References: Innovaatiot. Keksinnöt. Patentit
References: Markkinointi. Kauppa
type: YKL-luokka
alternative label: Företag, produktionsplanering (69.12) @sv
alternative label: Kvalitetskontroll, produktionens organisering (69.12) @sv
alternative label: Laadunvalvonta, tuotannon organisointi (69.12)
alternative label: Operaatioanalyysi, liiketalous (69.12)
alternative label: Operationsanalys, företagsekonomi (69.12) @sv
alternative label: Produktifiering (69.12) @sv
alternative label: Produktion, affärsekonomi (69.12) @sv
alternative label: Produktion, automatisering (69.12) @sv
alternative label: Produktion, företagsekonomi (69.12) @sv
alternative label: Produktion, organisationsekonomi (69.12) @sv
alternative label: Produktion, organisering och planering (69.12) @sv
alternative label: Produktion, rationalisering (69.12) @sv
alternative label: Produktionsanläggningar, företagsekonomi (69.12) @sv
alternative label: Produktionsmedel, företagsekonomi (69.12) @sv
alternative label: Produktionsprocesser, företagsekonomi (69.12) @sv
alternative label: Produktionssätt, företagsekonomi (69.12) @sv
alternative label: Produktpolitik (69.12) @sv
alternative label: Produktutveckling (69.12) @sv
alternative label: Tuotanto, automatisointi (69.12)
alternative label: Tuotanto, liiketalous (69.12)
alternative label: Tuotanto, organisaatiotalous (69.12)
alternative label: Tuotanto, organisointi ja suunnittelu (69.12)
alternative label: Tuotanto, rationalisointi (69.12)
alternative label: Tuotanto, yritystalous (69.12)
alternative label: Tuotantolaitokset, liiketalous (69.12)
alternative label: Tuotantoprosessit, liiketalous (69.12)
alternative label: Tuotantotapa, liiketalous (69.12)
alternative label: Tuotantovälineet, liiketalous (69.12)
alternative label: Tuotekehittely (69.12)
alternative label: Tuotepolitiikka (69.12)
alternative label: Tuotteistaminen (69.12)
alternative label: Tuotteistus (69.12)
alternative label: Yritykset, tuotannon suunnittelu (69.12)
broader: Liiketalous
in scheme: YKL - Yleisten kirjastojen luokitusjärjestelmä
notation: 69.12
preferred label: Organisation and planning of production @en
preferred label: Organisation och planering av produktion @sv
scope note: Organisation och planering av produktionen i privata eller offentliga företag i allmänhet Organisation och planering av produktionsanläggningar, produktionsmedel, råmaterialsanskaffning och produktionsprocessen Produktionssätt. Produktionsvolymer och tidsplanering Rationalisering och automatisering av produktion Kvalitetskontroll. Produktutveckling. Produkpolitik. Produktifiering Organisation och planering av produktion inom specialområden klassificeras enligt område @sv
scope note: Yksityisen tai julkisen yrityksen tuotannon organisointi ja suunnittelu yleensä Tuotantolaitosten, tuotantovälineiden, raaka-aineiden hankinnan ja tuotantoprosessin organisointi ja suunnittelu Tuotantotapa. Tuotannon määrä ja ajoitus Tuotannon rationalisointi ja automatisointi Laadunvalvonta. Tuotekehittely. Tuotepolitiikka. Tuotteistus Erikoisalojen tuotannon organisointi ja suunnittelu luokitetaan alan mukaan

Henkilöstöpolitiikka
type: Concept
References: Sosiaalipsykologia
References: Työoikeus
References: Työ. Työelämä
References: Työvoimapolitiikka
References: Palkkapolitiikka. Tulopolitiikka
References: Työmarkkinajärjestöt
References: Työsuojelu. Ergonomia
References: Mielenterveys. Tunne-elämän häiriöt
References: Johtamisen tekniikka ja menetelmät
References: Työntutkimukset. Työanalyysi. Työn suunnittelu
alternative label: Ammatillinen kehitys (69.13)
alternative label: Ammattitaito (69.13)
alternative label: Anställning (69.13) @sv
alternative label: Arbetsdisciplin (69.13) @sv
alternative label: Arbetsinstruktion (69.13) @sv
alternative label: Arbetsplatsdemokrati (69.13) @sv
alternative label: Arbetsplatsråd (69.13) @sv
alternative label: Avskedande (69.13) @sv
alternative label: Avskedande, personalpolitik (69.13) @sv
alternative label: Befattningar, kommunala (69.13) @sv
alternative label: Erottaminen, henkilöstöpolitiikka (69.13)
alternative label: Företag, personalpolitik (69.13) @sv
alternative label: Företag, social verksamhet (69.13) @sv
alternative label: Företagsdemokrati (69.13) @sv
alternative label: Handledning (69.13) @sv
alternative label: Henkilöstö (69.13)
alternative label: Henkilöstöhallinto (69.13)
alternative label: Henkilöstöhankinta (69.13)
alternative label: Henkilöstöjohtaminen, henkilöstöhallinto (69.13)
alternative label: Henkilöstökoulutus (69.13)
alternative label: Henkilöstökysymykset (69.13)
alternative label: Henkilöstöpolitiikka (69.13)
alternative label: Henkilöstörahastot (69.13)
alternative label: Henkilöstösuunnittelu (69.13)
alternative label: Henkilöstötutkimukset (69.13)
alternative label: Inlärning i arbete, intern utbildning (69.13) @sv
alternative label: Kannustus, henkilöstöpolitiikka (69.13)
alternative label: Kehityskeskustelut (69.13)
alternative label: Koulutuspolitiikka, työpaikkakoulutus (69.13)
alternative label: Kunnan työntekijät, henkilöstöpolitiikka (69.13)
alternative label: Mentorointi (69.13)
alternative label: Organisaatiot, henkilöstöpolitiikka (69.13)
alternative label: Palkitseminen, henkilöstöpolitiikka (69.13)
alternative label: Perehdyttäminen (69.13)
alternative label: Rekrytointi (69.13)
alternative label: Soveltuvuuskokeet, työhönotto (69.13)
alternative label: Toimihenkilöt, henkilöstöpolitiikka (69.13)
alternative label: Toimihenkilöt, kuntien (69.13)
alternative label: Toimihenkilöt, valtion (69.13)
alternative label: Työhön perehdyttäminen (69.13)
alternative label: Työhön sijoittaminen (69.13)
alternative label: Työhönotto (69.13)
alternative label: Työkuri (69.13)
alternative label: Työnohjaus (69.13)
alternative label: Työnopastus (69.13)
alternative label: Työpaikkademokratia (69.13)
alternative label: Työpaikkakoulutus (69.13)
alternative label: Työpaikkaneuvostot (69.13)
alternative label: Työssä oppiminen, työpaikkakoulutus (69.13)
alternative label: Työssäoppiminen, työpaikkakoulutus (69.13)
alternative label: Työstä erottaminen (69.13)
alternative label: Valtion työntekijät, henkilöstöpolitiikka (69.13)
alternative label: Virastodemokratia (69.13)
alternative label: Virat (69.13)
alternative label: Virat, kunnan (69.13)
alternative label: Virat, valtion (69.13)
alternative label: Virkamiehet, kunnallishallinto (69.13)
alternative label: Virkamiehet, valtionhallinto (69.13)
alternative label: Virkanimitykset (69.13)
alternative label: Virkapolitiikka (69.13)
alternative label: Virkasäännöt (69.13)
alternative label: Yritykset, henkilöstöpolitiikka (69.13)
alternative label: Yritykset, sosiaalitoiminta (69.13)
alternative label: Yritysdemokratia (69.13)
broader: Liiketalous
in scheme: YKL - Yleisten kirjastojen luokitusjärjestelmä
notation: 69.13
scope note: Personalpolitik, personaladministration och personalfrågor i allmänhet i privata eller offentliga företag eller organisationer Hit även personalfrågor i allmänhet inom stats- och kommunalförvaltning och inom olika ministerier Personalens medbestämmande och medinflytande Personalundersökningar. Personalplanering Personalens struktur. Tjänster. Befattningar Anställning. Placering i arbete. Inskolning. Arbetsplatsutbildning. Mentorskap. Utvecklingssamtal. Arbetsdisciplin. Uppsägningar Instruktion på arbetsplatsen. Social verksamhet inom företaget Personalfrågor i företag och organisationer inom specialområden klassificeras enligt område @sv
scope note: Yksityisen tai julkisen yrityksen tai organisaation henkilöstöpolitiikka, henkilöstöhallinto ja henkilöstökysymykset yleensä Tähän myös valtion- ja kunnallishallinnon sekä eri ministeriöiden henkilöstökysymykset yleensä Työpaikka-, yritys- ja virastodemokratia Henkilöstötutkimukset. Henkilöstösuunnittelu Henkilöstön rakenne. Virat. Toimet Työhönotto. Työhön sijoittaminen. Työhön perehdyttäminen. Työpaikkakoulutus. Mentorointi. Kehityskeskustelut. Työkuri. Työstä erottaminen Työnohjaus. Yrityksen sosiaalitoiminta Erikoisalojen yritysten ja organisaatioiden henkilöstökysymykset luokitetaan alan mukaan

Työntutkimukset. Työanalyysi. Työn suunnittelu
type: Concept
References: Työ. Työelämä
References: Työsuojelu. Ergonomia
References: Johtamisen tekniikka ja menetelmät
References: Henkilöstöpolitiikka
type: YKL-luokka
alternative label: Ajankäyttötutkimukset, työntutkimukset, yl. (69.15)
alternative label: Arbete, klassificering. (69.15) @sv
alternative label: Arbete, mätning (69.15) @sv
alternative label: Arbete, organisation (69.15) @sv
alternative label: Arbete, planering (69.15) @sv
alternative label: Arbete, rationalisering (69.15) @sv
alternative label: Arbetsanalys (69.15) @sv
alternative label: Arbetsförlopp (69.15) @sv
alternative label: Arbetsplatsklassificering (69.15) @sv
alternative label: Arbetsundersökningar (69.15) @sv
alternative label: Befattningsbeskrivningar (69.15) @sv
alternative label: Grupparbete, arbetsorganisation (69.15) @sv
alternative label: Kvalitetscirklar (69.15) @sv
alternative label: Laatupiirit (69.15)
alternative label: Resultatkretsar (69.15) @sv
alternative label: Ryhmätyö, työn organisointi (69.15)
alternative label: Teamarbete (69.15) @sv
alternative label: Tidsanvändning, arbetsstudier, allm. (69.15) @sv
alternative label: Tiimityö (69.15)
alternative label: Toimenkuvat (69.15)
alternative label: Tulospiirit (69.15)
alternative label: Työ, järjestäminen (69.15)
alternative label: Työ, luokitus (69.15)
alternative label: Työ, mittaaminen (69.15)
alternative label: Työ, rationalisointi (69.15)
alternative label: Työ, suunnittelu (69.15)
alternative label: Työanalyysi (69.15)
alternative label: Työnkulku (69.15)
alternative label: Työntutkimukset (69.15)
alternative label: Työpaikkaluokitus (69.15)
broader: Liiketalous
in scheme: YKL - Yleisten kirjastojen luokitusjärjestelmä
notation: 69.15
preferred label: Arbetsstudier. Arbetsanalys. Planering av arbete @sv
preferred label: Work-studies. Work analysis. Planning of work @en
scope note: Arbetsstudier och arbetsanalys i allmänhet ur både privata och offentliga företags och organisationers synvinkel Planering, organisation och rationalisering av arbete Kvalitetscirklar. Resultatcirklar. Befattningsbeskrivning Arbetsmätning. Undersökningar av tidsanvändning Klassificering av arbete och arbetsplatser Arbetsstudier och arbetsanalys inom specialområden klassificeras enligt område @sv
scope note: Työntutkimukset ja työanalyysi sekä yksityisen että julkisen yrityksen tai organisaation kannalta yleensä Työn suunnittelu, järjestäminen ja rationalisointi Laatupiirit. Tulospiirit. Toimenkuvat. Työnkulku Työn mittaaminen. Ajankäyttötutkimukset Työn ja työpaikkojen luokitus Erikoisaloja koskevat työntutkimukset ja työanalyysi luokitetaan alan mukaan

Toimistotyö. Toimistotekniikka
type: Concept
References: Kansalaistoiminta ja –aktivismi. Järjestötoiminta. Kokoustekniikka.
References: Oikeusoppaat
References: Hienomekaaninen teollisuus
References: Sisustusoppaat
type: YKL-luokka
alternative label: Arkistointi, toimistotyö (69.16)
alternative label: Arkivering, kontorsarbete (69.16) @sv
alternative label: Asiakirjat, diariointi (69.16)
alternative label: Blanketter, kontorsarbete (69.16+) @sv
alternative label: Byråarbete (69.16+) @sv
alternative label: Diarieföring, kontorsarbete (69.16) @sv
alternative label: Diarieföring, kontorsarbete (69.16+) @sv
alternative label: Diariointi, toimistotyö (69.16)
alternative label: Elektroniska blanketter, kontorsarbete och kontorsteknik (69.16+) @sv
alternative label: Formulär, kontorsarbete (69.16+) @sv
alternative label: Formulär, planering (69.16) @sv
alternative label: Formulärplanering (69.16) @sv
alternative label: Fotokopieringsmaskiner, användning och service (69.16) @sv
alternative label: Handlingar, diarieföring (69.16) @sv
alternative label: Kaavakkeet, suunnittelu (69.16)
alternative label: Kaavakkeet, toimistotyö (69.16+)
alternative label: Kansliat, toimistotyöt (69.16+)
alternative label: Kanslier, kontorsarbete (69.16+) @sv
alternative label: Kanslistens arbete (69.16+) @sv
alternative label: Kanslistin työ (69.16+)
alternative label: Kassaapparater, kontorsteknik (69.16) @sv
alternative label: Kassakoneet, toimistotekniikka (69.16)
alternative label: Kassapäätteet, toimistotekniikka (69.16)
alternative label: Kassaterminaler, kontorsteknik (69.16) @sv
alternative label: Kirjaaminen, toimistotyö (69.16+)
alternative label: Kontorsarbete (69.16+) @sv
alternative label: Kontorsarbete, organisering och planering (69.16+) @sv
alternative label: Kontorsarbete, rationalisering (69.16+) @sv
alternative label: Kontorsautomation (69.16+) @sv
alternative label: Kontorsmaskiner, användning och service (69.16+) @sv
alternative label: Kontorsmaskintest (69.16+) @sv
alternative label: Kontorsmaterial (69.16+) @sv
alternative label: Kontorsteknik (69.16+) @sv
alternative label: Konttoriautomaatio (69.16+)
alternative label: Konttorikoneet, käyttö ja huolto (69.16+)
alternative label: Konttorikonetestit (69.16+)
alternative label: Konttoritarvikkeet (69.16+)
alternative label: Konttoritekniikka (69.16+)
alternative label: Konttorityö (69.16+)
alternative label: Konttorityö, organisointi ja suunnittelu (69.16+)
alternative label: Konttorityö, rationalisointi (69.16+)
alternative label: Kopiering, kontorsarbete (69.16) @sv
alternative label: Kopionti, toimistotyö (69.16)
alternative label: Laskukoneet, konttoritekniikka (69.16)
alternative label: Lomakesuunnittelu (69.16)
alternative label: Lomakkeet, toimistotyö (69.16+)
alternative label: Printning, kontorsarbete (69.16) @sv
alternative label: Räknemaskiner, kontorsteknik (69.16) @sv
alternative label: Sekreterarens arbete (69.16+) @sv
alternative label: Sihteerin työ (69.16+)
alternative label: Sähköiset lomakkeet, toimistotyö ja toimistotekniikka (69.16+)
alternative label: Toimistoautomaatio (69.16+)
alternative label: Toimistotarvikkeet (69.16+)
alternative label: Toimistotekniikka (69.16+)
alternative label: Toimistotyö (69.16+)
alternative label: Tulostaminen, toimistotyö (69.16)
alternative label: Tulostus, toimistotyö (69.16)
alternative label: Utskrift, kontorsarbete (69.16) @sv
alternative label: Valokopiokoneet, käyttö ja huolto (69.16)
alternative label: Virastotekniikka (69.16+)
alternative label: Virastotyö (69.16+)
alternative label: Ämbetsverksarbete (69.16+) @sv
broader: Liiketalous
in scheme: YKL - Yleisten kirjastojen luokitusjärjestelmä
narrower: Konekirjoitus. Tekstinkäsittely. Pikakirjoitus
narrower: Kauppakirjeenvaihto
notation: 69.16
preferred label: Kontorsarbete. Kontorsteknik @sv
preferred label: Office work. Office techniques @en
scope note: Hit och till underklasserna kontorsarbete och kontorsteknik i allmänhet ur både privata och offentliga företags och organisationers synvinkel Planering, organisation och rationalisering av kontorsarbete Kontorsautomation. Kontorsmaskiner. Kontorsmaterial Formulär. Blanketter. Blankettplanering Arkivering. Registrering. Sekreterarens arbete Kontor, kontorsarbeten och teknik inom specialområden klassificeras enligt område @sv
scope note: Tähän ja alaluokkiin toimistotyö ja -tekniikka sekä yksityisen että julkisen yrityksen tai organisaation kannalta yleensä Toimistotyön suunnittelu, organisointi ja rationalisointi Toimistoautomaatio. Toimistokoneet. Toimistotarvikkeet Kaavakkeet. Lomakkeet. Lomakesuunnittelu Arkistointi. Kirjaaminen. Sihteerin työ Erikoisalojen toimistot sekä niiden työt ja tekniikka luokitetaan alan mukaan

Konekirjoitus. Tekstinkäsittely. Pikakirjoitus
type: Concept
type: YKL-luokka
alternative label: Diktafoner, användning och underhåll (69.162) @sv
alternative label: Diktamen (69.162) @sv
alternative label: Diktamen, skrivning efter (69.162) @sv
alternative label: Kirjoituskoneet, käyttö ja huolto (69.162)
alternative label: Kirjoitustaito, konekirjoitus (69.162)
alternative label: Kirjoitustaito, tekstinkäsittely (69.162)
alternative label: Konekirjoitus (69.162)
alternative label: Konekirjoitusjärjestelmät (69.162)
alternative label: Maskinskrivning (69.162) @sv
alternative label: Maskinskrivningssystem (69.162) @sv
alternative label: Ordbehandlare, användning och service (69.162) @sv
alternative label: Pikakirjoitus (69.162)
alternative label: Sanelu (69.162)
alternative label: Sanelukoneet, käyttö ja huolto (69.162)
alternative label: Sanelusta kirjoittaminen (69.162)
alternative label: Sanojenkäsittelylaitteet, käyttö ja huolto (69.162)
alternative label: Skrivkunnighet, maskinskrivning (69.162) @sv
alternative label: Skrivkunnighet, ordbehandling (69.162) @sv
alternative label: Skrivmaskiner, användning och service (69.162) @sv
alternative label: Stenografi (69.162) @sv
alternative label: Tekstinkäsittely (69.162)
alternative label: Tekstinkäsittelylaitteet, käyttö ja huolto (69.162)
alternative label: Tekstinkäsittelyohjelmat (69.162)
alternative label: Textbehandlare, användning och service (69.162) @sv
alternative label: Textbehandling (69.162) @sv
alternative label: Textbehandlingsprogram (69.162) @sv
alternative label: Word for Windows, tekstinkäsittelyohjelma (69.162)
alternative label: Word for Windows, textbehandlingsprogram (69.162) @sv
alternative label: WordPerfect, tekstinkäsittelyohjelma (69.162)
alternative label: WordPerfect, textbehandlingsprogram (69.162) @sv
broader: Toimistotyö. Toimistotekniikka
in scheme: YKL - Yleisten kirjastojen luokitusjärjestelmä
notation: 69.162
preferred label: Maskinskrivning. Textbehandling. Stenografi @sv
preferred label: Typing. Word processing. Shorthand @en
scope note: Konekirjoitus-, tekstinkäsittely- ja pikakirjoitusjärjestelmät ja -oppaat Kirjoituskoneiden, tekstinkäsittelylaitteiden ja tekstinkäsittelyohjelmien käyttö Tietokoneiden käyttö tekstinkäsittelyyn Tähän myös sanelu ja sanelusta kirjoittaminen
scope note: System och handböcker för maskinskrivning, textbehandling och stenografi Användning av skrivmaskiner, textbehandlare och textbehandlingsprogram Användning av datorer för textbehandling Hit också diktamen och att skriva efter diktamen @sv

Kauppakirjeenvaihto
type: Concept
type: YKL-luokka
alternative label: Affärsbrev, modeller och handböcker (69.163) @sv
alternative label: Affärskorrespondens (69.163) @sv
alternative label: Brev, handelskorrespondens (69.163) @sv
alternative label: Brevväxling, handelskorrespondens (69.163) @sv
alternative label: Handelskorrespondens (69.163) @sv
alternative label: Hotellikirjeenvaihto (69.163)
alternative label: Hotellkorrespondens (69.163) @sv
alternative label: Kauppakirjeenvaihto (69.163)
alternative label: Kauppakirjemallit ja -oppaat (69.163)
alternative label: Kirjeenvaihto, kauppakirjeenvaihto (69.163)
alternative label: Kirjeet, kauppakirjeenvaihto (69.163)
alternative label: Liikekirjeenvaihto (69.163)
broader: Toimistotyö. Toimistotekniikka
in scheme: YKL - Yleisten kirjastojen luokitusjärjestelmä
notation: 69.163
preferred label: Business correspondence @en
preferred label: Handelskorrespondens @sv
scope note: Hit oavsett språk mallar och handböcker för affärsbrev Hit också hotellkorrespondens oavsett språk @sv
scope note: Tähän kielestä riippumatta eri alojen kauppakirjemallit ja -oppaat Tähän myös hotellikirjeenvaihto kielestä riippumatta

Liiketaloudellinen laskentatoimi
type: Concept
References: Julkinen talous. Finanssioppi
References: Taloussuunnittelu
References: Liiketalous
References: Markkinointi. Kauppa
type: YKL-luokka
alternative label: Arbetskraftskostnader, företagsekonomisk redovisning (69.2) @sv
alternative label: Budgetar, företag (69.2) @sv
alternative label: Budgetar, företags (69.2) @sv
alternative label: Budjetit, yritysten (69.2)
alternative label: Ekonomiförvaltning, redovisning (69.2+) @sv
alternative label: Ekonomisk matematik (69.2) @sv
alternative label: Föreningar, akonomi (69.2+) @sv
alternative label: Företag, budgetar (69.2) @sv
alternative label: Företagsekonomisk redovisning (69.2) @sv
alternative label: Handelsmatematik (69.2) @sv
alternative label: Inkomst- och avgiftsstater, företags (69.2) @sv
alternative label: Järjestöt, talous (69.2+)
alternative label: Kannattavuuslaskenta (69.2)
alternative label: Kauppamatematiikka (69.2)
alternative label: Kostnadsberäkning (69.2) @sv
alternative label: Kustannuslaskenta (69.2)
alternative label: Laskentatoimi, liiketaloudellinen (69.2)
alternative label: Liikelaskenta (69.2)
alternative label: Liiketaloudellinen laskentatoimi (69.2)
alternative label: Löneräkning (69.2) @sv
alternative label: Lönsamhetskalkyl (69.2) @sv
alternative label: Matematiikka, kauppamatematiikka (69.2)
alternative label: Matematiikka, talousmatematiikka (69.2)
alternative label: Matematik, ekonomisk matematik (69.2) @sv
alternative label: Matematik, handelsmatematik (69.2) @sv
alternative label: Miljöredovisning (69.2) @sv
alternative label: Omakustannuslaskenta (69.2)
alternative label: Organisationer, ekonomi (69.2+) @sv
alternative label: Palkanlaskenta (69.2)
alternative label: Redovisning, företagsekonomisk (69.2) @sv
alternative label: Riskanalys, företagsekonomisk redovisning (69.2) @sv
alternative label: Riskianalyysi, liiketaloudellinen laskentatoimi (69.2)
alternative label: Självkostnadskalkyl (69.2) @sv
alternative label: Talousarviot, yritysten (69.2)
alternative label: Taloushallinto, laskentatoimi (69.2+)
alternative label: Talousmatematiikka (69.2)
alternative label: Tulo- ja menoarviot, yritysten (69.2)
alternative label: Työvoimakustannukset, liiketaloudellinen laskentatoimi (69.2)
alternative label: Yhdistykset, talous (69.2+)
alternative label: Ympäristölaskentatoimi (69.2)
alternative label: Yritykset, talousarviot (69.2)
broader: LIIKETALOUS. MARKKINOINTI. KAUPPA. LIIKENNE
in scheme: YKL - Yleisten kirjastojen luokitusjärjestelmä
narrower: Liiketaloudellinen kirjanpito ja tilintarkastus
notation: 69.2
preferred label: Business accounting @en
preferred label: Företagsekonomisk redovisning @sv
scope note: Redovisning av privata företags eller organisationers verksamhet, verksamhetsplanering och kapitalomsättning i allmänhet Ekonomiska kalkyler och kostnads-, lönsamhets- och lönekalkyler i privata företag eller organisationer Budgetering i privata företag eller organisationer Hit också ekonomisk matematik och handelsmatematik i allmänhet Redovisning, ekonomisk kalkyl och kostnadsberäkning inom specialområden klassificeras enligt område Räntetabeller 69.208 @sv
scope note: Yksityisen yrityksen tai organisaation toimintaa, toiminnan suunnittelua ja pääomankiertoa koskeva laskentatoimi yleensä Yksityistä yritystä tai organisaatiota koskeva liike-, talous-, kustannus-, kannattavuus- ja palkanlaskenta Yksityisen yrityksen tai organisaation talousarvion laadinta Tähän myös talous- ja kauppamatematiikka yleensä Erikoisalojen laskentatoimi, talous- ja kustannuslaskenta sekä talousarviot luokitetaan alan mukaan Korkotaulut 69.208

Liiketaloudellinen kirjanpito ja tilintarkastus
type: Concept
References: Kirjanpito- ja tilintarkastuslainsäädäntö
References: Julkistaloudellinen kirjanpito ja tilintarkastus
type: YKL-luokka
alternative label: Bokföring, företagsekonomi (69.21) @sv
alternative label: Bokslut, företagsekonomi (69.21) @sv
alternative label: Företagsekonomisk bokföring (69.21) @sv
alternative label: Företagsekonomisk revision (69.21) @sv
alternative label: Kirjanpito, liiketaloudellinen (69.21)
alternative label: Liiketaloudellinen kirjanpito (69.21)
alternative label: Liiketaloudellinen tilintarkastus (69.21)
alternative label: Revision, företagsekonomi (69.21) @sv
alternative label: Räkenskapsföring, företagsekonomi (69.21) @sv
alternative label: Tilinpito, liiketalous (69.21)
alternative label: Tilinpäätös, liiketalous (69.21)
alternative label: Tilintarkastus, liiketalous (69.21)
alternative label: Toiminnantarkastus (69.21)
alternative label: Verksamhetsgranskning (69.21) @sv
broader: Liiketaloudellinen laskentatoimi
in scheme: YKL - Yleisten kirjastojen luokitusjärjestelmä
notation: 69.21
preferred label: Business bookkeeping and auditing @en
preferred label: Företagsekonomisk bokföring och revision @sv
scope note: Bokföring och revision i allmänhet i privata företag eller organisationer Bokföring och revision inom specialområden klassificeras enligt område @sv
scope note: Yksityisen yrityksen tai organisaation kirjanpito ja tilintarkastus yleensä Erikoisalojen kirjanpito ja tilintarkastus luokitetaan alan mukaan

Markkinointi. Kauppa
type: Concept
References: Kauppaoikeus
References: TALOUSTIEDE. KANSANTALOUSTIEDE
References: Hinnat. Hintapolitiikka
References: Kansainvälinen talous. Maailmankauppa
References: Suomen ulkomaankauppa
References: Kuluttajapolitiikka
References: Liiketaloudellinen laskentatoimi
alternative label: Alennusmyynnit (69.3+)
alternative label: Asiakkuus (69.3+)
alternative label: Business-to-business-myynti (69.3)
alternative label: Franchising (69.3+)
alternative label: Hinnoittelu, markkinointi (69.3+)
alternative label: Huutokauppa (69.3+)
alternative label: Itsepalvelumyymälät (69.3+)
alternative label: Jakelu, kauppa (69.3+)
alternative label: Kansainvälinen kauppa, yritystoiminta (69.3+)
alternative label: Kaupat (69.3+)
alternative label: Kauppa (69.3+)
alternative label: Kauppa, organisaatio (69.3+)
alternative label: Kauppahallit (69.3+)
alternative label: Kauppakamarit (69.3)
alternative label: Kauppakeskukset (69.3+)
alternative label: Kauppaketjut (69.3+)
alternative label: Kauppaoppi (69.3+)
alternative label: Kauppatapa (69.3+)
alternative label: Kauppatekniikka (69.3+)
alternative label: Kilpailu, kauppa ja markkinointi (69.3+)
alternative label: Kioskit (69.3+)
alternative label: Kirpputorit (69.3+)
alternative label: Kohderyhmätutkimukset, markkinointi (69.3+)
alternative label: Leasing (69.3+)
alternative label: Luottokauppa (69.3+)
alternative label: Maksujärjestelmät, kauppa (69.3)
alternative label: Maksumenetelmät, kauppa (69.3+)
alternative label: Marketit (69.3+)
alternative label: Markkinat (69.3+)
alternative label: Markkinatutkimukset (69.3+)
alternative label: Markkinointi (69.3+)
alternative label: Markkinointikampanjat (69.3+)
alternative label: Markkinointikanavat (69.3+)
alternative label: Markkinointiorganisaatiot (69.3+)
alternative label: Markkinointipolitiikka (69.3+)
alternative label: Markkinointisuunnitelmat (69.3+)
alternative label: Markkinointiviestintä (69.3+)
alternative label: Menekki, kauppa (69.3+)
alternative label: Myymäläautotoiminta (69.3+)
alternative label: Myymälät (69.3+)
alternative label: Osamaksukauppa (69.3+)
alternative label: Ostokeskukset (69.3+)
alternative label: Ostokäyttäytyminen, markkinointi (69.3)
alternative label: Osuuskaupat (69.3+)
alternative label: Osuusliikkeet (69.3+)
alternative label: Palvelumuotoilu (69.3+)
alternative label: Sponsorointi, markkinointi (69.3+)
alternative label: Sähköinen asiointi, kauppa (69.3+)
alternative label: Sähköinen kauppa (69.3+)
alternative label: Sähköinen laskutus, kauppa (69.3+)
alternative label: Sähköinen markkinointi (69.3+)
alternative label: Tavaratalot (69.3+)
alternative label: Telemarkkinat (69.3+)
alternative label: Torikauppa (69.3+)
alternative label: Tukkukauppa (69.3+)
alternative label: Valintamyymälät (69.3+)
alternative label: Verkkoasiointi, kauppa (69.3+)
alternative label: Verkkokauppa (69.3+)
alternative label: Vientimarkkinointi (69.3+)
alternative label: Vähittäiskauppa (69.3+)
alternative label: Yritysviestintä, markkinointi (69.3)
alternative label: b-to-b-myynti (69.3)
alternative label: b2b-myynti (69.3)
broader: LIIKETALOUS. MARKKINOINTI. KAUPPA. LIIKENNE
in scheme: YKL - Yleisten kirjastojen luokitusjärjestelmä
narrower: Tavaraoppi
narrower: Materiaalitoiminnot
narrower: Asiakaspalvelu. Myyntityö
narrower: Mainonta
notation: 69.3
scope note: Allmänna verk om marknadsföring och handel Marknadsföringens och handelns organisation. Service design Distributionsformer. Handelskutym. Kredit- och avbetalning Partihandel. Minuthandel. Andelshandel. Affärskedjor Varuhus. Snabbköp och stormarknader. Butiker. Kiosker. Butiksbilar. Torghandel Marknadsföringspolitik. Marknadsföringsplaner Marknadsföringskanaler. Marknadsföringskampanjer. Marknadskommunikation Marknadsundersökningar. Målgruppsundersökningar. Åtgång Realisationer och prissättning ur marknadsföringens synvinkel Exportmarknadsföring. Leasing. Franchising Marknadsföring och handel inom specialområden klassificeras enligt område Mässor i allmänhet 69.3063 @sv
scope note: Markkinoinnin ja kaupan yleisteokset Markkinoinnin ja kaupan organisaatio. Palvelumuotoilu Jakelun muodot. Kauppatapa. Luotto- ja osamaksukauppa Tukkukauppa. Vähittäiskauppa. Osuuskauppa. Kauppaketjut Tavaratalot. Marketit. Myymälät. Kioskit. Myymäläautotoiminta. Torikauppa Markkinointipolitiikka. Markkinointisuunnitelmat Markkinointikanavat. Markkinointikampanjat. Markkinointiviestintä Markkinatutkimukset. Kohderyhmätutkimukset. Menekki Alennusmyynnit ja hinnoittelu markkinoinnin kannalta Vientimarkkinointi. Leasing. Franchising Erikoisalojen markkinointi ja kauppa luokitetaan alan mukaan Messut yleensä 69.3063

Tavaraoppi
type: Concept
References: Immateriaalioikeudet
References: Aineoppi. Aineenkoetus. Tekninen mekaniikka
References: Materiaalitoiminnot
References: Mainonta
type: YKL-luokka
alternative label: Elinkaari, tuotteet (69.32)
alternative label: Elinkaarianalyysi (69.32)
alternative label: Halvfabrikat, varukunskap (69.32) @sv
alternative label: Handel, varukunskap (69.32) @sv
alternative label: Handelskemi (69.32) @sv
alternative label: Handelsvaror (69.32) @sv
alternative label: Kauppa, tavaraoppi (69.32)
alternative label: Kauppakemia (69.32)
alternative label: Kauppatavarat (69.32)
alternative label: Kvalitetskontroll, varukunskap (69.32) @sv
alternative label: Laadunvalvonta, tavaraoppi (69.32)
alternative label: Livscykel, produkter (69.32) @sv
alternative label: Livscykelanalys (69.32) @sv
alternative label: Lopputuotteet, tavaraoppi (69.32)
alternative label: Merkkituotteet (69.32)
alternative label: Märkesvaror (69.32) @sv
alternative label: Produktgruppindelning, varukunskap (69.32) @sv
alternative label: Puolivalmisteet, tavaraoppi (69.32)
alternative label: Raaka-aineet, tavaraoppi (69.32)
alternative label: Råmaterial, varukunskap (69.32) @sv
alternative label: Slutprodukter, varukunskap (69.32) @sv
alternative label: Tavaraoppi (69.32)
alternative label: Tuoteryhmäjako, tavaraoppi (69.32)
alternative label: Tuotetieto (69.32)
alternative label: Varukunskap (69.32) @sv
alternative label: Varulära (69.32) @sv
broader: Markkinointi. Kauppa
in scheme: YKL - Yleisten kirjastojen luokitusjärjestelmä
notation: 69.32
preferred label: Goods and commodities @en
preferred label: Varukunskap @sv
scope note: Hit allmänna verk om varukunskap och varulära Handelsvaror. Märkesvaror Råmaterial, halvfabrikat och slutprodukter ur varukunskapens synvinkel Produktgruppsindelning i allmänhet Varukunskap inom specialområden klassificeras enligt område @sv
scope note: Tähän tavaraopin ja tuotetiedon yleisteokset Kauppatavarat. Merkkituotteet Raaka-aineet, puolivalmisteet ja lopputuotteet tavaraopin kannalta Tuoteryhmäjako yleensä Erikoisalojen tavaraoppi luokitetaan alan mukaan

Materiaalitoiminnot
type: Concept
References: Nosto- ja kuljetuslaitteet. Hydrauliikka
References: Paperi- ja selluloosateollisuus
References: Tavaraoppi
References: Liikenne
type: YKL-luokka
alternative label: Anskaffningsorganisation (69.33) @sv
alternative label: Farliga ämnen, lagring (69.33) @sv
alternative label: Förpackning, materialfunktioner (69.33) @sv
alternative label: Handel, materialfunktioner (69.33) @sv
alternative label: Hankintaorganisaatio (69.33)
alternative label: Havstransport, logistik (69.33) @sv
alternative label: Huolinta (69.33)
alternative label: Ilmakuljetus, logistiikka (69.33)
alternative label: Inköpsorganisation (69.33) @sv
alternative label: Inventering (69.33) @sv
alternative label: Inventointi (69.33)
alternative label: Järnvägstransport, logistik (69.33) @sv
alternative label: Kauppa, materiaalitoiminnot (69.33)
alternative label: Kombinerade transporter, logistik (69.33) @sv
alternative label: Kuljetusala, logistiikka (69.33)
alternative label: Kuljetusorganisaatio (69.33)
alternative label: Lagring, handel (69.33) @sv
alternative label: Landtransport, logistik (69.33) @sv
alternative label: Logistiikka, materiaalitoiminnot (69.33)
alternative label: Logistik, materialfunktioner (69.33) @sv
alternative label: Lufttransport, logistik (69.33) @sv
alternative label: Maakuljetus, logistiikka (69.33)
alternative label: Materiaalihallinto (69.33)
alternative label: Materiaalitoiminnot, kauppa (69.33)
alternative label: Materialadministration (69.33) @sv
alternative label: Materialfunktioner, handel (69.33) @sv
alternative label: Merikuljetus, logistiikka (69.33)
alternative label: Osto-organisaatio (69.33)
alternative label: Pakkaus, materiaalitoiminnot (69.33)
alternative label: Rautatiekuljetus, logistiikka (69.33)
alternative label: Sjötransport, logistik (69.33) @sv
alternative label: Spedition (69.33) @sv
alternative label: Tavaran inventointi (69.33)
alternative label: Tavaran varastointi (69.33)
alternative label: Tavaranhankinta (69.33)
alternative label: Tavarankuljetus (69.33)
alternative label: Tiekuljetus, logistiikka (69.33)
alternative label: Transportorganisationer (69.33) @sv
alternative label: Transportsektorn, logistik (69.33) @sv
alternative label: Vaaralliset aineet, varastointi (69.33)
alternative label: Varastointi, kauppa (69.33)
alternative label: Varuanskaffning (69.33) @sv
alternative label: Varuinventering (69.33) @sv
alternative label: Varulagring (69.33) @sv
alternative label: Varutransport (69.33) @sv
alternative label: Vesikuljetus, logistiikka (69.33)
alternative label: Vägtransport, logistik (69.33) @sv
alternative label: Yhdistetyt kuljetukset, logistiikka (69.33)
alternative label: leveranskedjor (69.33) @sv
alternative label: toimitusketjut (69.33)
broader: Markkinointi. Kauppa
in scheme: YKL - Yleisten kirjastojen luokitusjärjestelmä
notation: 69.33
preferred label: Materialadministration @sv
preferred label: Materials management @en
scope note: Hit handelns materialadministration i allmänhet Leveranser. Köp. Transport. Lagring. Inventering Hit också lagring av farliga ämnen Materialadministration inom specialområden klassificeras enligt område @sv
scope note: Tähän kaupan materiaalitoiminnot yleensä Huolinta yleensä Hankinta. Osto. Kuljetus. Varastointi. Inventointi Tähän myös vaarallisten aineiden varastointi Erikoisalojen materiaalitoiminnot luokitetaan alan mukaan

Asiakaspalvelu. Myyntityö
type: Concept
type: YKL-luokka
alternative label: Asiakasneuvonta (69.34)
alternative label: Asiakaspalvelu (69.34)
alternative label: Automaattimyynti (69.34)
alternative label: Automatförsäljning (69.34) @sv
alternative label: Butiksrutiner (69.34) @sv
alternative label: Direktförsäljning (69.34) @sv
alternative label: Försäljarens arbete (69.34) @sv
alternative label: Försäljningsarbete (69.34) @sv
alternative label: Försäljningsteknik och metoder (69.34) @sv
alternative label: Handel, kundtjänst (69.34) @sv
alternative label: Itsepalvelu (69.34)
alternative label: Kauppa, asiakaspalvelu (69.34)
alternative label: Kontor, kundtjänst (69.34) @sv
alternative label: Konttorit, asiakaspalvelu (69.34)
alternative label: Kundrådgivning (69.34) @sv
alternative label: Kundtjänst (69.34) @sv
alternative label: Myyjän työ (69.34)
alternative label: Myymälärutiinit (69.34)
alternative label: Myyntitekniikka ja menetelmät (69.34)
alternative label: Myyntityö (69.34)
alternative label: Palvelu, asiakaspalvelu (69.34)
alternative label: Palvelut, asiakaspalvelu (69.34)
alternative label: Postförsäljning (69.34) @sv
alternative label: Postimyynti (69.34)
alternative label: Puhelinmyynti (69.34)
alternative label: Service, kundservice (69.34) @sv
alternative label: Service, kundtjänst (69.34) @sv
alternative label: Självbetjäning (69.34) @sv
alternative label: Suoramyynti (69.34)
alternative label: Telefonförsäljning (69.34) @sv
alternative label: Toimistot, asiakaspalvelu (69.34)
alternative label: Virastot, asiakaspalvelu (69.34)
alternative label: Ämbetsverk, kundtjänst (69.34) @sv
broader: Markkinointi. Kauppa
in scheme: YKL - Yleisten kirjastojen luokitusjärjestelmä
notation: 69.34
preferred label: Customer service. Salesmanship @en
preferred label: Kundtjänst. Försäljningsarbete @sv
scope note: Asiakaspalvelu, asiakasneuvonta ja myyntityö yleensä Asiakaspalvelu yksityisissä ja julkisissa laitoksissa, virastoissa ja toimistoissa yleensä Kaupan asiakaspalvelu yleensä Myyntitavat ja -menetelmät. Myyntitekniikka Myymälärutiinit. Itsepalvelu. Automaattimyynti. Postimyynti. Puhelinmyynti. Suoramyynti Erikoisalojen asiakaspalvelu, asiakasneuvonta ja myyntityö luokitetaan alan mukaan
scope note: Kundtjänst, kundrådgivning och försäljningsarbete i allmänhet Privata och offentliga företags, inrättningars och kontors kundtjänst i allmänhet Handelns kundtjänst i allmänhet Försäljningspraxis och försäljningsmetoder. Försäljningsteknik Butiksrutiner. Självbetjäning. Automatförsäljning. Postorder. Telefonförsäljning. Direktförsäljning Kundbetjäning, kundrådgivning och försäljningsarbete inom specialområden klassificeras enligt område @sv

Mainonta
type: Concept
References: VIESTINTÄ. JOUKKOVIESTINTÄ
References: Kauppaoikeus
References: Kuluttajapolitiikka
References: Liiketalous
References: Asiakaspalvelu. Myyntityö
References: Käyttögrafiikka
alternative label: Affischer, reklam (69.35) @sv
alternative label: Annonsering (69.35) @sv
alternative label: Brandit (69.35)
alternative label: Brands (69.35) @sv
alternative label: Brandyn (69.35) @sv
alternative label: Brändit (69.35)
alternative label: Dekorering (69.35) @sv
alternative label: Firmor, logoer (69.35) @sv
alternative label: Företagskommunikation, reklam (69.35) @sv
alternative label: Förpackningsbeteckningar (69.35) @sv
alternative label: Förpackningsplanering (69.35) @sv
alternative label: Försäljningshöljetexter (69.35) @sv
alternative label: Handel, reklam (69.35) @sv
alternative label: Ilmoittelu (69.35)
alternative label: Internet-mainonta (69.35)
alternative label: Internet-reklam (69.35) @sv
alternative label: Julisteet, mainonta (69.35)
alternative label: Kauppa, mainonta (69.35)
alternative label: Käyntikortit (69.35)
alternative label: Lehtimainonta (69.35)
alternative label: Liikemerkit (69.35)
alternative label: Logoer (69.35) @sv
alternative label: Logot (69.35)
alternative label: Logotyper (69.35) @sv
alternative label: Mainokset (69.35)
alternative label: Mainokset, suunnittelu (69.35)
alternative label: Mainonta (69.35)
alternative label: Mainonta, kohteet ja lajit (69.35)
alternative label: Mainonta, psykologia ja tekniikka (69.35)
alternative label: Mainoselokuvat (69.35)
alternative label: Mainospiirtäjän työ (69.35)
alternative label: Mainostoimistot (69.35)
alternative label: Manipulaatio, mainonta (69.35)
alternative label: Manipulation, reklam (69.35) @sv
alternative label: Myyntipäällysmerkinnät (69.35)
alternative label: Nätreklam (69.35) @sv
alternative label: Näyteikkunat (69.35)
alternative label: Pakkausmerkinnät (69.35)
alternative label: Pakkaussuunnittelu (69.35)
alternative label: Piraattituotteet, tavaramerkit (69.35)
alternative label: Piratism, varumärken (69.35) @sv
alternative label: Piratismi, tavaramerkit (69.35)
alternative label: Piratprodukter, varumärken (69.35) @sv
alternative label: Plagiaatit, tavaramerkit (69.35)
alternative label: Plagiat, varumärken (69.35) @sv
alternative label: Plagiering, varumärken (69.35) @sv
alternative label: Plagiointi, tavaramerkit (69.35)
alternative label: Produktdemonstrationer (69.35) @sv
alternative label: Produktmärken (69.35) @sv
alternative label: Radiomainonta (69.35)
alternative label: Radioreklam (69.35) @sv
alternative label: Reklam (69.35) @sv
alternative label: Reklam, målgrupper och former (69.35) @sv
alternative label: Reklam, planering (69.35) @sv
alternative label: Reklam, psykologi och teknik (69.35) @sv
alternative label: Reklambyråer (69.35) @sv
alternative label: Reklamfilmer (69.35) @sv
alternative label: Reklamtecknarens arbete (69.35) @sv
alternative label: Skyltfönster (69.35) @sv
alternative label: Somistus (69.35)
alternative label: TV-reklam (69.35) @sv
alternative label: Tavaramerkit (69.35)
alternative label: Televisiomainonta (69.35)
alternative label: Toiminimet, tunnukset (69.35)
alternative label: Tuote-esittelyt (69.35)
alternative label: Tuotemerkit (69.35)
alternative label: Verkkomainonta (69.35)
alternative label: Yritysviestintä, mainonta (69.35)
broader: Markkinointi. Kauppa
in scheme: YKL - Yleisten kirjastojen luokitusjärjestelmä
notation: 69.35
scope note: Hit allmänna verk om reklam Reklambyråer. Planering av reklam Reklamens psykologi. Reklamens teknik Reklamens former. Reklamens målgrupper Dekoration. Skyltfönster. Förpackningsplanering Brands. Varu- och firmamärken. Förpackningstexter Produktdemonstrationer. TV-, radio- Internet- och tidningsreklam Reklamens förhållande till medier och masskommunikation Reklam inom specialområden klassificeras enligt område Förteckningar över varu- och firmamärken i allmänhet 69.3503 @sv
scope note: Tähän mainonnan yleisteokset Mainostoimistot. Mainosten suunnittelu Mainonnan psykologia. Mainonnan tekniikka Mainonnan lajit. Mainonnan kohteet Somistus. Näyteikkunat. Pakkaussuunnittelu Brändit. Tavara- ja liikemerkit. Myyntipäällysmerkinnät Tuote-esittely. Tv-, radio- ja lehti- ja Internet-mainonta Mainonnan suhteet tiedotusvälineisiin ja joukkotiedotukseen Erikoisalojen mainonta luokitetaan alan mukaan Tavara- ja liikemerkkiluettelot yleensä 69.3503

Liikenne
type: Concept
References: Liikennelainsäädäntö
References: Liikennesuunnittelu
References: Liikennevälineet
References: Tienrakennus
References: Vesirakennus
type: YKL-luokka
alternative label: Arbetsfärder, trafik (69.6+) @sv
alternative label: Asemarakennukset, liikenne (69.6+)
alternative label: Besiktning (69.6+) @sv
alternative label: Farliga ämnen, transport (69.6+) @sv
alternative label: Faromoment, trafik (69.6+) @sv
alternative label: GPS, liikenne (69.6+)
alternative label: GPS, trafik (69.6+) @sv
alternative label: Godstrafik (69.6+) @sv
alternative label: Joukkoliikenne (69.6+)
alternative label: Julkinen liikenne (69.6+)
alternative label: Katsastus (69.6+)
alternative label: Kollektivtrafik (69.6+) @sv
alternative label: Kuljetusala, liikenne (69.6+)
alternative label: Liikenne (69.6+)
alternative label: Liikennekasvatus (69.6+)
alternative label: Liikennelaskenta (69.6+)
alternative label: Liikennemelu, liikenne (69.6+)
alternative label: Liikennemerkit (69.6+)
alternative label: Liikenneonnettomuudet (69.6+)
alternative label: Liikenneopetus (69.6+)
alternative label: Liikennepolitiikka (69.6+)
alternative label: Liikennesäännöt (69.6+)
alternative label: Liikenneturvallisuus (69.6+)
alternative label: Liikenneverkot, liikenne (69.6+)
alternative label: Liikenneväylät, liikenne (69.6+)
alternative label: Liikenteen ammatit (69.6+)
alternative label: Paikannus, liikenne (69.6+)
alternative label: Paikantimet, liikenne (69.6+)
alternative label: Positioneringsutrustningar, trafik (69.6+) @sv
alternative label: Positionsbestämning, trafik (69.6+) @sv
alternative label: Rahtiliikenne (69.6+)
alternative label: Satelliittipaikannus, liikenne (69.6+)
alternative label: Satellitnavigering, trafik (69.6+) @sv
alternative label: Stationsbyggnader, trafik (69.6+) @sv
alternative label: Trafik (69.6+) @sv
alternative label: Trafik, yrken inom trafiken (69.6+) @sv
alternative label: Trafikbuller, trafik (69.6+) @sv
alternative label: Trafikfostran (69.6+) @sv
alternative label: Trafikleder, trafik (69.6+) @sv
alternative label: Trafiknät, trafik (69.6+) @sv
alternative label: Trafikolyckor (69.6+) @sv
alternative label: Trafikpolitik (69.6+) @sv
alternative label: Trafikregler (69.6+) @sv
alternative label: Trafikräkning (69.6+) @sv
alternative label: Trafiksäkerhet (69.6+) @sv
alternative label: Trafikundervisning (69.6+) @sv
alternative label: Transportsektorn, trafik (69.6+) @sv
alternative label: Työmatkaliikenne (69.6+)
alternative label: Työmatkat, liikenne (69.6)
alternative label: Vaaralliset aineet, kuljetus (69.6+)
alternative label: Vaaratilanteet, liikenne (69.6+)
alternative label: Vägmärken (69.6+) @sv
broader: LIIKETALOUS. MARKKINOINTI. KAUPPA. LIIKENNE
in scheme: YKL - Yleisten kirjastojen luokitusjärjestelmä
narrower: Maaliikenne
narrower: Vesiliikenne
narrower: Lentoliikenne
notation: 69.6
preferred label: Traffic @en
preferred label: Trafik @sv
scope note: Hit och till underklasserna offentlig och privat trafik, trafikpolitik, trafikregler, trafikundervisning, trafikfostran och trafiksäkerhet Hit och till underklasserna också trafikleder och trafiknät ur trafikens synvinkel Hit och till underklasserna också transport av farliga ämnen Om verket behandlar både trafik och trafikmedel ges företräde åt klass 69.6+ Tidtabeller i allmänhet 69.603 Trafikens och trafikledernas historia i allmänhet 69.609 @sv
scope note: Tähän ja alaluokkiin julkinen ja yksityinen liikenne, liikennepolitiikka, liikennesäännöt, liikenneopetus, liikennekasvatus ja liikenneturvallisuus Tähän ja alaluokkiin myös liikenneväylät ja -verkot liikenteen kannalta Tähän ja alaluokkiin myös vaarallisten aineiden kuljetus Jos teos koskee sekä liikennettä että liikennevälineitä, annetaan etusija luokalle 69.6+ Aikataulut yleensä 69.603 Liikenteen ja liikenneväylien historia yleensä 69.609

Maaliikenne
type: Concept
References: Liikennelainsäädäntö
References: Liikennesuunnittelu
References: Moottoriajoneuvot
References: Junat. Raitiovaunut. Metrovaunut
References: Polkupyörät
References: Tienrakennus
References: Pyöräily
References: Lentourheilu. Moottoriurheilu
alternative label: Ajaminen, maakulkuneuvot (69.62)
alternative label: Ajo-opetus, maakulkuneuvot (69.62)
alternative label: Ajokorttitutkinto (69.62)
alternative label: Ajokyky, maakulkuneuvot (69.62)
alternative label: Ajotaito ja -tekniikka, maakulkuneuvot (69.62)
alternative label: Ajotaito, maakulkuneuvot (69.62)
alternative label: Auto-onnettomuudet (69.62)
alternative label: Autoilu (69.62)
alternative label: Autokoulut (69.62)
alternative label: Autoliikenne (69.62)
alternative label: Autonkuljettajan työ (69.62)
alternative label: Autonvuokraus (69.62)
alternative label: Autot, liikenne (69.62)
alternative label: Bussiliikenne (69.62)
alternative label: Heiluriliikenne (69.62)
alternative label: Huoltamot, maaliikenne (69.62)
alternative label: Huoltoasematoiminta, maaliikenne (69.62)
alternative label: Jalankulku, liikenne (69.62)
alternative label: Johdinautoliikenne (69.62)
alternative label: Joukkoliikenne, maaliikenne (69.62)
alternative label: Julkinen liikenne, maaliikenne (69.62)
alternative label: Junat, rautatieliikenne (69.62)
alternative label: Kadut, liikenne (69.62)
alternative label: Katuliikenne (69.62)
alternative label: Kaupunkiliikenne (69.62)
alternative label: Kelkkailu, moottorikelkkaliikenne (69.62)
alternative label: Kevyt liikenne (69.62)
alternative label: Kävelykadut, liikenne (69.62)
alternative label: Liikenteen ammatit, maaliikenne (69.62)
alternative label: Linja-autoliikenne (69.62)
alternative label: Lossit, liikenne (69.62)
alternative label: Maakuljetus, liikenne (69.62)
alternative label: Maaliikenne (69.62)
alternative label: Maaliikenneväylät, liikenne (69.62)
alternative label: Maantiet, liikenne (69.62)
alternative label: Maastoliikenne (69.62)
alternative label: Matkakortit, maaliikenne (69.62)
alternative label: Metro, liikenne (69.62)
alternative label: Moottoriajoneuvoliikenne (69.62)
alternative label: Moottorikelkkaliikenne (69.62)
alternative label: Moottoripyörät, liikenne (69.62)
alternative label: Moottoritiet, liikenne (69.62)
alternative label: Onnettomuudet, liikenneonnettomuudet, maaliikenne (69.62)
alternative label: Paikallisliikenne, maaliikenne (69.62)
alternative label: Paikoitus, liikenne (69.62)
alternative label: Pendeliliikenne (69.62)
alternative label: Polkupyörät, liikenne (69.62)
alternative label: Pysäköinninvalvonta (69.62)
alternative label: Pysäköinti, liikenne (69.62)
alternative label: Pyörätiet, liikenne (69.62)
alternative label: Raideliikenne (69.62)
alternative label: Raitiotiet, liikenne (69.62)
alternative label: Raitiovaunut, liikenne (69.62)
alternative label: Raskas liikenne (69.62)
alternative label: Rattijuoppous, liikenneturvallisuus (69.62)
alternative label: Rautatieasemat, liikenne (69.62)
alternative label: Rautatiekuljetus, liikenne (69.62)
alternative label: Rautatiet, liikenne (69.62)
alternative label: Taksitoiminta (69.62)
alternative label: Tiekuljetus, liikenne (69.62)
alternative label: Tieliikenne (69.62)
alternative label: Tieliikennerikokset, liikenneturvallisuus (69.62)
alternative label: Tiemaksut (69.62)
alternative label: Tiet, liikenne (69.62)
alternative label: Tietullit (69.62)
alternative label: Turvavyöt, autot, käyttö (69.62)
broader: Liikenne
in scheme: YKL - Yleisten kirjastojen luokitusjärjestelmä
notation: 69.62
scope note: Tie- ja katuliikenne. Raideliikenne. Kevyt liikenne Maaliikenteen liikennepolitiikka, liikennesäännöt, liikenneopetus, liikennekasvatus ja liikenneturvallisuus Liikenneväylät, -verkot ja asemat maaliikenteen kannalta Autokoulut. Ajo-opetus. Ajotaito. Liikenteen ammatit Moottoriajoneuvoliikenne. Autoilu yleensä Autoliikenne. Linja-autoliikenne. Moottoripyöräliikenne Pysäköinti. Tietullit. Tiemaksut. Huoltoasemat Rautatieliikenne. Raitiotieliikenne. Metroliikenne Paikallis- ja joukkoliikenne maaliikenteen kannalta Polkupyöräliikenne. Jalankulku Maastoliikenne. Moottorikelkkailu Jos teos koskee sekä maaliikennettä että maakulkuneuvoja, annetaan etusija luokalle 69.62 Maaliikenteen aikataulut 69.6203 Maaliikenteen ja maaliikenneväylien historia 69.6209
scope note: Väg- och gatutrafik. Spårtrafik. Lätt trafik Vägpolitik, trafikregler, trafikundervisning, trafikfostran och trafiksäkerhet inom landtrafiken Trafikleder, trafiknät och stationer inom landtrafiken Bilskolor. Körundervisning. Körförmåga Yrken inom trafiken Motorfordonstrafik. Bilism i allmänhet Biltrafik. Busstrafik. Motorcykeltrafik Parkering. Vägtullar. Vägavgifter. Bensinstationer Järnvägstrafik. Spårvägstrafik. Metrotrafik Lokal- och kollektivtrafik till lands Cykeltrafik. Fotgängartrafik Terrängtrafik. Snöskoteråkning Om verket behandlar både landtrafik och landtrafikfordon, ges företräde åt klass 69.62 Landtrafikens tidtabeller 69.6203 Landtrafikens och landtrafikledernas historia 69.6209 @sv

Vesiliikenne
type: Concept
References: Liikennelainsäädäntö
References: Merivoimat. Merisodankäynti
References: Vesikulkuneuvot
References: Solmeilu. Makramee. Fransut
References: Vesirakennus
References: Soutu. Melonta. Purjehdus
References: Moottoriveneurheilu
References: Yleinen arkeologia
alternative label: Ahtaaminen (69.63)
alternative label: Autolauttaliikenne (69.63)
alternative label: Bilfärjetrafik (69.63) @sv
alternative label: Båthamnar (69.63) @sv
alternative label: Båthamnsguider (69.63) @sv
alternative label: Båtsport (69.63) @sv
alternative label: Båttrafik (69.63) @sv
alternative label: Fartyg, sjötrafik (69.63) @sv
alternative label: Fartygstrafik (69.63) @sv
alternative label: Floder, trafik (69.63) @sv
alternative label: Fyrar (69.63) @sv
alternative label: Fyrväsen (69.63) @sv
alternative label: Färjtrafik (69.63) @sv
alternative label: Haaksirikot (69.63)
alternative label: Hamnar, sjötrafik (69.63) @sv
alternative label: Hamnarbeten (69.63) @sv
alternative label: Huoltamot, vesiliikenne (69.63)
alternative label: Huoltoasematoiminta, vesiliikenne (69.63)
alternative label: Höyrylaivat, vesiliikenne (69.63)
alternative label: Joet, liikenne (69.63)
alternative label: Järvet, liikenne (69.63)
alternative label: Kanavat, liikenne (69.63)
alternative label: Kauppalaivasto, meriliikenne (69.63)
alternative label: Kauppamerenkulku (69.63)
alternative label: Koillisväylä, liikenneväylät (69.63)
alternative label: Kompassit, merenkulkuoppi (69.63)
alternative label: Laivaliikenne (69.63)
alternative label: Laivat, vesiliikenne (69.63)
alternative label: Laivaus (69.63)
alternative label: Lauttaliikenne (69.63)
alternative label: Lokikirjat (69.63)
alternative label: Luotsilaitos (69.63)
alternative label: Luotsin työ (69.63)
alternative label: Majakat (69.63)
alternative label: Majakkalaitos (69.63)
alternative label: Merenkulku (69.63)
alternative label: Merenkulkuoppi (69.63)
alternative label: Merenkulun ammatit (69.63)
alternative label: Merikuljetus, liikenne (69.63)
alternative label: Meriliikenne (69.63)
alternative label: Merimerkit (69.63)
alternative label: Merimiehen työ (69.63)
alternative label: Merionnettomuudet (69.63)
alternative label: Merirosvous, merenkulku (69.63)
alternative label: Meriselitykset (69.63)
alternative label: Meritiet (69.63)
alternative label: Meriväylät (69.63)
alternative label: Navigaatio, merenkulkuoppi (69.63)
alternative label: Onnettomuudet, merionnettomuudet (69.63)
alternative label: Purjehdus, navigointi (69.63)
alternative label: Purjehdus, vesiliikenne ja veneily (69.63)
alternative label: Purjeveneet, vesiliikenne ja veneily (69.63)
alternative label: Satamalaitos (69.63)
alternative label: Satamat, vesiliikenne (69.63)
alternative label: Satamatyöt (69.63)
alternative label: Sisävesiliikenne (69.63)
alternative label: Siviilimerenkulku (69.63)
alternative label: Solmut, merimiestaito (69.63)
alternative label: Valtameriliikenne (69.63)
alternative label: Veneily (69.63)
alternative label: Veneliikenne (69.63)
alternative label: Venesatamaoppaat (69.63)
alternative label: Venesatamatoiminta (69.63)
alternative label: Vesikuljetus, liikenne (69.63)
alternative label: Vesiliikenne (69.63)
alternative label: Vesiväylät, liikenne (69.63)
broader: Liikenne
in scheme: YKL - Yleisten kirjastojen luokitusjärjestelmä
notation: 69.63
scope note: Meri- ja sisävesiliikenne. Vene- ja laivaliikenne. Vesiliikenteen liikennepolitiikka, liikennesäännöt, liikenneopetus, liikennekasvatus ja liikenneturvallisuus . Liikenneväylät, -verkot ja satamat vesiliikenteen kannalta. Merenkulku yleensä. Kauppamerenkulku. Veneily yleensä. Venesatamaoppaat. Navigaatio. Vesiliikenteen ammatit. Merimiestaidot. Majakkalaitos. Luotsilaitos. Satamalaitos. Satamatyöt. Jos teos koskee sekä vesiliikennettä että vesikulkuneuvoja, annetaan etusija luokalle 69.63. Merikortit ja merikartat 69.6302. Vesiliikenteen aikataulut 69.6303. Vesiliikenteen, merenkulun ja haaksirikkojen historia 69.6309. Hylyt 69.6309
scope note: Sjöfart på hav och insjöar. Båt- och fartygstrafik. Trafikpolitik, trafikregler, trafikundervisning, trafikfostran och trafiksäkerhet inom sjötrafiken. Trafikleder, trafiknät och hamnar inom sjötrafiken. Sjöfart i allmänhet. Handelssjöfart. Småbåtstrafik i allmänhet. Hamnguider för småbåtar. Navigation. Sjöfartsyrken. Sjömanskunskap. Fyrväsen. Lotsväsen. Hamnväsen. Hamnarbeten. Om verket behandlar både sjöfart och vattenfarkoster, ges företräde åt klass 69.63. Sjökort och sjökartor 69.6302. Sjötrafikens tidtabeller 69.6303. Sjötrafikens, sjöfartens och skeppsbrottens historia 69.6309. Vrak 69.6309 @sv

Lentoliikenne
type: Concept
References: Kriminologia. Kriminaalisosiologia
References: Liikennelainsäädäntö
References: Ilmavoimat. Ilmasodankäynti
References: Avaruustutkimus. Avaruustoiminta
References: Ilmakulkuneuvot
References: Lentourheilu
type: YKL-luokka
alternative label: Civilflyg (69.64) @sv
alternative label: Flygarens arbete (69.64) @sv
alternative label: Flygbolag (69.64) @sv
alternative label: Flygfält, lufttrafik (69.64) @sv
alternative label: Flygolyckor (69.64) @sv
alternative label: Flygplan, styrning (69.64) @sv
alternative label: Flygrutter (69.64) @sv
alternative label: Flygtrafik (69.64) @sv
alternative label: Flygtrafikledning (69.64) @sv
alternative label: Flygtrafiklära (69.64) @sv
alternative label: Flygundervisning (69.64) @sv
alternative label: Flygvärdinnans arbete (69.64) @sv
alternative label: Ilmailu (69.64)
alternative label: Ilmailu, ilmaliikenne (69.64)
alternative label: Ilmakuljetus, liikenne (69.64)
alternative label: Ilmaliikenne (69.64)
alternative label: Lennonjohto (69.64)
alternative label: Lento-onnettomuudet (69.64)
alternative label: Lento-opetus (69.64)
alternative label: Lentoemännän työ (69.64)
alternative label: Lentokentät, ilmaliikenne (69.64)
alternative label: Lentokoneet, ohjaus (69.64)
alternative label: Lentoliikenne (69.64)
alternative label: Lentoliikenneoppi (69.64)
alternative label: Lentoreitit (69.64)
alternative label: Lentoyhtiöt (69.64)
alternative label: Lentäjän työ (69.64)
alternative label: Luftfart (69.64) @sv
alternative label: Luftfart, lufttrafik (69.64) @sv
alternative label: Lufttrafik (69.64) @sv
alternative label: Lufttransport, trafik (69.64) @sv
alternative label: Olyckor, flygolyckor (69.64) @sv
alternative label: Onnettomuudet, lento-onnettomuudet (69.64)
alternative label: Siviili-ilmailu (69.64)
alternative label: Säkerhetsarrangemang, flygtrafik (69.64) @sv
alternative label: Säkerhetsbälten, flygplan, användning (69.64) @sv
alternative label: Turvallisuusjärjestelyt, lentoliikenne (69.64)
alternative label: Turvavyöt, lentokoneet, käyttö (69.64)
broader: Liikenne
in scheme: YKL - Yleisten kirjastojen luokitusjärjestelmä
notation: 69.64
preferred label: Air traffic @en
preferred label: Flygtrafik @sv
scope note: Flygtrafik. Luftfart i allmänhet. Flygledning Manövrering av flygmaskiner. Civilflyget och dess yrken Lufttrafiken och dess trafikpolitik, trafikregler, trafiksäkerhet och flygundervisning Flygrutter, flygfält och flygplatser ur trafikens synvinkel Säkerhetsarrangemang inom flygtrafiken Om verket behandlar både lufttrafik och luftfarkoster, ges företräde åt klass 69.64 Lufttrafikens tidtabeller 69.6403 Lufttrafikens och luftfartens historia 69.6409 @sv
scope note: Lentoliikenne. Ilmailu yleensä. Lennonjohto Lentokoneen ohjaus. Siviili-ilmailu ja sen ammatit Lentoliikenteen liikennepolitiikka, liikennesäännöt, liikenneturvallisuus ja lento-opetus Lentoreitit, -kentät ja -asemat lentoliikenteen kannalta Lentoliikenteen turvallisuusjärjestelyt Jos teos koskee sekä lentoliikennettä että ilmakulkuneuvoja, annetaan etusija luokalle 69.64 Lentoliikenteen aikataulut 69.6403 Lentoliikenteen ja ilmailun historia 69.6409

Posti
type: Concept
References: Tietoliikenne. Viestintätekniikka. Multimedia
References: Verkkoyhteisöt. Sähköposti. Verkkojuttelu
type: YKL-luokka
alternative label: Adressystem, posttrafik (69.7) @sv
alternative label: Ortnamn, adressystem (69.7) @sv
alternative label: Osoitejärjestelmät, postiliikenne (69.7)
alternative label: Paikannimet, osoitejärjestelmät (69.7)
alternative label: Post (69.7) @sv
alternative label: Post- och televerk (69.7) @sv
alternative label: Postadresser (69.7) @sv
alternative label: Postanstalter (69.7) @sv
alternative label: Posti (69.7)
alternative label: Posti- ja telelaitokset (69.7)
alternative label: Postilaitokset (69.7)
alternative label: Postiliikenne (69.7)
alternative label: Postiosoitteet (69.7)
alternative label: Posttrafik (69.7) @sv
broader: LIIKETALOUS. MARKKINOINTI. KAUPPA. LIIKENNE
in scheme: YKL - Yleisten kirjastojen luokitusjärjestelmä
narrower: Postimerkkeily
notation: 69.7
preferred label: Post @en
scope note: Postiliikenne yleensä. Postilaitokset sekä niiden toiminta ja palvelut yleensä Osoite- ja postinumerojärjestelmät yleensä Osoitehakemistot ja postinumeroluettelot yleensä 69.703 Postihistoria yleensä 69.709
scope note: Postrafik i allmänhet. Postverk samt deras verksamhet och serviceformer i allmänhet Adress- och postnummersystem i allmänhet Adress- och postnummerkataloger i allmänhet 69.703 Posthistoria i allmänhet 69.709 @sv

Postimerkkeily
type: Concept
References: Käyttögrafiikka
References: Keräily
type: YKL-luokka
alternative label: Filateli (69.71) @sv
alternative label: Filatelia (69.71)
alternative label: Frimärken, samlande (69.71) @sv
alternative label: Frimärkssamlande (69.71) @sv
alternative label: Keräily, postimerkit (69.71)
alternative label: Postileimat, keräily (69.71)
alternative label: Postimerkit, keräily (69.71)
alternative label: Postimerkkeily (69.71)
alternative label: Poststämplar, samlande (69.71) @sv
alternative label: Samlarverksamhet, frimärken (69.71) @sv
broader: Posti
in scheme: YKL - Yleisten kirjastojen luokitusjärjestelmä
notation: 69.71
preferred label: Frimärkssamlande @sv
preferred label: Philately @en
scope note: Frimärkssamlande. Filateli Hit också samlande av kuvert och poststämplar Frimärkskataloger 69.7103 @sv
scope note: Postimerkkien keräily. Filatelia Tähän myös kirjekuorien ja postileimojen keräily Postimerkkiluettelot 69.7103

TAITEET. LIIKUNTA
type: Concept
type: YKL-luokka
in scheme: YKL - Yleisten kirjastojen luokitusjärjestelmä
narrower: TAIDE. TAIDEHISTORIA
narrower: UUDET TAIDEMUODOT
narrower: ARKKITEHTUURI
narrower: KUVANVEISTOTAIDE
narrower: MAALAUSTAIDE. PIIRUSTUSTAIDE
narrower: GRAFIIKKA. VALOKUVAUS
narrower: MUOTOILU. TAIDETEOLLISUUS. TAIDEKÄSITYÖ
narrower: NÄYTTÄMÖTAIDE. ELOKUVATAIDE
narrower: MUSIIKKI
narrower: LIIKUNTA. URHEILU. LEIKIT. HUVIT
notation: 7
preferred label: ARTS. SPORTS @en
preferred label: KONST. MOTION. IDROTT @sv
top concept of: YKL - Yleisten kirjastojen luokitusjärjestelmä

TAIDE. TAIDEHISTORIA
type: Concept
References: Taiteiden ja urheilun opetusoppi
References: Yleinen taidehistoria
References: UUDET TAIDEMUODOT
References: ARKKITEHTUURI
References: KUVANVEISTOTAIDE
References: MAALAUSTAIDE. PIIRUSTUSTAIDE
References: GRAFIIKKA. VALOKUVAUS
References: MUOTOILU. TAIDETEOLLISUUS. TAIDEKÄSITYÖ
References: NÄYTTÄMÖTAIDE. ELOKUVATAIDE
References: MUSIIKKI
References: KAUNOKIRJALLISET SEKASISÄLTÖISET TEOKSET
References: KANSANRUNOUS
References: RUNOT
References: NÄYTELMÄT
References: KERTOMAKIRJALLISUUS
References: SADUT. KUVAKIRJAT. SARJAKUVAT
References: KIRJALLISUUSTIEDE
References: Elämäkerrat. Muistelmat, taiteentutkijat ja urheilututkijat
References: Elämäkerralliset hakuteokset, Taiteentutkijat. Urheilututkijat
type: YKL-luokka
alternative label: Arvostelu, taide (70)
alternative label: Bildkonst (70+) @sv
alternative label: Bildkonstskolor (70) @sv
alternative label: Esittävät taiteet (70+)
alternative label: Esitykset, esittävät taiteet (70+)
alternative label: Föreställande konst (70+) @sv
alternative label: Föreställningar, föreställande konst (70+) @sv
alternative label: Grundundervisning i konst (70) @sv
alternative label: Konservering, taide (70) @sv
alternative label: Konservointi, taide (70)
alternative label: Konst (70 ... 78+) @sv
alternative label: Konst (70+) @sv
alternative label: Konst, olika konstformer (70 ... 78+) @sv
alternative label: Konstbranschen (70+) @sv
alternative label: Konstformer (70 ... 78+) @sv
alternative label: Konstforskning (70+) @sv
alternative label: Konstfostran (70) @sv
alternative label: Konstkritik (70) @sv
alternative label: Konstvetenskaper (70+) @sv
alternative label: Kritiikki, taide (70)
alternative label: Kritik, konst (70) @sv
alternative label: Kritik, konstkritik (70) @sv
alternative label: Kuvataide (70+)
alternative label: Kuvataidekoulut (70)
alternative label: Kuvataiteet (70+)
alternative label: Perusopetus, taiteen (70)
alternative label: Taide (70+)
alternative label: Taide, eri taidemuodot (70 ... 78+)
alternative label: Taideala (70+)
alternative label: Taidearvostelu (70)
alternative label: Taidekasvatus (70)
alternative label: Taidemuodot (70 ... 78+)
alternative label: Taidetieteet (70+)
alternative label: Taiteen perusopetus (70)
alternative label: Taiteentutkimus (70+)
alternative label: Taiteet (70 ... 78+)
broader: TAITEET. LIIKUNTA
in scheme: YKL - Yleisten kirjastojen luokitusjärjestelmä
narrower: Taiteen estetiikka
narrower: Taiteen hakuteokset. Taiteilijamatrikkelit
narrower: Taidemuseot. Taidekokoelmat
narrower: Taidenäyttelyt
narrower: Taidepsykologia. Taidesosiologia. Taidepolitiikka
narrower: Taidekauppa
narrower: Kansantaide. Alkuperäiskansojen taide
narrower: Yleinen taidehistoria
notation: 70
preferred label: ART. ART HISTORY @en
preferred label: KONST. KONSTHISTORIA @sv
scope note: Hit allmänna verk om konst samt verk som innehåller både konstforskning och konsthistoria. Hit även allmänna verk om europeisk konst eller västerländsk konst. Hit också konstforskningens historia. Konstkritik. Konstfostran i allmänhet. Konstföreningar och konstnärsföreningar. konsthandel och konstgallerier. Hit och till underklasserna verk som behandlar flera konstarter, även litteratur eller musik. Hit och till underklasserna också verk som behandlar flera områden inom bildkonsten. Om verkets tyngdpunkt ligger på en enskild konstform, ges företräde åt klassen för denna konstart. Verk som behandlar enskilda konstformer klassificeras enligt konstart. Formtillägget 09 används inte i samband med klasserna 70-77.4985 Om ett verk som behandlar konst passar i klasserna för respektive konstarts teknik, motivkrets, land och tidsperiod ges företräde i följande ordning: teknik, motivkrets, land, tidsperiod. Verk som handlar om enskilda konstnärer eller deras produktion förs dock alltid till klassen för den ifrågavarande konstartens land, inte till klassen för motivkretsen. Konstnärens land bestäms enligt det land där han eller hon haft sin huvudsakliga konstnärsbana @sv
scope note: Tähän taiteen yleisteokset sekä teokset, joissa on sekä taiteentutkimusta että taidehistoriaa. Tähän myös Euroopan taidetta tai länsimaista taidetta koskevat yleisteokset. Tähän myös taiteentutkimuksen historia. Taiteen arvostelu. Taidekasvatus yleensä. Taideyhdistykset ja taiteilijaseurat. Taidekauppa ja taidegalleriat. Tähän ja alaluokkiin teokset, jotka koskevat useampaa taiteenalaa, myös kirjallisuutta tai musiikkia. Tähän ja alaluokkiin myös teokset, jotka koskevat useampaa kuvataiteen alaa. Jos teos kuitenkin painottuu johonkin tiettyyn taiteenalaan, annetaan etusija ko. taiteenalan luokalle. Taiteen eri aloja koskevat teokset luokitetaan alan mukaan. Muotoluokkaa 09 ei käytetä luokkien 70-77.4985 yhteydessä. Jos taidetta koskeva teos sopii sekä ko. taiteenalan tekniikan, aihepiirien, maan että aikakauden mukaiseen luokkaan, annetaan etusija järjestyksessä: tekniikka, aihepiiri, maa, aikakausi. Yksittäistä taiteilijaa tai hänen tuotantoaan koskevat teokset luokitetaan kuitenkin aina ko. taiteenalan maan, ei aihepiirin, mukaiseen luokkaan. Taiteilijan maa määräytyy sen mukaan, missä hän on tehnyt keskeisen uransa

Taiteen estetiikka
type: Concept
References: Taidepsykologia. Taidesosiologia. Taidepolitiikka
type: YKL-luokka
alternative label: Bildanalys (70.01) @sv
alternative label: Bildkonst, estetik (70.01) @sv
alternative label: Estetiikka, taide (70.01)
alternative label: Estetik, konst (70.01) @sv
alternative label: Färger, konstens estetik (70.01) @sv
alternative label: Färglära, konst (70.01) @sv
alternative label: Ikonografi (70.01) @sv
alternative label: Ikonografia (70.01)
alternative label: Ikonologi (70.01) @sv
alternative label: Ikonologia (70.01)
alternative label: Konst, estetik (70.01) @sv
alternative label: Konstfilosofi (70.01) @sv
alternative label: Konstteori (70.01) @sv
alternative label: Kuva-analyysi (70.01)
alternative label: Kuvataide, estetiikka (70.01)
alternative label: Rum, konstens estetik (70.01) @sv
alternative label: Stilistik, konst (70.01) @sv
alternative label: Symboler, konstens estetik (70.01) @sv
alternative label: Symboliikka, taiteen estetiikka (70.01)
alternative label: Symbolik, konstens estetik (70.01) @sv
alternative label: Symbolit, taiteen estetiikka (70.01)
alternative label: Taide, estetiikka (70.01)
alternative label: Taidefilosofia (70.01)
alternative label: Taideteoria (70.01)
alternative label: Tila, taiteen estetiikka (70.01)
alternative label: Tyylioppi, taide (70.01)
alternative label: Värioppi, taide (70.01)
alternative label: Värit, taiteen estetiikka (70.01)
broader: TAIDE. TAIDEHISTORIA
in scheme: YKL - Yleisten kirjastojen luokitusjärjestelmä
notation: 70.01
preferred label: Aesthetics of art @en
preferred label: Konstens estetik @sv
scope note: Hit allmänna verk om konstens estetik Hit även allmänna verk om europeisk eller västerländsk konstestetik Hit också konstens och konstforskningens filosofi och teori samt konstforskningsmetoder i allmänhet Bildanalys. Färgläror i konsten Allmän konstestetik i samband med enskilda länder, regioner eller tidsperioder förs till klasserna 70.91101-70.98501 Företräde ges åt klassen för land eller region Estetik, filosofi, teori och forskningsmetoder som rör en enskild konstart förs till klassen för ifrågavarande konstart Formtillägget 09 används inte i samband med klasserna 70-77.4985 @sv
scope note: Tähän taiteen estetiikan yleisteokset Tähän myös Euroopan ja länsimaisen taiteen estetiikkaa koskevat yleisteokset Tähän myös taiteen ja taiteentutkimuksen filosofia, teoria ja tutkimusmenetelmät yleensä Kuva-analyysi. Taiteen väriopit Tiettyyn maahan, alueeseen tai aikakauteen liittyvä yleinen taiteen estetiikka sijoitetaan luokkiin 70.91101-70.98501 Etusija on maan tai alueen mukaisella luokalla Tietyn taiteenalan estetiikka, filosofia, teoria ja tutkimusmenetelmät luokitetaan ko. taiteenalan yhteyteen Muotoluokkaa 09 ei käytetä luokkien 70-77.4985 yhteydessä

Taiteen hakuteokset. Taiteilijamatrikkelit
type: Concept
type: YKL-luokka
alternative label: Biografiska uppslagsverk, konstnärer (70.03) @sv
alternative label: Elämäkerralliset hakuteokset, taiteilijat (70.03)
alternative label: Henkilöhakemistot, taiteilijat (70.03)
alternative label: Konst, uppslagsverk (70.03) @sv
alternative label: Konstlexikon (70.03) @sv
alternative label: Konstnärer, uppslagsverk (70.03) @sv
alternative label: Matrikkelit, taiteilijat (70.03)
alternative label: Matriklar, konstnärer (70.03) @sv
alternative label: Personregister, konstnärer (70.03) @sv
alternative label: Taide, hakuteokset (70.03)
alternative label: Taidesanakirjat (70.03)
alternative label: Taiteilijat, hakuteokset (70.03)
broader: TAIDE. TAIDEHISTORIA
in scheme: YKL - Yleisten kirjastojen luokitusjärjestelmä
notation: 70.03
preferred label: Art reference books. Artists' registers @en
preferred label: Uppslagsverk om konst. Konstnärsmatriklar @sv
scope note: Hit allmänna uppslagsverk över konst eller konstforskning samt allmänna konstnärsmatriklar Hit även allmänna uppslagsverk om europeisk eller västerländsk konst Allmänna uppslagsverk om konst i enskilda länder eller regioner eller under enskilda tidsperioder förs till klasserna 70.91103-70.98503 Företräde ges åt klassen för land eller region Uppslagsverk och konstnärsmatriklar över en enskild konstart förs till klassen för konstarten i fråga Formtillägget 09 används inte i samband med klasserna 70-77.4985 @sv
scope note: Tähän taidetta tai taiteentutkimusta koskevat yleiset hakuteokset sekä yleiset taiteilijamatrikkelit Tähän myös Euroopan tai länsimaisen taiteen yleiset hakuteokset Tietyn maan, alueen tai aikakauden yleiset taiteen hakuteokset sijoitetaan luokkiin 70.91103-70.98503 Etusija on maan tai alueen mukaisella luokalla Tietyn taiteenalan hakuteokset ja taiteilijamatrikkelit luokitetaan ko. taiteenalan yhteyteen Muotoluokkaa 09 ei käytetä luokkien 70-77.4985 yhteydessä

Taidemuseot. Taidekokoelmat
type: Concept
type: YKL-luokka
alternative label: Konstmuseer (70.062) @sv
alternative label: Konstmuseer, kataloger (70.062) @sv
alternative label: Konstsamlingar (70.062) @sv
alternative label: Konstsamlingar, kataloger (70.062) @sv
alternative label: Museer, konstmuseer (70.062) @sv
alternative label: Museot, taidemuseot (70.062)
alternative label: Taidekokoelmat (70.062)
alternative label: Taidekokoelmat, teosluettelot (70.062)
alternative label: Taidemuseot (70.062)
alternative label: Taidemuseot, teosluettelot (70.062)
alternative label: Teosluettelot, taidekokoelmat (70.062)
alternative label: Teosluettelot, taidemuseot (70.062)
alternative label: Verkförteckningar, konstmuseer (70.062) @sv
alternative label: Verkförteckningar, konstsamlingar (70.062) @sv
broader: TAIDE. TAIDEHISTORIA
in scheme: YKL - Yleisten kirjastojen luokitusjärjestelmä
notation: 70.062
preferred label: Art museums. Art collections @en
preferred label: Konstmuseer. Konstsamlingar @sv
scope note: Hit allmänna verk om konstmuseer och konstsamlingar Hit också konstmuseer och konstsamlingar som omfattar flera konstarter Hit även konstmuseer och konstsamlingar som omfattar europeisk konst eller västerländsk konst i allmänhet Allmänna konstmuseer och konstsamlingar som omfattar konst av enskilda länder, regioner eller tidsperioder förs till klasserna 70.911062-70.985062 Företräde ges åt klassen för land eller region Konstmuseer och konstsamlingar som omfattar enskilda konstarter förs till klassen för konstarten i fråga Formtillägget 09 används inte i samband med klasserna 70-77.4985 @sv
scope note: Tähän taidemuseoita ja taidekokoelmia koskevat yleisteokset Tähän myös useampaa taiteenalaa koskevat taidemuseot ja taidekokoelmat Tähän myös Euroopan taidetta tai länsimaista taidetta yleensä koskevat taidemuseot ja taidekokoelmat Tietyn maan, alueen tai aikakauden taidetta koskevat yleiset taidemuseot ja taidekokoelmat sijoitetaan luokkiin 70.911062-70.985062 Etusija on maan tai alueen mukaisella luokalla Tietyn taiteenalan taidemuseot ja taidekokoelmat luokitetaan ko. taiteenalan yhteyteen Muotoluokkaa 09 ei käytetä luokkien 70-77.4985 yhteydessä

Taidenäyttelyt
type: Concept
References: Taidemuseot. Taidekokoelmat
References: Taidekauppa
type: YKL-luokka
alternative label: Konstutställningar (70.063) @sv
alternative label: Konstutställningar, kataloger (70.063) @sv
alternative label: Näyttelyt, taidenäyttelyt (70.063)
alternative label: Taidenäyttelyt (70.063)
alternative label: Taidenäyttelyt, teosluettelot (70.063)
alternative label: Teosluettelot, taidenäyttelyt (70.063)
alternative label: Utställningar, konstutställningar (70.063) @sv
alternative label: Verkförteckningar, konstutställningar (70.063) @sv
broader: TAIDE. TAIDEHISTORIA
in scheme: YKL - Yleisten kirjastojen luokitusjärjestelmä
notation: 70.063
preferred label: Art exhibitions @en
preferred label: Konstutställningar @sv
scope note: Hit allmänna verk om konstutställningar Hit också utställningar som omfattar flera konstarter Hit även konstutställningar om europeisk konst eller västerländsk konst i allmänhet Allmänna konstutställningar om konst av enskilda länder, regioner eller tidsperioder förs till klasserna 70.911063-70.985063 Företräde ges åt klassen för land eller region Utställningar inom en enskild konstart förs till klassen för konstarten i fråga Formtillägget 09 används inte i samband med klasserna 70-77.4985 @sv
scope note: Tähän taidenäyttelyitä koskevat yleisteokset Tähän myös useampaa taiteenalaa koskevat näyttelyt Tähän myös Euroopan taidetta tai länsimaista taidetta yleensä koskevat taidenäyttelyt Tietyn maan, alueen tai aikakauden taidetta koskevat yleiset taidenäyttelyt sijoitetaan luokkiin 70.911063-70.985063 Etusija on maan mukaisella luokalla Tiettyä taiteenalaa koskevat näyttelyt luokitetaan ko. taiteenalan yhteyteen Muotoluokkaa 09 ei käytetä luokkien 70-77.4985 yhteydessä

Taidepsykologia. Taidesosiologia. Taidepolitiikka
type: Concept
References: YLEINEN KULTTUURIPOLITIIKKA
References: Ajattelun, älykkyyden, luovuuden ja lahjakkuuden psykologia
References: Kieli-, kommunikaatio- ja ilmaisupsykologia
References: Elämäntapojen sosiologia. Kulttuurisosiologia
References: Luovuus- ja toimintaterapiat
References: Taiteen estetiikka
type: YKL-luokka
alternative label: Barnkultur, konstpolitik (70.1) @sv
alternative label: Censur, konst (70.1) @sv
alternative label: Konst, censurering (70.1) @sv
alternative label: Konst, finansiering (70.1) @sv
alternative label: Konst, konstens frihet (70.1) @sv
alternative label: Konstkommissioner (70.1) @sv
alternative label: Konstnärer, ställning i samhället (70.1) @sv
alternative label: Konstpolitik (70.1) @sv
alternative label: Konstpsykologi (70.1) @sv
alternative label: Konstsociologi (70.1) @sv
alternative label: Lastenkulttuuri, taidepolitiikka (70.1)
alternative label: Nuorisokulttuuri, taidepolitiikka (70.1)
alternative label: Sensuuri, taide (70.1)
alternative label: Sponsorointi, taide (70.1)
alternative label: Sponsring, konst (70.1) @sv
alternative label: Taide, rahoitus (70.1)
alternative label: Taide, sensurointi (70.1)
alternative label: Taide, taiteen vapaus (70.1)
alternative label: Taidepolitiikka (70.1)
alternative label: Taidepsykologia (70.1)
alternative label: Taidesosiologia (70.1)
alternative label: Taidetoimikunnat (70.1)
alternative label: Taiteilijat, asema yhteiskunnassa (70.1)
alternative label: Ungdomskultur, konstpolitik (70.1) @sv
broader: TAIDE. TAIDEHISTORIA
in scheme: YKL - Yleisten kirjastojen luokitusjärjestelmä
notation: 70.1
preferred label: Art psychology. Art sociology. Art policy @en
preferred label: Konstpsykologi. Konstsociologi. Konstpolitik @sv
scope note: Hit allmänna verk om konstpsykologi, konstsociologi och konstpolitik i allmänhet Hit även allmän konstpsykologi, -sociologi och -politik som rör europeisk eller västerländsk konst Konstens frihet. Konstcensur Konstens och konstnärens ställning i samhället Finansiering av konst Konstpsykologi, konstsociologi och konstpolitik som rör en enskild konstart förs till klassen för konstarten i fråga Konststipendier och konstpris i allmänhet 70.106 Formtillägget 09 används inte i samband med klasserna 70-77.4985 @sv
scope note: Tähän taidepsykologian, -sosiologian ja -politiikan yleisteokset Tähän myös Euroopan taidetta tai länsimaista taidetta koskeva yleinen taidepsykologia, -sosiologia ja -politiikka Taiteen vapaus. Taiteen sensurointi Taiteen ja taiteilijan asema yhteiskunnassa Taiteen rahoitus Tiettyä taiteenalaa koskeva taidepsykologia, -sosiologia ja -politiikka luokitetaan ko. taiteenalan luokkaan Taideapurahat ja taidepalkinnot yleensä 70.106 Muotoluokkaa 09 ei käytetä luokkien 70-77.4985 yhteydessä

Taidekauppa
type: Concept
References: Antiikkiesineiden keräily
type: YKL-luokka
alternative label: Auktion, konst (70.2) @sv
alternative label: Förfalskningar, konst (70.2) @sv
alternative label: Harrastukset, taide (70.2)
alternative label: Hobbyer, konst (70.2) @sv
alternative label: Huutokauppa, taide (70.2)
alternative label: Keräily, taide (70.2)
alternative label: Konst, samlande (70.2) @sv
alternative label: Konst, som placeringsobjekt (70.2) @sv
alternative label: Konstanskaffningar (70.2) @sv
alternative label: Konstauktioner (70.2) @sv
alternative label: Konstförfalskningar, (70.2) @sv
alternative label: Konstgallerier (70.2) @sv
alternative label: Konsthandel (70.2) @sv
alternative label: Konstsamlande (70.2) @sv
alternative label: Plagiaatit, taide (70.2)
alternative label: Plagiat, konst (70.2) @sv
alternative label: Plagiering, konst (70.2) @sv
alternative label: Plagiointi, taide (70.2)
alternative label: Samlarverksamhet, konst (70.2) @sv
alternative label: Taide, keräily (70.2)
alternative label: Taide, sijoituskohteena (70.2)
alternative label: Taidegalleriat (70.2)
alternative label: Taidehankinnat (70.2)
alternative label: Taidehuutokauppa (70.2)
alternative label: Taidekauppa (70.2)
alternative label: Taideväärennökset (70.2)
alternative label: Taiteen keräily (70.2)
alternative label: Väärennökset, taide (70.2)
broader: TAIDE. TAIDEHISTORIA
in scheme: YKL - Yleisten kirjastojen luokitusjärjestelmä
notation: 70.2
preferred label: Art trade @en
preferred label: Konsthandel @sv
scope note: Hit konsthandel och konst som samlingsobjekt i allmänhet Hit även allmänna verk om handel med europeisk eller västerländsk konst Konst som placeringsobjekt. Konstgalleriverksamhet. Konstauktioner Hit konstförfalskningar oberoende av konstart Handel och samlande inom en enskild konstart förs till klassen för konstarten i fråga Kataloger för konstutställningar 70.203 Formtillägget 09 används inte i samband med klasserna 70-77.4985 @sv
scope note: Tähän taidekauppa sekä taiteen keräily yleensä Tähän myös Euroopan tai länsimaisen taiteen kauppaa koskevat yleisteokset Taide sijoituskohteena. Taidegalleriatoiminta. Taidehuutokaupat Tähän taideväärennökset taiteenalasta riippumatta Tiettyä taiteenalaa koskeva kauppa ja keräily luokitetaan ko. taiteenalan luokkaan Taidehuutokauppojen luettelot 70.203 Muotoluokkaa 09 ei käytetä luokkien 70-77.4985 yhteydessä

Kansantaide. Alkuperäiskansojen taide
type: Concept
References: KANSATIEDE. KULTTUURIANTROPOLOGIA
References: Yleinen taidehistoria
References: Yleinen taidehistoria, Suomi
References: Musiikin tutkimus
References: Etnomusiikki. Kansanmusiikki
References: KANSANRUNOUS
References: Kansanrunouden historia ja tutkimus
type: YKL-luokka
alternative label: Alkuperäiskansat, taide (70.3)
alternative label: Art brut (70.3)
alternative label: Folkkonst (70.3) @sv
alternative label: Folklore, folkkonst (70.3) @sv
alternative label: ITE-konst (70.3) @sv
alternative label: ITE-taide (70.3)
alternative label: Kansanperinne, kansantaide (70.3)
alternative label: Kansantaide (70.3)
alternative label: Luonnonkansat, taide (70.3)
alternative label: Modern folkkonst (70.3) @sv
alternative label: Naturfolk, konst (70.3) @sv
alternative label: Nykykansantaide (70.3)
alternative label: Outsider art (70.3)
alternative label: Saamelaiset, kansantaide (70.3)
alternative label: Samer, folkkonst (70.3) @sv
alternative label: Urbefolkningar, konst (70.3) @sv
broader: TAIDE. TAIDEHISTORIA
in scheme: YKL - Yleisten kirjastojen luokitusjärjestelmä
notation: 70.3
preferred label: Folk art. Art of indigenous peoples @en
preferred label: Folkkonst. Ursprungsfolkens konst @sv
scope note: Hit verk som behandlar folkkonst, modern folkkonst eller ursprungsfolkens konst i allmänhet ITE-konst i allmänhet. Outsider art i allmänhet Hit även allmänna verk om europeisk folkkonst Folkkonst och ursprungsfolkens konst inom en enskild konstart förs till klassen för konstarten i fråga Verk som behandlar folkkonsten i en viss världsdel eller ett visst land förs till klassen 70.92-70.985 för den ifrågavarande världsdelens eller det ifrågavarande landets konsthistoria Folkkonst inom specialområden klassificeras efter område Om verket innehåller både etnologi och folkkonst ges företräde åt klass 49+ Formtillägget 09 används inte i samband med klasserna 70-77.4985 @sv
scope note: Tähän teokset, jotka koskevat kansantaidetta, nykykansantaidetta tai alkuperäiskansojen taidetta yleensä ITE-taide yleensä. Outsider art yleensä Tähän myös Euroopan kansantaidetta koskevat yleisteokset Tiettyä taiteenalaa koskeva kansantaide ja alkuperäiskansojen taide sijoitetaan ko. taiteenalan luokkaan Tietyn maanosan tai maan kansantaidetta koskevat teokset sijoitetaan ko. maanosan tai maan taidehistoriaan luokkiin 70.92-70.985 Erikoisalojen kansantaide sijoitetaan ko. taiteenalan luokkaan Jos teoksessa on sekä kansatiedettä että kansantaidetta, annetaan etusija luokalle 49+ Muotoluokkaa 09 ei käytetä luokkien 70-77.4985 yhteydessä

Yleinen taidehistoria
type: Concept
alternative label: Arabialainen taide, taidehistoria (70.9+)
alternative label: Arabisk konst, konsthistoria (70.9+) @sv
alternative label: Bildkonst, historia (70.9+) @sv
alternative label: Biografier, konstnärer (70.9 ... 78.99+) @sv
alternative label: Biografier, konstnärer, forskning (70.9 ... 78.99+) @sv
alternative label: Bloggar, konstnärer (70.9 ... 78.9+) @sv
alternative label: Blogit, taiteilijat (70.9 ... 78.9+)
alternative label: Brev, konstnärer (70.9 ... 78.99+) @sv
alternative label: Brevsamlingar, konstnärer (70.9 ... 78.99+) @sv
alternative label: Brevväxling, konstnärer (70.9 ... 78.99+) @sv
alternative label: Collage (70.9+) @sv
alternative label: Dagböcker, konstnärer (70.9 ... 78.99+) @sv
alternative label: Dagböcker, konstnärer, forskning (70.9 ... 78.99+) @sv
alternative label: Elämäkerrat, taiteilijat (70.9 ... 78.99+)
alternative label: Elämäkerrat, taiteilijat, tutkimus (70.9 ... 78.99+)
alternative label: Elämäkertatutkimus, taiteilijat (70.9 ... 78.99+)
alternative label: Henkilöhistoria, taiteilijat (70.9 ... 78.9+)
alternative label: Islam, konsthistoria (70.9+) @sv
alternative label: Islam, taidehistoria (70.9+)
alternative label: Kirjeenvaihto, taiteilijat (70.9 ... 78.99+)
alternative label: Kirjeet, taiteilijat (70.9 ... 78.99+)
alternative label: Kirjekokoelmat, taiteilijat (70.9 ... 78.99+)
alternative label: Kirkkotaide, taidehistoria (70.9+)
alternative label: Kollaasitaide (70.9+)
alternative label: Konsthistoria (70.9+) @sv
alternative label: Konstnärer, biografier och memoarer (70.9 ... 78.99) @sv
alternative label: Konstnärshem, konsthistoria (70.9+) @sv
alternative label: Kuvataide, historia (70.9+)
alternative label: Kyrkokonst, konsthistoria (70.9+) @sv
alternative label: Livshistorieforskning, konstnärer (70.9 ... 78.99+) @sv
alternative label: Memoarer, konstnärer (70.9 ... 78.99+) @sv
alternative label: Memoarer, konstnärer, forskning (70.9 ... 78.99+) @sv
alternative label: Minnesmärken, konst (70.9+) @sv
alternative label: Muistelmat, taiteilijat (70.9 ... 78.99+)
alternative label: Muistelmat, taiteilijat, tutkimus (70.9 ... 78.99+)
alternative label: Muistomerkit, taide (70.9+)
alternative label: Nettipäiväkirjat, taiteilijat (70.9 ... 78.9+)
alternative label: Nätdagböcker, konstnärer (70.9 ... 78.9+) @sv
alternative label: Omaelämäkerrat, taiteilijat (70.9 ... 78.9+)
alternative label: Orientalism, taidehistoria (70.9+) @sv
alternative label: Orientalismi, taidehistoria (70.9+)
alternative label: Personhistoria, konstnärer (70.9 ... 78.9+) @sv
alternative label: Päiväkirjat, taiteilijat (70.9 ... 78.99+)
alternative label: Päiväkirjat, taiteilijat, tutkimus (70.9 ... 78.99+)
alternative label: Religiös konst (70.9+) @sv
alternative label: Självbiografier, konstnärer (70.9 ... 78.9+) @sv
alternative label: Stilar, konsthistoria (70.9+) @sv
alternative label: Stilhistoria, konsthistoria (70.9+) @sv
alternative label: Stilperioder, konsthistoria (70.9+) @sv
alternative label: Stilriktningar, konsthistoria (70.9+) @sv
alternative label: Studior, konsthistoria (70.9+) @sv
alternative label: Studiot, taidehistoria (70.9+)
alternative label: Taidehistoria (70.9+)
alternative label: Taiteilijakodit, taidehistoria (70.9+)
alternative label: Taiteilijat, elämäkerrat ja muistelmat (70.9 ... 78.99)
alternative label: Tyylihistoria, taidehistoria (70.9+)
alternative label: Tyylikaudet, taidehistoria (70.9+)
alternative label: Tyylisuunnat, taidehistoria (70.9+)
alternative label: Tyylit, taidehistoria (70.9+)
alternative label: Uskonnollinen taide (70.9+)
alternative label: Verkkopäiväkirjat, taiteilijat (70.9 ... 78.9+)
alternative label: Web-log, taiteilijat (70.9 ... 78.9+)
alternative label: Webbjournaler, konstnärer (70.9 ... 78.9+) @sv
broader: TAIDE. TAIDEHISTORIA
in scheme: YKL - Yleisten kirjastojen luokitusjärjestelmä
narrower: Länsimainen taide. Euroopan taide
narrower: Yleinen taidehistoria, Suomi
narrower: Yleinen taidehistoria, Pohjoismaat
narrower: Yleinen taidehistoria, Keski-Eurooppa
narrower: Yleinen taidehistoria, Iso-Britannia. Irlanti
narrower: Yleinen taidehistoria, Etelä-Eurooppa
narrower: Yleinen taidehistoria, Itä-Eurooppa
narrower: Yleinen taidehistoria, Aasia
narrower: Yleinen taidehistoria, Afrikka
narrower: Yleinen taidehistoria, Amerikka
narrower: Yleinen taidehistoria, Australia ja Oseania
notation: 70.9
scope note: Hit och till underklasserna allmänna konsthistoriska verk samt verk som behandlar allmän konsthistoria eller bildkonsternas gemensamma historia i olika världsdelar och länder Hit och till underklasserna också enskilda konstnärer och deras produktion ifall verket behandlar flera olika konstarter Om tyngdpunkten i verket ligger på en enskild konstart, ges företräde åt klassen för den ifrågavarande konstarten eller dess historia Om ett verk om allmän konsthistoria passar både till klassen för land eller region och till klassen för tidsperiod, ges företräde åt klassen för land eller region Konstnärens land bestäms enligt det land där han eller hon haft sin huvudsakliga konstnärsbana Formtillägget 09 används inte i samband med klasserna 70-77.4985 @sv
scope note: Tähän ja alaluokkiin taidehistorian yleisteokset sekä teokset, jotka koskevat eri maanosien tai maiden yleistä taidehistoriaa tai kuvataiteiden yhteistä historiaa Tähän ja alaluokkiin myös yksittäiset taiteilijat ja heidän tuotantonsa, mikäli niitä koskevassa teoksessa käsitellään useampaa taiteenalaa Jos teos kuitenkin painottuu johonkin tiettyyn taiteenalaan, annetaan etusija ko. taiteenalan tai sen historian luokalle Jos yleistä taidehistoriaa koskeva teos sopii sekä maan tai alueen että aikakauden mukaiseen luokkaan, annetaan etusija maan tai alueen mukaiselle luokalle Taiteilijan maa määräytyy sen mukaan, missä hän on tehnyt keskeisen uransa Muotoluokkaa 09 ei käytetä luokkien 70-77.4985 yhteydessä

Länsimainen taide. Euroopan taide
type: Concept
References: TAIDE. TAIDEHISTORIA
References: Taiteen estetiikka
References: Taiteen hakuteokset. Taiteilijamatrikkelit
References: Taidemuseot. Taidekokoelmat
References: Taidenäyttelyt
References: Taidekauppa
References: Kansantaide. Alkuperäiskansojen taide
References: Esihistoriallinen ja vanhan ajan taide
References: Keskiajan taide
References: Uuden ajan taide
References: Yleinen taidehistoria, Suomi
References: Yleinen taidehistoria, Pohjoismaat
References: Yleinen taidehistoria, Keski-Eurooppa
References: Yleinen taidehistoria, Iso-Britannia. Irlanti
References: Yleinen taidehistoria, Etelä-Eurooppa
References: Yleinen taidehistoria, Itä-Eurooppa
type: YKL-luokka
alternative label: Länsimainen taide (70.91+)
alternative label: Västerländsk konst (70.91+) @sv
broader: Yleinen taidehistoria
in scheme: YKL - Yleisten kirjastojen luokitusjärjestelmä
narrower: Esihistoriallinen ja vanhan ajan taide
narrower: Keskiajan taide
narrower: Uuden ajan taide
notation: 70.91
preferred label: Västerländsk konst. Europeisk konst @sv
preferred label: Western art. European art @en
scope note: Hit och till underklasserna den europeiska och den västerländska konstens allmänna konst- och stilhistoria Om ett verk passar både till klassen för land eller tidsperiod, ges företräde åt klassen för land Verk som behandlar olika tidsperioder i övriga världsdelars konsthistoria förs till klassen för den ifrågavarande världsdelens konsthistoria Formtillägget 09 används inte i samband med klasserna 70-77.4985 @sv
scope note: Tähän ja alaluokkiin Euroopan ja länsimaiden taiteen yleinen taide- ja tyylihistoria Jos teos sopii sekä maan että aikakauden mukaiseen luokkaan, annetaan etusija maan mukaiselle luokalle Muiden maanosien taidehistorian eri aikakausia koskevat teokset luokitetaan ko. maanosan taidehistorian luokkaan Muotoluokkaa 09 ei käytetä luokkien 70-77.4985 yhteydessä

Esihistoriallinen ja vanhan ajan taide
type: Concept
References: Yleinen taidehistoria, Aasia
References: Yleinen taidehistoria, Afrikka
type: YKL-luokka
alternative label: Antiikki, taidehistoria (70.911)
alternative label: Antiken, konsthistoria (70.911) @sv
alternative label: Esihistoria, taide (70.911)
alternative label: Etrusker, konsthistoria (70.911) @sv
alternative label: Etruskit, taidehistoria (70.911)
alternative label: Förhistoria, konst (70.911) @sv
alternative label: Gamla tiden, konsthistoria (70.911) @sv
alternative label: Grekland, antikens konsthistoria (70.911) @sv
alternative label: Kreikka, antiikin taidehistoria (70.911)
alternative label: Romerska riket, konsthistoria (70.911) @sv
alternative label: Rooman valtakunta, taidehistoria (70.911)
alternative label: Vanha aika, taidehistoria (70.911)
broader: Länsimainen taide. Euroopan taide
in scheme: YKL - Yleisten kirjastojen luokitusjärjestelmä
notation: 70.911
preferred label: Förhistorisk konst. Gamla tidens konst @sv
preferred label: Prehistoric and ancient art @en
scope note: Hit allmänna verk om Europas förhistoriska konst och gamla tidens konst Antikens konst Formtillägget 09 används inte i samband med klasserna 70-77.4985 @sv
scope note: Tähän Euroopan esihistoriallisen ja vanhan ajan taiteen yleisteokset Antiikin taide Muotoluokkaa 09 ei käytetä luokkien 70-77.4985 yhteydessä

Keskiajan taide
type: Concept
type: YKL-luokka
alternative label: Bysans, konsthistoria (70.912) @sv
alternative label: Bysantti, taidehistoria (70.912)
alternative label: Gotiikka, taidehistoria (70.912)
alternative label: Gotik, konsthistoria (70.912) @sv
alternative label: Keskiaika, taidehistoria (70.912)
alternative label: Medeltiden, konsthistoria (70.912) @sv
alternative label: Romaaninen taide (70.912)
alternative label: Romansk konst (70.912) @sv
alternative label: Viikingit, taidehistoria (70.912)
alternative label: Vikingar, konsthistoria (70.912) @sv
broader: Länsimainen taide. Euroopan taide
in scheme: YKL - Yleisten kirjastojen luokitusjärjestelmä
notation: 70.912
preferred label: Medeltida konst @sv
preferred label: Medieval art @en
scope note: Hit allmänna verk om europeisk medeltidskonst Romansk och gotisk konst Hit också bysantinsk konst Formtillägget 09 används inte i samband med klasserna 70-77.4985 @sv
scope note: Tähän Euroopan keskiajan taiteen yleisteokset Romaaninen ja goottilainen taide Tähän myös Bysantin taide Muotoluokkaa 09 ei käytetä luokkien 70-77.4985 yhteydessä

Uuden ajan taide
type: Concept
type: YKL-luokka
alternative label: Nya tiden, konsthistoria (70.913+) @sv
alternative label: Uusi aika, taidehistoria (70.913+)
broader: Länsimainen taide. Euroopan taide
in scheme: YKL - Yleisten kirjastojen luokitusjärjestelmä
narrower: Renessanssin taide
narrower: Barokin ja rokokoon taide
narrower: 1800-luvun ja vuosisadan vaihteen taide
narrower: Nykyajan taide
notation: 70.913
preferred label: Art of the modern era @en
preferred label: Nya tidens konst @sv
scope note: Hit och till underklasserna allmänna verk om nya tidens konst i Europa och västerlandet Formtillägget 09 används inte i samband med klasserna 70-77.4985 @sv
scope note: Tähän ja alaluokkiin Euroopan ja länsimaiden uuden ajan taiteen yleisteokset Muotoluokkaa 09 ei käytetä luokkien 70-77.4985 yhteydessä

Renessanssin taide
type: Concept
type: YKL-luokka
alternative label: Manierism, konsthistoria (70.9131) @sv
alternative label: Manierismi, taidehistoria (70.9131)
alternative label: Renessanssi, taidehistoria (70.9131)
alternative label: Renässans, konsthistoria (70.9131) @sv
broader: Uuden ajan taide
in scheme: YKL - Yleisten kirjastojen luokitusjärjestelmä
notation: 70.9131
preferred label: Renaissance art @en
preferred label: Renässansens konst @sv
scope note: Formtillägget 09 används inte i samband med klasserna 70-77.4985 @sv
scope note: Muotoluokkaa 09 ei käytetä luokkien 70-77.4985 yhteydessä

Barokin ja rokokoon taide
type: Concept
type: YKL-luokka
alternative label: Barock, konsthistoria (70.9132) @sv
alternative label: Barokki, taidehistoria (70.9132)
alternative label: Rokoko, konsthistoria (70.9132) @sv
alternative label: Rokokoo, taidehistoria (70.9132)
broader: Uuden ajan taide
in scheme: YKL - Yleisten kirjastojen luokitusjärjestelmä
notation: 70.9132
preferred label: Barockens och rokokons konst @sv
preferred label: Baroque and rococo art @en
scope note: Formtillägget 09 används inte i samband med klasserna 70-77.4985 @sv
scope note: Muotoluokkaa 09 ei käytetä luokkien 70-77.4985 yhteydessä

1800-luvun ja vuosisadan vaihteen taide
type: Concept
type: YKL-luokka
alternative label: Art nouveau, konsthistoria (70.9133) @sv
alternative label: Art nouveau, taidehistoria (70.9133)
alternative label: Empire, konsthistoria (70.9133) @sv
alternative label: Empire-tyyli, taidehistoria (70.9133)
alternative label: Imitationsstilar, konsthistoria (70.9133) @sv
alternative label: Impressionism, konsthistoria (70.9133) @sv
alternative label: Impressionismi, taidehistoria (70.9133)
alternative label: Jugend, konsthistoria (70.9133) @sv
alternative label: Jugend, taidehistoria (70.9133)
alternative label: Kansallisromantiikka, taidehistoria (70.9133)
alternative label: Kertaustyylit, taidehistoria (70.9133)
alternative label: L'art nouveau, konsthistoria (70.9133) @sv
alternative label: L'art nouveau, taidehistoria (70.9133)
alternative label: Nationalromantik, konsthistoria (70.9133) @sv
alternative label: Naturalism, konsthistoria (70.9133) @sv
alternative label: Naturalismi, taidehistoria (70.9133)
alternative label: Nyklassicism, konsthistoria (70.9133) @sv
alternative label: Realism, konsthistoria, 1800-talet (70.9133) @sv
alternative label: Realismi, taidehistoria, 1800-luku (70.9133)
alternative label: Romantiikka, taidehistoria (70.9133)
alternative label: Romantik, konsthistoria (70.9133) @sv
alternative label: Symbolism, konsthistoria (70.9133) @sv
alternative label: Symbolismi, taidehistoria (70.9133)
alternative label: Uusklassismi, taidehistoria (70.9133)
broader: Uuden ajan taide
in scheme: YKL - Yleisten kirjastojen luokitusjärjestelmä
notation: 70.9133
preferred label: 1800-talets och sekelskiftets konst @sv
preferred label: Art of the 19th century and the turn of the century @en
scope note: Hit allmänna verk om romantik, nationalromantik, symbolism, jugend eller impressionism i Europa och västerlandet Hit också imitationsstilar, t.ex. nyklassicism, i Europa och västerlandet Formtillägget 09 används inte i samband med klasserna 70-77.4985 @sv
scope note: Tähän Euroopan ja länsimaiden romantiikkaa, kansallisromantiikkaa, symbolismia, jugendia tai impressionismia koskevat yleisteokset Tähän myös Euroopan ja länsimaiden kertaustyylit, esim. uusklassismi Muotoluokkaa 09 ei käytetä luokkien 70-77.4985 yhteydessä

Nykyajan taide
type: Concept
type: YKL-luokka
alternative label: Abstrakt konst, konsthistoria, allm. (70.9134) @sv
alternative label: Abstrakti taide, taidehistoria, yl. (70.9134)
alternative label: Dadaism, konsthistoria (70.9134) @sv
alternative label: Dadaismi, taidehistoria (70.9134)
alternative label: Ekspressionismi, taidehistoria (70.9134)
alternative label: Expressionism, konsthistoria (70.9134) @sv
alternative label: Funktionalism, konsthistoria (70.9134) @sv
alternative label: Funktionalismi, taidehistoria (70.9134)
alternative label: Futurism, konsthistoria (70.9134) @sv
alternative label: Futurismi, taidehistoria (70.9134)
alternative label: Konkreettinen taide, taidehistoria (70.9134)
alternative label: Konkret konst, konsthistoria (70.9134) @sv
alternative label: Konstruktivism, konsthistoria (70.9134) @sv
alternative label: Konstruktivismi, taidehistoria (70.9134)
alternative label: Kubism, konsthistoria (70.9134) @sv
alternative label: Kubismi, taidehistoria (70.9134)
alternative label: Minimalism, konsthistoria (70.9134) @sv
alternative label: Minimalismi, taidehistoria (70.9134)
alternative label: Modernism, konsthistoria (70.9134) @sv
alternative label: Modernismi, taidehistoria (70.9134)
alternative label: Naivism, konsthistoria (70.9134) @sv
alternative label: Naivismi, taidehistoria (70.9134)
alternative label: Nonfiguratiivinen taide, taidehistoria (70.9134)
alternative label: Nonfigurativ konst, konsthistoria (70.9134) @sv
alternative label: Nutiden, konsthistoria (70.9134) @sv
alternative label: Nykyaika, taidehistoria (70.9134)
alternative label: Nykytaide (70.9134)
alternative label: Optinen taide, taidehistoria (70.9134)
alternative label: Optisk konst, konsthistoria (70.9134) @sv
alternative label: Popkonst, konsthistoria (70.9134) @sv
alternative label: Poptaide, taidehistoria (70.9134)
alternative label: Postmodernism, konsthistoria (70.9134) @sv
alternative label: Postmodernismi, taidehistoria (70.9134)
alternative label: Psykedeelinen taide, taidehistoria (70.9134)
alternative label: Psykedelisk konst, konsthistoria (70.9134) @sv
alternative label: Realism, konsthistoria, 1900-talet (70.9134) @sv
alternative label: Realismi, taidehistoria, 1900-luku (70.9134)
alternative label: Samtidskonst (70.9134) @sv
alternative label: Socialistisk realism, konsthistoria (70.9134) @sv
alternative label: Sosialistinen realismi, taidehistoria (70.9134)
alternative label: Surrealism, konsthistoria (70.9134) @sv
alternative label: Surrealismi, taidehistoria (70.9134)
alternative label: Underground, konsthistoria (70.9134) @sv
alternative label: Underground-taide, taidehistoria (70.9134)
broader: Uuden ajan taide
in scheme: YKL - Yleisten kirjastojen luokitusjärjestelmä
notation: 70.9134
preferred label: Contemporary art @en
preferred label: Nutida konst @sv
scope note: Hit allmänna verk om modern europeisk och västerländsk konst från expressionism och kubism Hit också allmänna verk om europeisk och västerländsk konst från 1900- och 2000-talet Modernism. Postmodernism Formtillägget 09 används inte i samband med klasserna 70-77.4985 @sv
scope note: Tähän Euroopan ja länsimaiden nykyajan taiteen yleisteokset ekspressionismista ja kubismista alkaen Tähän myös Euroopan ja länsimaiden 1900- ja 2000-luvun taiteen yleisteokset Modernismi. Postmodernismi Muotoluokkaa 09 ei käytetä luokkien 70-77.4985 yhteydessä

Yleinen taidehistoria, Suomi
type: Concept
type: YKL-luokka
alternative label: Konsthistoria, Finland (70.92) @sv
alternative label: Taidehistoria, Suomi (70.92)
broader: Yleinen taidehistoria
in scheme: YKL - Yleisten kirjastojen luokitusjärjestelmä
notation: 70.92
preferred label: Allmän konsthistoria, Finland @sv
preferred label: General art history, Finland @en

Yleinen taidehistoria, Pohjoismaat
type: Concept
type: YKL-luokka
broader: Yleinen taidehistoria
in scheme: YKL - Yleisten kirjastojen luokitusjärjestelmä
notation: 70.93
preferred label: Allmän konsthistoria, Norden @sv
preferred label: General art history, Nordic countries @en
scope note: Danmark. Island. Norge. Sverige Hit också Färöarna och Grönland Hit också verk som behandlar flera nordiska länder, även Finland @sv
scope note: Islanti. Norja. Ruotsi. Tanska Tähän myös Fär-saaret ja Grönlanti Tähän myös teokset, jotka koskevat useampia Pohjoismaita, myös Suomea

Yleinen taidehistoria, Keski-Eurooppa
type: Concept
type: YKL-luokka
broader: Yleinen taidehistoria
in scheme: YKL - Yleisten kirjastojen luokitusjärjestelmä
narrower: Yleinen taidehistoria, Saksa
notation: 70.94
preferred label: Allmän konsthistoria, Mellaneuropa @sv
preferred label: General art history, Central Europe @en
scope note: Alankomaat. Belgia. Itävalta. Liechtenstein. Luxemburg. Slovakia. Sveitsi. Tsekki. Unkari
scope note: Belgien. Liechtenstein. Luxemburg. Nederländerna. Schweiz. Slovakien. Tjeckien. Ungern. Österrike @sv

Yleinen taidehistoria, Saksa
type: Concept
type: YKL-luokka
broader: Yleinen taidehistoria, Keski-Eurooppa
in scheme: YKL - Yleisten kirjastojen luokitusjärjestelmä
notation: 70.941
preferred label: Allmän konsthistoria, Tyskland @sv
preferred label: General art history, Germany @en

Yleinen taidehistoria, Iso-Britannia. Irlanti
type: Concept
type: YKL-luokka
broader: Yleinen taidehistoria
in scheme: YKL - Yleisten kirjastojen luokitusjärjestelmä
notation: 70.95
preferred label: Allmän konsthistoria, Storbritannien. Irland @sv
preferred label: General art history, Great Britain. Ireland @en

Yleinen taidehistoria, Etelä-Eurooppa
type: Concept
type: YKL-luokka
alternative label: Grekland, modern konsthistoria (70.96) @sv
alternative label: Kreikka, nykyajan taidehistoria (70.96)
broader: Yleinen taidehistoria
in scheme: YKL - Yleisten kirjastojen luokitusjärjestelmä
narrower: Yleinen taidehistoria, Ranska
narrower: Yleinen taidehistoria, Italia
narrower: Yleinen taidehistoria, Espanja
notation: 70.96
preferred label: Allmän konsthistoria, Sydeuropa @sv
preferred label: General art history, Etelä-Eurooppa @en
scope note: Albania. Bosnia ja Hertsegovina. Bulgaria. Kreikka. Kroatia. Makedonia. Malta. Portugali. Romania. Serbia ja Montenegro. Slovenia
scope note: Albanien. Bosnien-Hercegovina. Bulgarien. Grekland. Kroatien. Makedonien. Malta. Portugal. Rumänien. Serbien och Montenegro. Slovenien @sv

Yleinen taidehistoria, Ranska
type: Concept
type: YKL-luokka
broader: Yleinen taidehistoria, Etelä-Eurooppa
in scheme: YKL - Yleisten kirjastojen luokitusjärjestelmä
notation: 70.961
preferred label: Allmän konsthistoria, Frankrike @sv
preferred label: General art history, France @en
scope note: Hit också Monaco @sv
scope note: Tähän myös Monaco

Yleinen taidehistoria, Italia
type: Concept
type: YKL-luokka
broader: Yleinen taidehistoria, Etelä-Eurooppa
in scheme: YKL - Yleisten kirjastojen luokitusjärjestelmä
notation: 70.962
preferred label: Allmän konsthistoria, Italien @sv
preferred label: General art history, Italy @en
scope note: Hit också San Marino och Vatikanstaten @sv
scope note: Tähän myös San Marino ja Vatikaanivaltio

Yleinen taidehistoria, Espanja
type: Concept
type: YKL-luokka
broader: Yleinen taidehistoria, Etelä-Eurooppa
in scheme: YKL - Yleisten kirjastojen luokitusjärjestelmä
notation: 70.963
preferred label: Allmän konsthistoria, Spanien @sv
preferred label: General art history, Spain @en
scope note: Hit också Andorra @sv
scope note: Tähän myös Andorra

Yleinen taidehistoria, Itä-Eurooppa
type: Concept
type: YKL-luokka
alternative label: Konshistoria, Baltikum (70.97) @sv
alternative label: Taidehistoria, Baltian alue (70.97)
broader: Yleinen taidehistoria
in scheme: YKL - Yleisten kirjastojen luokitusjärjestelmä
narrower: Yleinen taidehistoria, Venäjä. Ukraina. Valko-Venäjä. Moldova
notation: 70.97
preferred label: Allmän konsthistoria, Östeuropa @sv
preferred label: General art history, Eastern Europe @en
scope note: Estland. Lettland. Litauen. Polen @sv
scope note: Latvia. Liettua. Puola. Viro

Yleinen taidehistoria, Venäjä. Ukraina. Valko-Venäjä. Moldova
type: Concept
type: YKL-luokka
broader: Yleinen taidehistoria, Itä-Eurooppa
in scheme: YKL - Yleisten kirjastojen luokitusjärjestelmä
notation: 70.971
preferred label: Allmän konsthistoria, Ryssland. Ukraina. Vitryssland. Moldova @sv
preferred label: General art history, Russia. Ukraine. Belarus. Moldova @en

Yleinen taidehistoria, Aasia
type: Concept
type: YKL-luokka
alternative label: Sumerer, konsthistoria (70.981) @sv
alternative label: Sumerit, taidehistoria (70.981)
broader: Yleinen taidehistoria
in scheme: YKL - Yleisten kirjastojen luokitusjärjestelmä
notation: 70.981
preferred label: Allmän konsthistoria, Asien @sv
preferred label: General art history, Asia @en
scope note: Hit också allmänna verk om österländsk konst @sv
scope note: Tähän myös itämaisen taiteen yleisteokset

Yleinen taidehistoria, Afrikka
type: Concept
type: YKL-luokka
broader: Yleinen taidehistoria
in scheme: YKL - Yleisten kirjastojen luokitusjärjestelmä
notation: 70.982
preferred label: Allmän konsthistoria, Afrika @sv
preferred label: General art history, Africa @en
scope note: Hit också allmänna verk om fornegyptisk konst @sv
scope note: Tähän myös Egyptin muinaistaiteen yleisteokset

Yleinen taidehistoria, Amerikka
type: Concept
type: YKL-luokka
alternative label: Asteekit, taidehistoria (70.983)
alternative label: Azteker, konsthistoria (70.983) @sv
alternative label: Inkafolket, konsthistoria (70.983) @sv
alternative label: Inkat, taidehistoria (70.983)
alternative label: Inuiter, konsthistoria (70.983) @sv
alternative label: Inuitit, taidehistoria (70.983)
alternative label: Mayafolket, konsthistoria (70.983) @sv
alternative label: Mayat, taidehistoria (70.983)
broader: Yleinen taidehistoria
in scheme: YKL - Yleisten kirjastojen luokitusjärjestelmä
notation: 70.983
preferred label: Allmän konsthistoria, Amerika @sv
preferred label: General art history, America @en

Yleinen taidehistoria, Australia ja Oseania
type: Concept
type: YKL-luokka
broader: Yleinen taidehistoria
in scheme: YKL - Yleisten kirjastojen luokitusjärjestelmä
notation: 70.985
preferred label: Allmän konsthistoria, Australien. Oceanien @sv
preferred label: General art history, Australia and Oceania @en

UUDET TAIDEMUODOT
type: Concept
References: Elämäntapojen sosiologia. Kulttuurisosiologia
References: Elokuva. Elokuvataide
References: Elektroakustinen musiikki
type: YKL-luokka
alternative label: Abstrakt konst, nya konstformer (71+) @sv
alternative label: Abstrakti taide, uudet taidemuodot (71+)
alternative label: Begreppskonst (71+) @sv
alternative label: Bildkonst, nya konstformer (71+) @sv
alternative label: Biokonst (71+) @sv
alternative label: Biotaide (71+)
alternative label: Datakonst (71+) @sv
alternative label: Digitaalinen taide (71+)
alternative label: Digital konst (71+) @sv
alternative label: Esinetaide (71+)
alternative label: Föremålskonst (71+) @sv
alternative label: Hologramkonst (71+) @sv
alternative label: Hologrammitaide (71+)
alternative label: Kineettinen taide, uudet taidemuodot (71+)
alternative label: Kinetisk konst, nya konstformer (71+) @sv
alternative label: Konkreettinen taide, uudet taidemuodot (71+)
alternative label: Konkret konst, nya konstformer (71+) @sv
alternative label: Konst (70 ... 78+) @sv
alternative label: Konst på nätet (71+) @sv
alternative label: Konst, olika konstformer (70 ... 78+) @sv
alternative label: Konstformer (70 ... 78+) @sv
alternative label: Konstnärsböcker, föremålskonst (71) @sv
alternative label: Konstruktivism, nya konstformer (71+) @sv
alternative label: Konstruktivismi, uudet taidemuodot (71+)
alternative label: Kuvataide, uudet taidemuodot (71+)
alternative label: Käsitetaide (71+)
alternative label: Mediataide (71+)
alternative label: Mediekonst (71+) @sv
alternative label: Mekaaninen taide, uudet taidemuodot (71+)
alternative label: Mekanisk konst, nya konstformer (71+) @sv
alternative label: Minimalism, nya konstformer (71+) @sv
alternative label: Minimalismi, uudet taidemuodot (71+)
alternative label: Modernism, nya konstformer (71+) @sv
alternative label: Modernismi, uudet taidemuodot (71+)
alternative label: Multimediataide (71+)
alternative label: Multimediekonst (71+) @sv
alternative label: Nonfiguratiivinen taide, uudet taidemuodot (71+)
alternative label: Nonfigurativ konst, nya konstformer (71+) @sv
alternative label: Nya konstformer (71+) @sv
alternative label: Optinen taide, uudet taidemuodot (71+)
alternative label: Optisk konst, nya konstformer (71+) @sv
alternative label: Postmodernism, nya konstformer (71+) @sv
alternative label: Postmodernismi, uudet taidemuodot (71+)
alternative label: Samhällskonst (71+) @sv
alternative label: Surrealism, nya konstformer (71+) @sv
alternative label: Surrealismi, uudet taidemuodot (71+)
alternative label: Taide, eri taidemuodot (70 ... 78+)
alternative label: Taidemuodot (70 ... 78+)
alternative label: Taiteet (70 ... 78+)
alternative label: Taiteilijakirjat, esinetaide (71)
alternative label: Tietokonetaide (71+)
alternative label: Uudet taidemuodot (71+)
alternative label: Verkkotaide (71+)
alternative label: Videokonst, nya konstformer (71+) @sv
alternative label: Videotaide, uudet taidemuodot (71+)
alternative label: Yhteisötaide (71+)
broader: TAITEET. LIIKUNTA
in scheme: YKL - Yleisten kirjastojen luokitusjärjestelmä
narrower: Tilataide. Ympäristötaide
narrower: Tatuointi. Kehotaide
narrower: Performanssitaide. Esitystaide
narrower: Katutaide. Graffititaide
notation: 71
preferred label: NEW ART FORMS @en
preferred label: NYA KONSTFORMER @sv
scope note: Hit och till underklasserna sådana nya konstformer som inte egentligen hör till något traditionellt konstområde eller som är en kombination av flera olika konstformer Datakonst. Digital konst. Föremålskonst. Hologramkonst. Konceptkonst. Mediekonst. Multimediekonst. Videokonst Formtillägget 09 används inte i samband med klasserna 70-77.4985 @sv
scope note: Tähän ja alaluokkiin ne uudet taidemuodot, jotka eivät varsinaisesti kuulu mihinkään perinteiseen taiteenalaan tai ovat usean taiteenalan yhdistelmiä Digitaalinen taide. Esinetaide. Hologrammitaide. Käsitetaide. Mediataide. Multimediataide. Tietokonetaide. Videotaide Muotoluokkaa 09 ei käytetä luokkien 70-77.4985 yhteydessä

Tilataide. Ympäristötaide
type: Concept
References: ARKKITEHTUURI
References: KUVANVEISTOTAIDE
References: Tekstiilitaide
type: YKL-luokka
alternative label: Eko-konst (71.3) @sv
alternative label: Ekotaide (71.3)
alternative label: Installaatiotaide (71.3)
alternative label: Installationer, nya konstformer (71.3) @sv
alternative label: Installationskonst (71.3) @sv
alternative label: Jordkonst (71.3) @sv
alternative label: Konsttextilier, textilskulptur (71.3) @sv
alternative label: Ljuskonst (71.3) @sv
alternative label: Maataide (71.3)
alternative label: Miljökonst (71.3) @sv
alternative label: Rum, installationskonst (71.3) @sv
alternative label: Taidetekstiilit, tekstiiliveistokset (71.3)
alternative label: Tekstiiliveistokset (71.3)
alternative label: Textilskulpturer (71.3) @sv
alternative label: Tila, tilataide (71.3)
alternative label: Tilataide (71.3)
alternative label: Valotaide (71.3)
alternative label: Ympäristötaide (71.3)
broader: UUDET TAIDEMUODOT
in scheme: YKL - Yleisten kirjastojen luokitusjärjestelmä
notation: 71.3
preferred label: Installation art. Environmental art @en
preferred label: Installationer. Miljökonst @sv
scope note: Hit sådana nya konstformer som strävar efter rumslig gestaltning genom medel som avviker från traditionell skulpturkonst eller arkitektur Jordkonst. Ljuskonst. Installationer Hit också textilskulptur Formtillägget 09 används inte i samband med klasserna 70-77.4985 @sv
scope note: Tähän uusista taidemuodoista ne, jotka pyrkivät tilan hahmottamiseen perinteisestä kuvanveistosta tai rakennustaiteesta poikkeavin keinoin Maataide. Valotaide. Installaatiotaide Tähän myös tekstiiliveistokset Muotoluokkaa 09 ei käytetä luokkien 70-77.4985 yhteydessä

Tatuointi. Kehotaide
type: Concept
References: Elämäntapojen sosiologia. Kulttuurisosiologia
References: KANSATIEDE. KULTTUURIANTROPOLOGIA
type: YKL-luokka
alternative label: Henna-tatuering (71.5) @sv
alternative label: Henna-tatuointi (71.5)
alternative label: Kehotaide (71.5)
alternative label: Kroppskonst (71.5) @sv
alternative label: Kroppsmålning (71.5) @sv
alternative label: Lävistys, kehotaide (71.5)
alternative label: Mehndi (71.5)
alternative label: Piercing, kroppskonst (71.5) @sv
alternative label: Tatuering (71.5) @sv
alternative label: Tatueringskonst (71.5) @sv
alternative label: Tatuointi (71.5)
alternative label: Tatuointitaide (71.5)
alternative label: Vartalomaalaus (71.5)
broader: UUDET TAIDEMUODOT
in scheme: YKL - Yleisten kirjastojen luokitusjärjestelmä
notation: 71.5
preferred label: Tattooing. Body-art @en
preferred label: Tatuering. Kroppskonst @sv
scope note: Tatuering. Tatueringskonst. Kroppskonst Mehndi. Henna-tatuering. Kroppsmålning Tatueringens etstetik, historia, personhistoria, kulturhistoria och kultursociologi oavsett motivkrets, land eller tidsperiod Tatueringens och kroppskonstens material och tekniker @sv
scope note: Tatuointi. Tatuointitaide. Kehotaide Mehndi. Henna-tatuointi. Vartalomaalaus Tatuoinnin estetiikka, historia, henkilöhistoria, kulttuurihistoria ja kulttuurisosiologia aihepiiristä, maasta ja aikakaudesta riippumatta Tatuoinnin ja kehotaiteen materiaalit ja tekniikka

Performanssitaide. Esitystaide
type: Concept
References: NÄYTTÄMÖTAIDE. ELOKUVATAIDE
type: YKL-luokka
alternative label: Esittävät taiteet, esitystaide (71.7)
alternative label: Esittävät taiteet, performanssi (71.7)
alternative label: Esitykset, esitystaide (71.7)
alternative label: Esitykset, performanssi (71.7)
alternative label: Esitystaide (71.7)
alternative label: Föreställande konst, performance (71.7) @sv
alternative label: Föreställningar, performance (71.7) @sv
alternative label: Happening (71.7)
alternative label: Ljudkonst, performativ konst (71.7) @sv
alternative label: Performancekonst (71.7) @sv
alternative label: Performanssitaide (71.7)
alternative label: Äänitaide, esitystaide (71.7)
broader: UUDET TAIDEMUODOT
in scheme: YKL - Yleisten kirjastojen luokitusjärjestelmä
notation: 71.7
preferred label: Performance @sv
preferred label: Performance art @en
scope note: Hit också happening Formtillägget 09 används inte i samband med klasserna 70-77.4985 @sv
scope note: Tähän myös happening Muotoluokkaa 09 ei käytetä luokkien 70-77.4985 yhteydessä

Katutaide. Graffititaide
type: Concept
References: Elämäntapojen sosiologia. Kulttuurisosiologia
type: YKL-luokka
alternative label: Gatukonst (71.8) @sv
alternative label: Graffiti, graffitikonst (71.8) @sv
alternative label: Graffitikonst (71.8) @sv
alternative label: Graffitit, graffititaide (71.8)
alternative label: Graffititaide (71.8)
alternative label: Katutaide (71.8)
broader: UUDET TAIDEMUODOT
in scheme: YKL - Yleisten kirjastojen luokitusjärjestelmä
notation: 71.8
preferred label: Gatukonst. Graffitikonst @sv
preferred label: Street art. Graffiti art @en

ARKKITEHTUURI
type: Concept
References: ALUESUUNNITTELU. ALUEPOLITIIKKA
References: Yhdyskuntasuunnittelu. Kaupunkisuunnittelu. Ympäristönsuunnittelu
References: KANSATIEDE. KULTTUURIANTROPOLOGIA
References: RAKENNUSTEKNIIKKA
References: Rakennusstatiikka. Rakennussuunnittelu
References: Sisustusoppaat
References: Sisustusarkkitehtuuri. Huonekalutaide
type: YKL-luokka
alternative label: Arkitektur (72) @sv
alternative label: Arkitekturritning, teknik (72) @sv
alternative label: Arkitekturtävlingar (72) @sv
alternative label: Arkkitehtuuri, yl. Ks. myös maittain) (72)
alternative label: Arkkitehtuurikilpailut (72)
alternative label: Arkkitehtuuripiirustus, tekniikka (72)
alternative label: Byggelement, arkitektur (72+) @sv
alternative label: Byggnadsinventeringar (72+) @sv
alternative label: Byggnadskonst (72) @sv
alternative label: Elementstrukturer, arkitektur (72+) @sv
alternative label: Elementtirakenteet, arkkitehtuuri (72+)
alternative label: Holvit, arkkitehtuuri (72+)
alternative label: Kolonner, arkitektur (72+) @sv
alternative label: Konst (70 ... 78+) @sv
alternative label: Konst, olika konstformer (70 ... 78+) @sv
alternative label: Konstformer (70 ... 78+) @sv
alternative label: Perspektiivioppi, arkkitehtuuripiirustus (72)
alternative label: Perspektivlära, arkitekturritning (72) @sv
alternative label: Piirustus, arkkitehtuuri (72+)
alternative label: Projektio-oppi, arkkitehtuuripiirustus (72)
alternative label: Projektionslära, arkitekturritning (72) @sv
alternative label: Pylväät, arkkitehtuuri (72+)
alternative label: Rakennuselementit, arkkitehtuuri (72+)
alternative label: Rakennusinventoinnit (72+)
alternative label: Rakennustaide (72)
alternative label: Ritning, arkitektur (72+) @sv
alternative label: Rum, arkitektur (72+) @sv
alternative label: Taide, eri taidemuodot (70 ... 78+)
alternative label: Taidemuodot (70 ... 78+)
alternative label: Taiteet (70 ... 78+)
alternative label: Tila, arkkitehtuuri (72+)
alternative label: Valv, arkitektur (72+) @sv
broader: TAITEET. LIIKUNTA
in scheme: YKL - Yleisten kirjastojen luokitusjärjestelmä
narrower: Rakennukset. Rakennustyypit
narrower: Arkkitehtuurin historia
notation: 72
preferred label: ARCHITECTURE @en
preferred label: ARKITEKTUR @sv
scope note: Hit allmänna verk om arkitektur och byggnadskonst Hit också arkitekturritningens teknik samt perspektiv- och projektionslära i arkitekturritning Om verket passar i klasserna för byggnadstyp, land och tidsperiod ges företräde i ordningsföljden byggnadstyp, land, tidsperiod Arkitektens land bestäms enligt det land där han eller hon haft sin huvudsakliga konstnärsbana Om verket innehåller både arkitektur och region- eller samhällsplanering, ges företräde åt klass 34 Om verket innehåller både arkitektur och byggnadsteknik, ges företräde åt klass 66+ Om verket innehåller både arkitektur och inredningsråd, ges företräde åt klass 72+ Formtillägget 09 används inte i samband med klasserna 70-77.4985 @sv
scope note: Tähän arkkitehtuurin ja rakennustaiteen yleisteokset Tähän myös arkkitehtuuripiirustuksen tekniikka sekä perspektiivi- ja projektio-oppi arkkitehtuuripiirustuksessa Jos teos sopii sekä rakennustyypin, maan että aikakauden mukaiseen luokkaan, annetaan etusija järjestyksessä: rakennustyyppi, maa, aikakausi Arkkitehdin maa määräytyy sen mukaan, missä hän on tehnyt keskeisen uransa Jos teoksessa on sekä arkkitehtuuria että alue-tai yhdyskuntasuunnittelua, annetaan etusija luokalle 34+ Jos teoksessa on sekä arkkitehtuuria että rakennustekniikkaa, annetaan etusija luokalle 66+ Jos teoksessa on sekä arkkitehtuuria että sisustusohjeita tai sisustusarkkitehtuuria, annetaan etusija luokalle 72+ Muotoluokkaa 09 ei käytetä luokkien 70-77.4985 yhteydessä

Rakennukset. Rakennustyypit
type: Concept
References: Yhdyskuntasuunnittelu. Kaupunkisuunnittelu. Ympäristönsuunnittelu
References: Viheralueiden suunnittelu
References: KANSATIEDE. KULTTUURIANTROPOLOGIA
References: Talonrakennus
References: Rakennuksen kunnossapito
References: Arkkitehtuurin historia
alternative label: Affärsbyggnader, arkitektur (72.2) @sv
alternative label: Affärscentra, arkitektur (72.2) @sv
alternative label: Arkitektur, enskilda byggnader (72.2+) @sv
alternative label: Arkitekturritningar, enskilda byggnader (72.2+) @sv
alternative label: Arkkitehtuuri, yksittäiset rakennukset (72.2+)
alternative label: Arkkitehtuurikilpailut, yksittäiset rakennukset (72.2+)
alternative label: Arkkitehtuuripiirustukset, yksittäiset rakennukset (72.2+)
alternative label: Asemarakennukset, arkkitehtuuri (72.2)
alternative label: Autiotuvat, arkkitehtuuri (72.2+)
alternative label: Entistäminen, arkkitehtuuri (72.2+)
alternative label: Entisöinti, arkkitehtuuri (72.2+)
alternative label: Hallintorakennukset, arkkitehtuuri (72.2)
alternative label: Hoitolaitokset, arkkitehtuuri (72.2)
alternative label: Julkiset rakennukset, arkkitehtuuri (72.2+)
alternative label: Jäähallit, arkkitehtuuri (72.2)
alternative label: Kauppahallit, arkkitehtuuri (72.2)
alternative label: Kauppakeskukset, arkkitehtuuri (72.2)
alternative label: Kaupunkiarkkitehtuuri, yksittäiset rakennukset, rakennustyypit (72.2+)
alternative label: Klinikat, arkkitehtuuri (72.2)
alternative label: Konservointi, arkkitehtuuri (72.2+)
alternative label: Kuntoutuslaitokset, arkkitehtuuri (72.2)
alternative label: Kylpylät, arkkitehtuuri (72.2)
alternative label: Lentoasemat, arkkitehtuuri (72.2)
alternative label: Liikennerakennukset, arkkitehtuuri (72.2)
alternative label: Liikerakennukset, arkkitehtuuri (72.2)
alternative label: Linja-autoasemat, arkkitehtuuri (72.2)
alternative label: Majat, arkkitehtuuri (72.2+)
alternative label: Parantolat, arkkitehtuuri (72.2)
alternative label: Peruskorjaukset, arkkitehtuuri (72.2+)
alternative label: Piharakennukset, arkkitehtuuri (72.2+)
alternative label: Rakennetut tilat, arkkitehtuuri (72.2+)
alternative label: Rakennukset, arkkitehtuuri (72.2+)
alternative label: Rakennukset, entisöinti, arkkitehtuuri (72.2+)
alternative label: Rakennukset, erillistilat, arkkitehtuuri (72.2+)
alternative label: Rakennukset, koristelu, yksittäiset (72.2+)
alternative label: Rakennukset, suojelu, arkkitehtuuri (72.2+)
alternative label: Rakennuskulttuuri, yksittäiset rakennukset, rakennustyypit (72.2+)
alternative label: Rakennusperinne, yksittäiset rakennukset, rakennustyypit (72.2+)
alternative label: Rakennuspiirustukset, arkkitehtuuri (72.2+)
alternative label: Rakennussuojelu, arkkitehtuuri (72.2+)
alternative label: Rakennussuunnittelu, arkkitehtuuri (72.2+)
alternative label: Rakennustutkimus, arkkitehtuuri (72.2+)
alternative label: Rakennustyypit, arkkitehtuuri (72.2+)
alternative label: Rautatieasemat, arkkitehtuuri (72.2)
alternative label: Restaurointi, arkkitehtuuri (72.2+)
alternative label: Sairaalat, arkkitehtuuri (72.2)
alternative label: Saneeraus, rakennukset, arkkitehtuuri (72.2+)
alternative label: Stadionit, arkkitehtuuri (72.2)
alternative label: Tehtaat, arkkitehtuuri (72.2)
alternative label: Teollisuusrakennukset, arkkitehtuuri (72.2)
alternative label: Teollisuusyhdyskunnat, arkkitehtuuri (72.2)
alternative label: Terveyskeskukset, arkkitehtuuri (72.2)
alternative label: Toimistorakennukset, arkkitehtuuri (72.2)
alternative label: Uimahallit, arkkitehtuuri (72.2)
alternative label: Uimastadionit, arkkitehtuuri (72.2)
alternative label: Ulkoilumajat, arkkitehtuuri (72.2+)
alternative label: Urheilukeskukset, rakennukset, arkkitehtuuri (72.2)
alternative label: Urheilumajat, arkkitehtuuri (72.2+)
alternative label: Urheilurakennukset, arkkitehtuuri (72.2)
alternative label: Varastorakennukset, arkkitehtuuri (72.2)
alternative label: Velodromit, arkkitehtuuri (72.2)
alternative label: Virastotalot, arkkitehtuuri (72.2)
alternative label: Voimalat, arkkitehtuuri (72.2)
alternative label: Yhteisölliset työtilat, arkkitehtuuri (72.2+)
broader: ARKKITEHTUURI
in scheme: YKL - Yleisten kirjastojen luokitusjärjestelmä
narrower: Asuinrakennukset
narrower: Kirkot ja muut uskonnolliset rakennukset
narrower: Linnat. Linnoitukset. Palatsit. Kartanot
narrower: Kulttuurirakennukset
notation: 72.2
scope note: Hit och till underklasserna oavsett land eller tidsperiod planering av bestämda byggnader eller byggnadstyper och deras historia ur arkitektonisk synvinkel Hit och till underklasserna också skydd, restaurering, sanering och ombyggnad av byggnader ur arkitektonisk synvinkel Hit och till underklasserna också arkitekturtävlingar, arkitekturritningar och byggnadsmodeller som rör en viss byggnad eller byggnadstyp Hit förvaltnings-, affärs-, industri-, lager-, trafik-, sport- och sjukhusbyggnader, deras arkitektur och arkitektoniska historia Om ett arbete som behandlar byggnader eller byggnadstyper i första hand beskriver ändamålet med byggnaden ges företräde åt klassen för bruket Om tyngdpunkten i ett arbete som behandlar byggnader eller byggnadstyper ligger på kultur-eller lokalhistoria ges företräde åt huvudklass 9 Formtillägget 09 används inte i samband med klasserna 70-77.4985 @sv
scope note: Tähän ja alaluokkiin maasta tai aikakaudesta riippumatta tietyn rakennuksen tai rakennustyypin suunnittelu ja historia arkkitehtuurin kannalta Tähän ja alaluokkiin myös rakennusten suojelu, entisöinti, saneeraus ja peruskorjaus arkkitehtuurin kannalta Tähän ja alaluokkiin myös tiettyä rakennusta tai rakennustyyppiä koskevat arkkitehtuurikilpailut sekä arkkitehtuuripiirustukset ja rakennusten pienoismallit Tähän virasto-, liike-, teollisuus-, varasto-, liikenne-, urheilu- ja sairaalarakennukset sekä niiden suunnittelu ja historia arkkitehtuurin kannalta Jos rakennusta tai rakennustyyppiä koskeva teos painottuu arkkitehtuurin sijasta kuvaamaan rakennuksen käyttöä, annetaan etusija käytön mukaiselle luokalle Jos rakennusta tai rakennustyyppiä koskeva teos painottuu kulttuuri- tai paikallishistoriaan, annetaan etusija pääluokalle 9 Muotoluokkaa 09 ei käytetä luokkien 70-77.4985 yhteydessä

Asuinrakennukset
type: Concept
References: Asuinalueiden suunnittelu
References: Asuntopolitiikka
References: Linnat. Linnoitukset. Palatsit. Kartanot
type: YKL-luokka
alternative label: Asuinrakennukset, arkkitehtuuri (72.22)
alternative label: Asunnot, arkkitehtuuri (72.22)
alternative label: Bastur, arkitektur (72.22) @sv
alternative label: Bostadsbyggnader, arkitektur (72.22) @sv
alternative label: Bostäder, arkitektur (72.22) @sv
alternative label: Egnahemshus, arkitektur (72.22) @sv
alternative label: Ekohus, arkitektur (72.22) @sv
alternative label: Ekotalot, arkkitehtuuri (72.22)
alternative label: Fritidshus, arkitektur (72.22) @sv
alternative label: Författarhem, arkitektur (72.22) @sv
alternative label: Hotell, arkitektur (72.22) @sv
alternative label: Hotellit, arkkitehtuuri (72.22)
alternative label: Huvilat, arkkitehtuuri (72.22)
alternative label: Huvimajat, arkkitehtuuri (72.22)
alternative label: Höghus, arkitektur (72.22) @sv
alternative label: Kerrostalot, arkkitehtuuri (72.22)
alternative label: Kesäasunnot, arkkitehtuuri (72.22)
alternative label: Kesämökit, arkkitehtuuri (72.22)
alternative label: Kirjailijakodit, arkkitehtuuri (72.22)
alternative label: Konstnärshem, arkitektur (72.22) @sv
alternative label: Loma-asunnot, arkkitehtuuri (72.22)
alternative label: Lusthus, arkitektur (72.22) @sv
alternative label: Majatalot, arkkitehtuuri (72.22)
alternative label: Motell, arkitektur (72.22) @sv
alternative label: Motellit, arkkitehtuuri (72.22)
alternative label: Omakotitalot, arkkitehtuuri (72.22)
alternative label: Palveluasunnot, arkkitehtuuri (72.22)
alternative label: Palvelutalot, arkkitehtuuri (72.22)
alternative label: Pappilat, arkkitehtuuri (72.22)
alternative label: Parhus, arkitektur (72.22) @sv
alternative label: Paritalot, arkkitehtuuri (72.22)
alternative label: Pientalot, arkkitehtuuri (72.22)
alternative label: Prästgårdar, arkitektur (72.22) @sv
alternative label: Puutalot, arkkitehtuuri (72.22)
alternative label: Radhus, arkitektur (72.22) @sv
alternative label: Rivitalot, arkkitehtuuri (72.22)
alternative label: Saunat, arkkitehtuuri (72.22)
alternative label: Semesterbostäder, arkitektur (72.22) @sv
alternative label: Servicebostäder, arkitektur (72.22) @sv
alternative label: Servicehus, arkitektur (72.22) @sv
alternative label: Småhus, arkitektur (72.22) @sv
alternative label: Sommarbostäder, arkitektur (72.22) @sv
alternative label: Sommarstugor, arkitektur (72.22) @sv
alternative label: Taiteilijakodit, arkkitehtuuri (72.22)
alternative label: Trähus, arkitektur (72.22) @sv
alternative label: Vapaa-ajan asunnot, arkkitehtuuri (72.22)
alternative label: Villor, arkitektur (72.22) @sv
alternative label: Värdshus, arkitektur (72.22) @sv
broader: Rakennukset. Rakennustyypit
in scheme: YKL - Yleisten kirjastojen luokitusjärjestelmä
notation: 72.22
preferred label: Bostadshus @sv
preferred label: Residential buildings @en
scope note: Hit arkitektur för bostadshus oavsett land och tidsperiod Flervåningshus. Radhus. Egnahemshus Villor. Fritidshus Hotell. Värdshus. Motell Hit också bastur Formtillägget 09 används inte i samband med klasserna 70-77.4985 @sv
scope note: Tähän maasta ja aikakaudesta riippumatta asuinrakennuksia koskeva arkkitehtuuri Kerrostalot. Rivitalot. Omakotitalot Huvilat. Kesäasunnot Hotellit. Majatalot. Motellit Tähän myös saunat Muotoluokkaa 09 ei käytetä luokkien 70-77.4985 yhteydessä

Kirkot ja muut uskonnolliset rakennukset
type: Concept
References: Kirkolliset esineet ja symbolit
References: KRISTILLISET KIRKOT JA YHTEISÖT. KIRKKOHISTORIA
type: YKL-luokka
alternative label: Basilikat, arkkitehtuuri (72.24)
alternative label: Basilikor, arkitektur (72.24) @sv
alternative label: Bysantinska kyrkor, arkitektur (72.24) @sv
alternative label: Bysanttilaiset kirkot, arkkitehtuuri (72.24)
alternative label: Bönehus, arkitektur (72.24) @sv
alternative label: Domkyrkor, arkitektur (72.24) @sv
alternative label: Församlingshus, arkitektur (72.24) @sv
alternative label: Gotiikka, kirkkoarkkitehtuuri (72.24)
alternative label: Gotik, kyrkoarkitektur (72.24) @sv
alternative label: Gravkammare, arkitektur (72.24) @sv
alternative label: Hautakammiot, arkkitehtuuri (72.24)
alternative label: Kapell, arkitektur (72.24) @sv
alternative label: Kappelit, arkkitehtuuri (72.24)
alternative label: Katedraalit, arkkitehtuuri (72.24)
alternative label: Katedraler, arkitektur (72.24) @sv
alternative label: Kellotapulit, kirkkoarkkitehtuuri (72.24)
alternative label: Kirkkoarkkitehtuuri (72.24)
alternative label: Kirkkorakennukset, arkkitehtuuri (72.24)
alternative label: Kirkot, arkkitehtuuri (72.24)
alternative label: Kivikirkot, arkkitehtuuri (72.24)
alternative label: Klockstaplar, kyrkoarkitektur (72.24) @sv
alternative label: Kloster, arkitektur (72.24) @sv
alternative label: Kyrkoarkitektur (72.24) @sv
alternative label: Kyrkobyggnader, arkitektur (72.24) @sv
alternative label: Kyrkor, arkitektur (72.24) @sv
alternative label: Luostarit, arkkitehtuuri (72.24)
alternative label: Moskeijat, arkkitehtuuri (72.24)
alternative label: Moskéer, arkitektur (72.24) @sv
alternative label: Pyramider, arkitektur (72.24) @sv
alternative label: Pyramidit, arkkitehtuuri (72.24)
alternative label: Religiösa byggnader, arkitektur (72.24) @sv
alternative label: Romaaninen arkkitehtuuri, kirkot (72.24)
alternative label: Romaaniset kirkot (72.24)
alternative label: Romansk arkitektur, kyrkor (72.24) @sv
alternative label: Romanska kyrkor (72.24) @sv
alternative label: Rukoushuoneet, arkkitehtuuri (72.24)
alternative label: Seurakuntatalot, arkkitehtuuri (72.24)
alternative label: Stenkyrkor, arkitektur (72.24) @sv
alternative label: Tempel, arkitektur (72.24) @sv
alternative label: Temppelit, arkkitehtuuri (72.24)
alternative label: Tuomiokirkot, arkkitehtuuri (72.24)
alternative label: Uskonnolliset rakennukset, arkkitehtuuri (72.24)
broader: Rakennukset. Rakennustyypit
in scheme: YKL - Yleisten kirjastojen luokitusjärjestelmä
notation: 72.24
preferred label: Churches and other religious buildings @en
preferred label: Kyrkor och andra religiösa byggnader @sv
scope note: Hit oavsett land och tidsperiod kyrkoarkitektur och annan religiös arkitektur Kyrkor. Kapell. Kloster Bönehus. Församlingshus Tempel. Moskéer Om verket innehåller både kyrkoarkitektur och kyrkliga föremål eller symboler, ges företräde åt klass 72.24 Formtillägget 09 används inte i samband med klasserna 70-77.4985 @sv
scope note: Tähän maasta ja aikakaudesta riippumatta kirkkoja ja muita uskonnollisia rakennuksia koskeva arkkitehtuuri Kirkot. Kappelit. Luostarit Rukoushuoneet. Seurakuntatalot Temppelit. Moskeijat Jos teoksessa on sekä kirkkoarkkitehtuuria että kirkollisia esineitä tai symboleja, annetaan etusija luokalle 72.24 Muotoluokkaa 09 ei käytetä luokkien 70-77.4985 yhteydessä

Linnat. Linnoitukset. Palatsit. Kartanot
type: Concept
References: Asuinrakennukset
type: YKL-luokka
alternative label: Fästningar, arkitektur (72.26) @sv
alternative label: Herrgårdar, arkitektur (72.26) @sv
alternative label: Kartanot, arkkitehtuuri (72.26)
alternative label: Linnat, arkkitehtuuri (72.26)
alternative label: Linnoitukset, arkkitehtuuri (72.26)
alternative label: Palats, arkitektur (72.26) @sv
alternative label: Palatsit, arkkitehtuuri (72.26)
alternative label: Slott, arkitektur (72.26) @sv
broader: Rakennukset. Rakennustyypit
in scheme: YKL - Yleisten kirjastojen luokitusjärjestelmä
notation: 72.26
preferred label: Castles. Forts. Palaces. Manors @en
preferred label: Slott. Fästningar. Palats. Herrgårdar @sv
scope note: Hit oavsett land och tidsperiod slotts-, fästnings-, palats- och herrgårdsarkitektur Om verket innehåller både arkitektur och historia eller kulturhistoria, ges företräde åt huvudklass 9 Formtillägget 09 används inte i samband med klasserna 70-77.4985 @sv
scope note: Tähän maasta ja aikakaudesta riippumatta linnoja, linnoituksia, palatseja ja kartanoita koskeva arkkitehtuuri Jos teoksessa on sekä arkkitehtuuria että historiaa tai kulttuurihistoriaa, annetaan etusija pääluokalle 9 Muotoluokkaa 09 ei käytetä luokkien 70-77.4985 yhteydessä

Kulttuurirakennukset
type: Concept
type: YKL-luokka
alternative label: Allaktivitetshus, arkitektur (72.29) @sv
alternative label: Ambassader, byggnader (72.29) @sv
alternative label: Arbetarhus, arkitektur (72.29) @sv
alternative label: Biblioteksbyggnader, arkitektur (72.29) @sv
alternative label: Biblioteksplanering, arkitektur (72.29) @sv
alternative label: Biografer, arkitektur (72.29) @sv
alternative label: Dansbanor, arkitektur (72.29) @sv
alternative label: Dansställen, arkitektur (72.29) @sv
alternative label: Diskon, arkitektur (72.29) @sv
alternative label: Diskot, arkkitehtuuri (72.29)
alternative label: Elokuvateatterit, arkkitehtuuri (72.29)
alternative label: Huvipaikat, arkkitehtuuri (72.29)
alternative label: Högskolebyggnader, arkitektur (72.29) @sv
alternative label: Kirjastorakennukset, arkkitehtuuri (72.29)
alternative label: Kirjastosuunnittelu, arkkitehtuuri (72.29)
alternative label: Konserthus, arkitektur (72.29) @sv
alternative label: Konserttitalot, arkkitehtuuri (72.29)
alternative label: Konstmuseer, arkitektur (72.29) @sv
alternative label: Korkeakoulurakennukset, arkkitehtuuri (72.29)
alternative label: Koulurakennukset, arkkitehtuuri (72.29)
alternative label: Kulttuurirakennukset, arkkitehtuuri (72.29)
alternative label: Kulturbyggnader, arkitektur (72.29) @sv
alternative label: Läroanstalter, arkitektur (72.29) @sv
alternative label: Monitoimitalot, arkkitehtuuri (72.29)
alternative label: Museer, arkitektur (72.29) @sv
alternative label: Museot, arkkitehtuuri (72.29)
alternative label: Nuorisotalot, arkkitehtuuri (72.29)
alternative label: Nöjesställen, arkitektur (72.29) @sv
alternative label: Oopperatalot, arkkitehtuuri (72.29)
alternative label: Operahus, arkitektur (72.29) @sv
alternative label: Oppilaitokset, arkkitehtuuri (72.29)
alternative label: Ravintolat, arkkitehtuuri (72.29)
alternative label: Restauranger, arkitektur (72.29) @sv
alternative label: Skolbyggnader, arkitektur (72.29) @sv
alternative label: Suurlähetystöt, rakennukset (72.29)
alternative label: TV-byggnader, arkitektur (72.29) @sv
alternative label: Taidemuseot, arkkitehtuuri (72.29)
alternative label: Tanssilavat, arkkitehtuuri (72.29)
alternative label: Tanssipaikat, arkkitehtuuri (72.29)
alternative label: Teaterhus, arkitektur (72.29) @sv
alternative label: Teatteritalot, arkkitehtuuri (72.29)
alternative label: Televisiorakennukset, arkkitehtuuri (72.29)
alternative label: Työväentalot, arkkitehtuuri (72.29)
alternative label: Ungdomshus, arkitektur (72.29) @sv
alternative label: Universitetsbyggnader, arkitektur (72.29) @sv
alternative label: Yliopistorakennukset, arkkitehtuuri (72.29)
broader: Rakennukset. Rakennustyypit
in scheme: YKL - Yleisten kirjastojen luokitusjärjestelmä
notation: 72.29
preferred label: Cultural buildings @en
preferred label: Kulturbyggnader @sv
scope note: Hit oavsett land och tidsperiod arkitektur för kulturbyggnader Teater-, konsert- och operahus Museer. Konstmuseer. Bibliotek Kulturhus. Allaktivitetshus Läroinrättningar. Skolor. Universitet. Högskolor Formtillägget 09 används inte i samband med klasserna 70-77.4985 @sv
scope note: Tähän maasta ja aikakaudesta riippumatta kulttuurirakennuksia koskeva arkkitehtuuri Teatteri-, konsertti- ja oopperatalot Museot. Taidemuseot. Kirjastot Kulttuuritalot. Monitoimitalot Oppilaitosten rakennukset. Koulut. Yliopistot. Korkeakoulut Muotoluokkaa 09 ei käytetä luokkien 70-77.4985 yhteydessä

Arkkitehtuurin historia
type: Concept
References: ALUESUUNNITTELU. ALUEPOLITIIKKA
References: Yhdyskuntasuunnittelu. Kaupunkisuunnittelu. Ympäristönsuunnittelu
References: Sisustusarkkitehtuuri. Huonekalutaide
References: Koristetaide. Ornamentiikka
type: YKL-luokka
alternative label: Arabialainen rakennustaide (72.9+)
alternative label: Arabisk byggnadskonst (72.9+) @sv
alternative label: Arkitekter, biografier och memoarer (72.9+) @sv
alternative label: Arkitektur, historia (72.9+) @sv
alternative label: Arkitekturritning, historia (72.9+) @sv
alternative label: Arkkitehdit, elämäkerrat ja muistelmat (72.9+)
alternative label: Arkkitehtuuri, historia (72.9+)
alternative label: Arkkitehtuuripiirustus, historia (72.9+)
alternative label: Byggnader, dekoration, stilhistoria (72.9+) @sv
alternative label: Byggnadskonst, historia (72.9+) @sv
alternative label: Byggnadskultur, arkitekturens historia (72.9+) @sv
alternative label: Byggnadsstilar, arkitekturens historia (72.9+) @sv
alternative label: Byggnadstradition, arkitekturens historia (72.9+) @sv
alternative label: Dekoration, byggnadsstilar (72.9+) @sv
alternative label: Dekorationsstilar, arkitektur (72.9+) @sv
alternative label: Dekorativ konst, arkitektur (72.9+) @sv
alternative label: Islam, arkitektur (72.9+) @sv
alternative label: Islam, arkkitehtuuri (72.9+)
alternative label: Kaupunkiarkkitehtuuri, arkkitehtuurin historia (72.9+)
alternative label: Koristelu, rakennustyylit (72.9+)
alternative label: Koristetaide, arkkitehtuuri (72.9+)
alternative label: Koristetyylit, arkkitehtuuri (72.9+)
alternative label: Ornamentiikka, arkkitehtuuri (72.9+)
alternative label: Ornamentik, arkitektur (72.9+) @sv
alternative label: Rakennukset, koristelu, tyylihistoria (72.9+)
alternative label: Rakennuskulttuuri, arkkitehtuurin historia (72.9+)
alternative label: Rakennusperinne, arkkitehtuurin historia (72.9+)
alternative label: Rakennustaide, historia (72.9+)
alternative label: Rakennustyylit, arkkitehtuurin historia (72.9+)
alternative label: Stadsarkitektur, arkitekturens historia (72.9+) @sv
broader: ARKKITEHTUURI
in scheme: YKL - Yleisten kirjastojen luokitusjärjestelmä
narrower: Euroopan arkkitehtuuri
narrower: Arkkitehtuurin historia, Suomi
narrower: Arkkitehtuurin historia, Pohjoismaat
narrower: Arkkitehtuurin historia, Keski-Eurooppa
narrower: Arkkitehtuurin historia, Iso-Britannia. Irlanti
narrower: Arkkitehtuurin historia, Etelä-Eurooppa
narrower: Arkkitehtuurin historia, Itä-Eurooppa
narrower: Arkkitehtuurin historia, Aasia
narrower: Arkkitehtuurin historia, Afrikka
narrower: Arkkitehtuurin historia, Amerikka
narrower: Arkkitehtuurin historia, Australia ja Oseania
notation: 72.9
preferred label: Architectural history @en
preferred label: Arkitekturens historia @sv
scope note: Hit allmänna verk om arkitekturens historia Hit och till underklasserna också arkitekturritningens och byggnadsdekorationens allmänna historia Hit och till underklasserna också verk om olika världsdelars eller länders arkitektur eller dess samt verk om enskilda arkitekter eller deras produktion Arkitektens land bestäms enligt det land där han eller hon haft sin huvudsakliga konstnärsbana Om verket behandlar en viss byggnad eller byggnadstyp, ges företräde åt klass 72.2+ Formtillägget 09 används inte i samband med klasserna 70-77.4985 @sv
scope note: Tähän arkkitehtuurin historian yleisteokset Tähän ja alaluokkiin myös arkkitehtuuripiirustuksen ja rakennusten koristelun yleinen historia Tähän ja alaluokkiin myös teokset, jotka koskevat eri maanosien tai maiden arkkitehtuuria tai sen historiaa sekä teokset, jotka koskevat yksittäisiä arkkitehtejä tai heidän tuotantoaan Arkkitehdin maa määräytyy sen mukaan, missä hän on tehnyt keskeisen uransa Jos teos koskee tiettyä rakennusta tai rakennustyyppiä, annetaan etusija luokalle 72.2+ Muotoluokkaa 09 ei käytetä luokkien 70-77.4985 yhteydessä

Euroopan arkkitehtuuri
type: Concept
type: YKL-luokka
alternative label: Länsimainen arkkitehtuuri (72.91+)
alternative label: Västerländsk arkitektur (72.91+) @sv
broader: Arkkitehtuurin historia
in scheme: YKL - Yleisten kirjastojen luokitusjärjestelmä
narrower: Esihistoriallinen ja vanhan ajan arkkitehtuuri
narrower: Keskiajan arkkitehtuuri
narrower: Uuden ajan arkkitehtuuri
notation: 72.91
preferred label: European architecture @en
preferred label: Europeisk arkitektur @sv
scope note: Hit och till underklasserna den europeiska och den västerländska arkitekturens och arkitekturdekorationens allmänna historia och stilhistoria Om verket passar i klasserna för byggnadstyp, land och tidsperiod ges företräde i följande ordning: byggnadstyp, land, tidsperiod Verk som behandlar andra världsdelars arkitektur under olika tidsperioder förs till klassen för respektive världsdels arkitekturhistoria Formtillägget 09 används inte i samband med klasserna 70-77.4985 @sv
scope note: Tähän ja alaluokkiin Euroopan ja länsimaiden arkkitehtuurin ja rakennusten koristelun yleinen historia ja tyylihistoria Jos teos sopii sekä rakennustyypin, maan että aikakauden mukaiseen luokkaan, annetaan etusija järjestyksessä: rakennustyyppi, maa, aikakausi Muiden maanosien eri aikakausien arkkitehtuuria koskevat teokset luokitetaan ko. maanosan arkkitehtuurin historiaan Muotoluokkaa 09 ei käytetä luokkien 70-77.4985 yhteydessä

Esihistoriallinen ja vanhan ajan arkkitehtuuri
type: Concept
References: Arkkitehtuurin historia, Aasia
References: Arkkitehtuurin historia, Afrikka
type: YKL-luokka
alternative label: Antiikki, arkkitehtuuri (72.911)
alternative label: Antiken, arkitektur (72.911) @sv
alternative label: Esihistoria, arkkitehtuuri (72.911)
alternative label: Förhistoria, arkitektur (72.911) @sv
alternative label: Gamla tiden, arkitektur (72.911) @sv
alternative label: Grekland, antikens arkitektur (72.911) @sv
alternative label: Kreikka, antiikin arkkitehtuuri (72.911)
alternative label: Romerska riket, arkitektur (72.911) @sv
alternative label: Rooman valtakunta, arkkitehtuuri (72.911)
alternative label: Vanha aika, arkkitehtuuri (72.911)
broader: Euroopan arkkitehtuuri
in scheme: YKL - Yleisten kirjastojen luokitusjärjestelmä
notation: 72.911
preferred label: Förhistorisk arkitektur och gamla tidens arkitektur @sv
preferred label: Prehistoric and ancient architecture @en
scope note: Hit allmänna verk om förhistorisk arkitektur och gamla tidens arkitektur i Europa Antikens arkitektur Formtillägget 09 används inte i samband med klasserna 70-77.4985 @sv
scope note: Tähän Euroopan esihistoriallisen ja vanhan ajan arkkitehtuurin yleisteokset Antiikin arkkitehtuuri Muotoluokkaa 09 ei käytetä luokkien 70-77.4985 yhteydessä

Keskiajan arkkitehtuuri
type: Concept
References: Kirkot ja muut uskonnolliset rakennukset
References: Linnat. Linnoitukset. Palatsit. Kartanot
type: YKL-luokka
alternative label: Bysans, arkitektur (72.912) @sv
alternative label: Bysantti, arkkitehtuuri (72.912)
alternative label: Gotiikka, arkkitehtuuri (72.912)
alternative label: Gotik, arkitektur (72.912) @sv
alternative label: Keskiaika, arkkitehtuuri (72.912)
alternative label: Medeltiden, arkitektur (72.912) @sv
alternative label: Romaaninen arkkitehtuuri (72.912)
alternative label: Romansk arkitektur (72.912) @sv
broader: Euroopan arkkitehtuuri
in scheme: YKL - Yleisten kirjastojen luokitusjärjestelmä
notation: 72.912
preferred label: Medeltidens arkitektur @sv
preferred label: Medieval architecture @en
scope note: Hit allmänna verk om medeltida europeisk arkitektur Romansk och gotisk arkitektur Hit också bysantinsk arkitektur Formtillägget 09 används inte i samband med klasserna 70-77.4985 @sv
scope note: Tähän Euroopan keskiajan arkkitehtuurin yleisteokset Romaaninen ja goottilainen arkkitehtuuri Tähän myös Bysantin arkkitehtuuri Muotoluokkaa 09 ei käytetä luokkien 70-77.4985 yhteydessä

Uuden ajan arkkitehtuuri
type: Concept
type: YKL-luokka
alternative label: Nya tiden, arkitektur (72.913+) @sv
alternative label: Uusi aika, arkkitehtuuri (72.913+)
broader: Euroopan arkkitehtuuri
in scheme: YKL - Yleisten kirjastojen luokitusjärjestelmä
narrower: Renessanssin arkkitehtuuri
narrower: Barokin ja rokokoon arkkitehtuuri
narrower: 1800-luvun ja vuosisadan vaihteen arkkitehtuuri
narrower: Nykyajan arkkitehtuuri
notation: 72.913
preferred label: Architecture of the modern era @en
preferred label: Nya tidens arkitektur @sv
scope note: Hit och till underklasserna allmänna verk om nya tidens arkitektur i Europa och västerlandet Formtillägget 09 används inte i samband med klasserna 70-77.4985 @sv
scope note: Tähän ja alaluokkiin Euroopan ja länsimaiden uuden ajan arkkitehtuurin yleisteokset Muotoluokkaa 09 ei käytetä luokkien 70-77.4985yhteydessä

Renessanssin arkkitehtuuri
type: Concept
type: YKL-luokka
alternative label: Manierism, arkitektur (72.9131) @sv
alternative label: Manierismi, arkkitehtuuri (72.9131)
alternative label: Renessanssi, arkkitehtuuri (72.9131)
alternative label: Renässans, arkitektur (72.9131) @sv
broader: Uuden ajan arkkitehtuuri
in scheme: YKL - Yleisten kirjastojen luokitusjärjestelmä
notation: 72.9131
preferred label: Renaissance architecture @en
preferred label: Renässansens arkitektur @sv
scope note: Formtillägget 09 används inte i samband med klasserna 70-77.4985 @sv
scope note: Muotoluokkaa 09 ei käytetä luokkien 70-77.4985 yhteydessä

Barokin ja rokokoon arkkitehtuuri
type: Concept
type: YKL-luokka
alternative label: Barock, arkitektur (72.9132) @sv
alternative label: Barokki, arkkitehtuuri (72.9132)
alternative label: Rokoko, arkitektur (72.9132) @sv
alternative label: Rokokoo, arkkitehtuuri (72.9132)
broader: Uuden ajan arkkitehtuuri
in scheme: YKL - Yleisten kirjastojen luokitusjärjestelmä
notation: 72.9132
preferred label: Barockens och rokokons arkitektur @sv
preferred label: Baroque and rococo architecture @en
scope note: Formtillägget 09 används inte i samband med klasserna 70-77.4985 @sv
scope note: Muotoluokkaa 09 ei käytetä luokkien 70-77.4985 yhteydessä

1800-luvun ja vuosisadan vaihteen arkkitehtuuri
type: Concept
type: YKL-luokka
alternative label: Art nouveau, arkitektur (72.9133) @sv
alternative label: Art nouveau, arkkitehtuuri (72.9133)
alternative label: Empire, arkitektur (72.9133) @sv
alternative label: Empire-tyyli, arkkitehtuuri (72.9133)
alternative label: Imitationsstilar, arkitektur (72.9133) @sv
alternative label: Jugend, arkitektur (72.9133) @sv
alternative label: Jugend, arkkitehtuuri (72.9133)
alternative label: Kansallisromantiikka, arkkitehtuuri (72.9133)
alternative label: Kertaustyylit, arkkitehtuuri (72.9133)
alternative label: L'art nouveau, arkitektur (72.9133) @sv
alternative label: L'art nouveau, arkkitehtuuri (72.9133)
alternative label: Nationalromantik, arkitektur (72.9133) @sv
alternative label: Nyklassicism, arkitektur (72.9133) @sv
alternative label: Romantiikka, arkkitehtuuri (72.9133)
alternative label: Romantik, arkitektur (72.9133) @sv
alternative label: Symbolism, arkitektur (72.9133) @sv
alternative label: Symbolismi, arkkitehtuuri (72.9133)
alternative label: Uusklassismi, arkkitehtuuri (72.9133)
broader: Uuden ajan arkkitehtuuri
in scheme: YKL - Yleisten kirjastojen luokitusjärjestelmä
notation: 72.9133
preferred label: 1800-talets och sekelskiftets arkitektur @sv
preferred label: Architecture of the 19th century and the turn of the century @en
scope note: Hit allmänna verk om romantikens arkitektur, nationalromantikens arkitektur och jugendarkitektur i Europa och västerlandet Hit också imitationsstilar, t.ex. nyklassicismen, i Europa och västerlandet Formtillägget 09 används inte i samband med klasserna 70-77.4985 @sv
scope note: Tähän Euroopan ja länsimaiden romantiikan, kansallisromantiikan tai jugendin arkkitehtuuria koskevat yleisteokset Tähän myös Euroopan ja länsimaiden kertaustyylien, esim. uusklassismin, arkkitehtuuri Muotoluokkaa 09 ei käytetä luokkien 70-77.4985 yhteydessä

Nykyajan arkkitehtuuri
type: Concept
type: YKL-luokka
alternative label: Ekspressionismi, arkkitehtuuri (72.9134)
alternative label: Expressionism, arkitektur (72.9134) @sv
alternative label: Funktionalism, arkitektur (72.9134) @sv
alternative label: Funktionalismi, arkkitehtuuri (72.9134)
alternative label: Konstruktivism, arkitektur (72.9134) @sv
alternative label: Konstruktivismi, arkkitehtuuri (72.9134)
alternative label: Modernism, arkitektur (72.9134) @sv
alternative label: Modernismi, arkkitehtuuri (72.9134)
alternative label: Nutiden, arkitektur (72.9134) @sv
alternative label: Nykyaika, arkkitehtuuri (72.9134)
alternative label: Postmodernism, arkitektur (72.9134) @sv
alternative label: Postmodernismi, arkkitehtuuri (72.9134)
broader: Uuden ajan arkkitehtuuri
in scheme: YKL - Yleisten kirjastojen luokitusjärjestelmä
notation: 72.9134
preferred label: Contemporary architecture @en
preferred label: Nutida arkitektur @sv
scope note: Hit allmänna verk om nutida arkitektur i Europa och västerlandet börjande med funktionalismen Hit också allmänna verk om europeisk och västerländsk 1900- och 2000-talsarkitektur Modernism och postmodernism i arkitekturen Formtillägget 09 används inte i samband med klasserna 70-77.4985 @sv
scope note: Tähän Euroopan ja länsimaiden nykyajan arkkitehtuurin yleisteokset funktionalismista alkaen Tähän myös Euroopan ja länsimaiden 1900- ja 2000-luvun arkkitehtuurin yleisteokset Modernismi ja postmodernismi arkkitehtuurissa Muotoluokkaa 09 ei käytetä luokkien 70-77.4985 yhteydessä

Arkkitehtuurin historia, Suomi
type: Concept
type: YKL-luokka
alternative label: Arkitektur, historia, Finland (72.92) @sv
alternative label: Arkkitehtuuri, historia, Suomi (72.92)
alternative label: Byggnadskonst, historia, Finland (72.92) @sv
alternative label: Rakennustaide, historia, Suomi (72.92)
broader: Arkkitehtuurin historia
in scheme: YKL - Yleisten kirjastojen luokitusjärjestelmä
notation: 72.92
preferred label: Architectural history, Finland @en
preferred label: Arkitekturens historia, Finland @sv

Arkkitehtuurin historia, Pohjoismaat
type: Concept
type: YKL-luokka
broader: Arkkitehtuurin historia
in scheme: YKL - Yleisten kirjastojen luokitusjärjestelmä
notation: 72.93
preferred label: Architectural history, Nordic countries @en
preferred label: Arkitekturens historia, Norden @sv
scope note: Island. Danmark. Norge. Sverige Hit också Färöarna och Grönland Hit också verk som behandlar flera nordiska länder, även Finland @sv
scope note: Islanti. Norja. Ruotsi. Tanska Tähän myös Fär-saaret ja Grönlanti Tähän myös teokset, jotka koskevat useampia Pohjoismaita, myös Suomea

Arkkitehtuurin historia, Keski-Eurooppa
type: Concept
type: YKL-luokka
broader: Arkkitehtuurin historia
in scheme: YKL - Yleisten kirjastojen luokitusjärjestelmä
narrower: Arkkitehtuurin historia, Saksa
notation: 72.94
preferred label: Architectural history, Central Europe @en
preferred label: Arkitekturens historia, Mellaneuropa @sv
scope note: Alankomaat. Belgia. Itävalta. Liechtenstein. Luxemburg. Slovakia. Sveitsi. Tsekki. Unkari
scope note: Belgien. Liechtenstein. Luxemburg. Nederländerna. Schweiz. Slovakien. Tjeckien. Ungern. Österrike @sv

Arkkitehtuurin historia, Saksa
type: Concept
type: YKL-luokka
broader: Arkkitehtuurin historia, Keski-Eurooppa
in scheme: YKL - Yleisten kirjastojen luokitusjärjestelmä
notation: 72.941
preferred label: Architectural history, Germany @en
preferred label: Arkitekturens historia, Tyskland @sv

Arkkitehtuurin historia, Iso-Britannia. Irlanti
type: Concept
type: YKL-luokka
broader: Arkkitehtuurin historia
in scheme: YKL - Yleisten kirjastojen luokitusjärjestelmä
notation: 72.95
preferred label: Architectural history, Great Britain. Ireland @en
preferred label: Arkitekturens historia, Storbritannien. Irland @sv

Arkkitehtuurin historia, Etelä-Eurooppa
type: Concept
type: YKL-luokka
alternative label: Grekland, modern arkitektur (72.96) @sv
alternative label: Kreikka, nykyajan arkkitehtuuri (72.96)
broader: Arkkitehtuurin historia
in scheme: YKL - Yleisten kirjastojen luokitusjärjestelmä
narrower: Arkkitehtuurin historia, Ranska
narrower: Arkkitehtuurin historia, Italia
narrower: Arkkitehtuurin historia, Espanja
notation: 72.96
preferred label: Architectural history, Etelä-Eurooppa @en
preferred label: Arkitekturens historia, Sydeuropa @sv
scope note: Albania. Bosnia ja Hertsegovina. Bulgaria. Kreikka. Kroatia. Makedonia. Malta. Portugali. Romania. Serbia ja Montenegro. Slovenia
scope note: Albanien. Bosnien-Hercegovina. Bulgarien. Grekland. Kroatien. Makedonien. Malta. Portugal. Rumänien. Serbien och Montenegro. Slovenien @sv

Arkkitehtuurin historia, Ranska
type: Concept
type: YKL-luokka
broader: Arkkitehtuurin historia, Etelä-Eurooppa
in scheme: YKL - Yleisten kirjastojen luokitusjärjestelmä
notation: 72.961
preferred label: Architectural history, France @en
preferred label: Arkitekturens historia, Frankrike @sv
scope note: Hit också Monaco @sv
scope note: Tähän myös Monaco

Arkkitehtuurin historia, Italia
type: Concept
type: YKL-luokka
broader: Arkkitehtuurin historia, Etelä-Eurooppa
in scheme: YKL - Yleisten kirjastojen luokitusjärjestelmä
notation: 72.962
preferred label: Architectural history, Italy @en
preferred label: Arkitekturens historia, Italien @sv
scope note: Hit också San Marino och Vatikanstaten @sv
scope note: Tähän myös San Marino ja Vatikaanivaltio

Arkkitehtuurin historia, Espanja
type: Concept
type: YKL-luokka
broader: Arkkitehtuurin historia, Etelä-Eurooppa
in scheme: YKL - Yleisten kirjastojen luokitusjärjestelmä
notation: 72.963
preferred label: Architectural history, Spain @en
preferred label: Arkitekturens historia, Spanien @sv
scope note: Hit också Andorra @sv
scope note: Tähän myös Andorra

Arkkitehtuurin historia, Itä-Eurooppa
type: Concept
type: YKL-luokka
broader: Arkkitehtuurin historia
in scheme: YKL - Yleisten kirjastojen luokitusjärjestelmä
narrower: Arkkitehtuurin historia, Venäjä. Ukraina. Valko-Venäjä. Moldova
notation: 72.97
preferred label: Architectural history, Eastern Europe @en
preferred label: Arkitekturens historia, Östeuropa @sv
scope note: Estland. Lettland. Litauen. Polen @sv
scope note: Latvia. Liettua. Puola. Viro

Arkkitehtuurin historia, Venäjä. Ukraina. Valko-Venäjä. Moldova
type: Concept
type: YKL-luokka
broader: Arkkitehtuurin historia, Itä-Eurooppa
in scheme: YKL - Yleisten kirjastojen luokitusjärjestelmä
notation: 72.971
preferred label: Architectural history, Russia. Ukraine. Belarus. Moldova @en
preferred label: Arkitekturens historia, Ryssland. Ukraina. Vitryssland. Moldova @sv

Arkkitehtuurin historia, Aasia
type: Concept
type: YKL-luokka
broader: Arkkitehtuurin historia
in scheme: YKL - Yleisten kirjastojen luokitusjärjestelmä
notation: 72.981
preferred label: Architectural history, Asia @en
preferred label: Arkitekturens historia, Asien @sv
scope note: Hit också österländsk byggnadskonst @sv
scope note: Tähän myös itämainen rakennustaide

Arkkitehtuurin historia, Afrikka
type: Concept
type: YKL-luokka
broader: Arkkitehtuurin historia
in scheme: YKL - Yleisten kirjastojen luokitusjärjestelmä
notation: 72.982
preferred label: Architectural history, Africa @en
preferred label: Arkitekturens historia, Afrika @sv
scope note: Hit också forntida egyptisk arkitektur @sv
scope note: Tähän myös Egyptin muinaisajan arkkitehtuuri

Arkkitehtuurin historia, Amerikka
type: Concept
type: YKL-luokka
alternative label: Arkitekturens historia, Nordamerika (72.983) @sv
alternative label: Arkkitehtuurin historia, Pohjois-Amerikka (72.983)
alternative label: Asteekit, arkkitehtuuri (72.983)
alternative label: Azteker, arkitektur (72.983) @sv
alternative label: Inkafolket, arkitektur (72.983) @sv
alternative label: Inkat, arkkitehtuuri (72.983)
alternative label: Mayafolket, arkitektur (72.983) @sv
alternative label: Mayat, arkkitehtuuri (72.983)
broader: Arkkitehtuurin historia
in scheme: YKL - Yleisten kirjastojen luokitusjärjestelmä
notation: 72.983
preferred label: Architectural history, America @en
preferred label: Arkitekturens historia, Amerika @sv

Arkkitehtuurin historia, Australia ja Oseania
type: Concept
type: YKL-luokka
broader: Arkkitehtuurin historia
in scheme: YKL - Yleisten kirjastojen luokitusjärjestelmä
notation: 72.985
preferred label: Architectural history, Australia and Oceania @en
preferred label: Arkitekturens historia, Australien. Oceanien @sv

KUVANVEISTOTAIDE
type: Concept
References: Tilataide. Ympäristötaide
type: YKL-luokka
alternative label: Bildhuggeri, skulptur (73+) @sv
alternative label: Bildkonst, skulptur (73+) @sv
alternative label: Konst (70 ... 78+) @sv
alternative label: Konst, olika konstformer (70 ... 78+) @sv
alternative label: Konstformer (70 ... 78+) @sv
alternative label: Kuvanveisto (73+)
alternative label: Kuvataide, kuvanveisto (73+)
alternative label: Medaljkonst (73+) @sv
alternative label: Mitalitaide (73+)
alternative label: Skulptur (73+) @sv
alternative label: Taide, eri taidemuodot (70 ... 78+)
alternative label: Taidemuodot (70 ... 78+)
alternative label: Taiteet (70 ... 78+)
alternative label: Veistotaide, kuvanveisto (73+)
broader: TAITEET. LIIKUNTA
in scheme: YKL - Yleisten kirjastojen luokitusjärjestelmä
narrower: Kuvanveiston materiaalit ja tekniikka
narrower: Kuvanveistotaiteen historia
notation: 73
preferred label: SCULPTURE @en
preferred label: SKULPTUR @sv
scope note: Hit allmänna verk om skulptur som innehåller både teknik och historia Hit och till underklasserna också medaljkonst Formtillägget 09 används inte i samband med klasserna 70-77.4985 @sv
scope note: Tähän kuvanveistotaiteen yleisteokset, joissa on sekä kuvanveiston tekniikkaa että historiaa Tähän ja alaluokkiin myös mitalitaide Muotoluokkaa 09 ei käytetä luokkien 70-77.4985 yhteydessä

Kuvanveiston materiaalit ja tekniikka
type: Concept
References: Kuvanveistotaiteen historia
References: Sisustusarkkitehtuuri. Huonekalutaide
type: YKL-luokka
alternative label: Alastonmalli, kuvanveiston tekniikka (73.1)
alternative label: Altarskulpturer, skulpturens teknik (73.1) @sv
alternative label: Alttariveistokset, kuvanveiston tekniikka (73.1)
alternative label: Betong, skulpturens teknik (73.1) @sv
alternative label: Betoni, kuvanveiston tekniikka (73.1)
alternative label: Bronsskulpturer, skulpturens teknik (73.1) @sv
alternative label: Collage (73.1) @sv
alternative label: Djurmotiv, skulpturens teknik (73.1) @sv
alternative label: Eläinaiheet, kuvanveiston tekniikka (73.1)
alternative label: Entistäminen, kuvanveisto (73.1)
alternative label: Entisöinti, kuvanveisto (73.1)
alternative label: Gips, skulpturens teknik (73.1) @sv
alternative label: Gipsskulpturer, skulpturens teknik (73.1) @sv
alternative label: Gjutmetoder, skulpturens teknik (73.1) @sv
alternative label: Keramikskulpturer, skulpturens teknik (73.1) @sv
alternative label: Kineettinen taide, kuvanveiston tekniikka (73.1)
alternative label: Kinetisk konst, skulpturens teknik (73.1) @sv
alternative label: Kipsi, kuvanveiston tekniikka (73.1)
alternative label: Kipsiveistokset, kuvanveiston tekniikka (73.1)
alternative label: Kivi, kuvanveiston materiaalit (73.1)
alternative label: Kiviveistokset, kuvanveiston tekniikka (73.1)
alternative label: Kollaasit, kuvanveiston tekniikka (73.1)
alternative label: Kollaasitaide (73.1)
alternative label: Kollage, skulpturens teknik (73.1) @sv
alternative label: Korkokuvat, kuvanveiston tekniikka (73.1)
alternative label: Kuvanveisto, käytännön oppaat (73.1)
alternative label: Kuvanveisto, materiaalit ja tekniikka (73.1)
alternative label: Lumiveistokset, tekniikka (73.1)
alternative label: Marmoriveistokset, kuvanveiston tekniikka (73.1)
alternative label: Marmorskulpturer, skulpturens teknik (73.1) @sv
alternative label: Medaljkonst, material och teknik (73.1) @sv
alternative label: Metalliveistokset, kuvanveiston tekniikka (73.1)
alternative label: Metallskulpturer, skulpturens teknik (73.1) @sv
alternative label: Mitalitaide, materiaalit ja tekniikka (73.1)
alternative label: Mobiler, skulpturens teknik (73.1) @sv
alternative label: Mobilet, kuvanveiston tekniikka (73.1)
alternative label: Modellering, skulpturens teknik (73.1) @sv
alternative label: Muotokuvat, kuvanveiston tekniikka (73.1)
alternative label: Muovailu, kuvanveiston tekniikka (73.1)
alternative label: Nakenmodell, skulpturens teknik (73.1) @sv
alternative label: Porträtt, skulpturens teknik (73.1) @sv
alternative label: Pronssiveistokset, kuvanveiston tekniikka (73.1)
alternative label: Puu, kuvanveiston materiaalit (73.1)
alternative label: Puuveistokset, kuvanveiston tekniikka (73.1)
alternative label: Reliefer, skulpturens teknik (73.1) @sv
alternative label: Reliefit, kuvanveiston tekniikka (73.1)
alternative label: Restaurering, skulptur (73.1) @sv
alternative label: Restaurointi, kuvanveisto (73.1)
alternative label: Saviveistokset, kuvanveiston tekniikka (73.1)
alternative label: Skulptur, material och teknik (73.1) @sv
alternative label: Skulptur, praktiska handböcker (73.1) @sv
alternative label: Skulpturer, material och teknik (73.1) @sv
alternative label: Snöskulpturer, teknik (73.1) @sv
alternative label: Sten, skulpturens material (73.1) @sv
alternative label: Stenskulpturer, skulpturens teknik (73.1) @sv
alternative label: Trä, skulpturmaterial (73.1) @sv
alternative label: Träskulpturer, skulpturens teknik (73.1) @sv
alternative label: Valumenetelmät, kuvanveiston tekniikka (73.1)
alternative label: Veistokset, materiaalit ja tekniikka (73.1)
broader: KUVANVEISTOTAIDE
in scheme: YKL - Yleisten kirjastojen luokitusjärjestelmä
notation: 73.1
preferred label: Sculpture materials and technique @en
preferred label: Skulpturens material och teknik @sv
scope note: Hit praktiska handböcker Hit t.ex. trä, lera, gips, sten och metall ur skulpturteknisk synvinkel Skulptörens arbetsredskap och arbetsmetoder Mobilteknik. Reliefteknik Hit också medaljkonstens material och teknik Formtillägget 09 används inte i samband med klasserna 70-77.4985 @sv
scope note: Tähän käytännön oppaat Tähän esim. puu, savi, kipsi, kivi ja metalli kuvanveiston tekniikan kannalta Kuvanveistäjän työkalut ja työmenetelmät Mobiletekniikka. Reliefitekniikka Tähän myös mitalitaiteen materiaalit ja tekniikka Muotoluokkaa 09 ei käytetä luokkien 70-77.4985 yhteydessä

Kuvanveistotaiteen historia
type: Concept
References: Tilataide. Ympäristötaide
References: Sisustusarkkitehtuuri. Huonekalutaide
type: YKL-luokka
alternative label: Alastonmalli, kuvanveiston historia (73.9+)
alternative label: Altarskulpturer, skulpturens historia (73.9+) @sv
alternative label: Alttariveistokset, kuvanveiston historia (73.9+)
alternative label: Bronsskulpturer, skulpturens historia (73.9+) @sv
alternative label: Collage (73.9) @sv
alternative label: Djurmotiv, skulpturens historia (73.9+) @sv
alternative label: Eläinaiheet, kuvanveiston historia (73.9+)
alternative label: Gipsskulpturer, skulpturens historia (73.9+) @sv
alternative label: Islam, kuvanveisto (73.9+)
alternative label: Islam, skulptur (73.9+) @sv
alternative label: Keramikskulpturer, skulpturens historia (73.9+) @sv
alternative label: Kineettinen taide, kuvanveiston historia (73.9+)
alternative label: Kinetisk konst, skulpturens historia (73.9+) @sv
alternative label: Kipsiveistokset, kuvanveiston historia (73.9+)
alternative label: Kiviveistokset, kuvanveiston historia (73.9+)
alternative label: Kollaasit, kuvanveiston historia (73.9+)
alternative label: Kollaasitaide (73.9)
alternative label: Kollage, skulpturens historia (73.9+) @sv
alternative label: Korkokuvat, kuvanveiston historia (73.9+)
alternative label: Kuvanveisto, historia (73.9+)
alternative label: Kuvanveistäjät, elämäkerrat ja muistelmat (73.9+)
alternative label: Lumiveistokset, historia (73.9+)
alternative label: Marmoriveistokset, kuvanveiston historia (73.9+)
alternative label: Marmorskulpturer, skulpturens historia (73.9+) @sv
alternative label: Medaljkonst, historia (73.9+) @sv
alternative label: Metalliveistokset, kuvanveiston historia (73.9+)
alternative label: Metallskulpturer, skulpturens historia (73.9+) @sv
alternative label: Mitalitaide, historia (73.9+)
alternative label: Mobiler, skulpturens historia (73.9+) @sv
alternative label: Mobilet, kuvanveiston historia (73.9+)
alternative label: Muotokuvat, kuvanveiston historia (73.9+)
alternative label: Nakenmodell, skulpturens historia (73.9+) @sv
alternative label: Porträtt, skulpturens historia (73.9+) @sv
alternative label: Pronssiveistokset, kuvanveiston historia (73.9+)
alternative label: Puuveistokset, kuvanveiston historia (73.9+)
alternative label: Reliefer, skulpturens historia (73.9+) @sv
alternative label: Reliefit, kuvanveiston historia (73.9+)
alternative label: Saviveistokset, kuvanveiston historia (73.9+)
alternative label: Skulptur, historia (73.9+) @sv
alternative label: Skulpturer, skulpturens historia (73.9+) @sv
alternative label: Skulptörer, biografier och memoarer (73.9+) @sv
alternative label: Snöskulpturer, historia (73.9+) @sv
alternative label: Stenskulpturer, skulpturens historia (73.9+) @sv
alternative label: Träskulpturer, skulpturens historia (73.9+) @sv
alternative label: Veistokset, kuvanveiston historia (73.9+)
broader: KUVANVEISTOTAIDE
in scheme: YKL - Yleisten kirjastojen luokitusjärjestelmä
narrower: Euroopan kuvanveistotaide
narrower: Kuvanveistotaiteen historia, Suomi
narrower: Kuvanveistotaiteen historia, Pohjoismaat
narrower: Kuvanveistotaiteen historia, Keski-Eurooppa
narrower: Kuvanveistotaiteen historia, Iso-Britannia. Irlanti
narrower: Kuvanveistotaiteen historia, Etelä-Eurooppa
narrower: Kuvanveistotaiteen historia, Itä-Eurooppa
narrower: Kuvanveistotaiteen historia, Aasia
narrower: Kuvanveistotaiteen historia, Afrikka
narrower: Kuvanveistotaiteen historia, Amerikka
narrower: Kuvanveistotaiteen historia, Australia ja Oseania
notation: 73.9
preferred label: History of sculpture @en
preferred label: Skulpturens historia @sv
scope note: Hit allmänna verk om skulpturens historia Hit och till underklasserna också motivens historia i skulpturen Hit och till underklasserna också medaljkonstens historia Hit och till underklasserna också verk om skulptur eller dess historia i olika världsdelar eller länder samt verk om enskilda skulptörer eller deras produktion Skulptörens land bestäms enligt det land där han eller hon haft sin huvudsakliga konstnärsbana Formtillägget 09 används inte i samband med klasserna 70-77.4985 @sv
scope note: Tähän kuvanveistotaiteen historian yleisteokset Tähän ja alaluokkiin myös kuvanveiston aihepiirien historia Tähän ja alaluokkiin myös mitalitaiteen historia Tähän ja alaluokkiin myös teokset, jotka koskevat eri maanosien tai maiden kuvanveistotaidetta tai sen historiaa sekä teokset, jotka koskevat yksittäisiä kuvanveistäjiä tai heidän tuotantoaan Kuvanveistäjän maa määräytyy sen mukaan, missä hän on tehnyt keskeisen uransa Muotoluokkaa 09 ei käytetä luokkien 70-77.4985 yhteydessä

Euroopan kuvanveistotaide
type: Concept
type: YKL-luokka
alternative label: Länsimainen kuvanveistotaide (73.91+)
alternative label: Västerländsk skulptur (73.91+) @sv
broader: Kuvanveistotaiteen historia
in scheme: YKL - Yleisten kirjastojen luokitusjärjestelmä
narrower: Esihistoriallinen ja vanhan ajan kuvanveistotaide
narrower: Keskiajan kuvanveistotaide
narrower: Uuden ajan kuvanveistotaide
notation: 73.91
preferred label: European sculpture @en
preferred label: Europeisk skulptur @sv
scope note: Hit och till underklasserna den europeiska och västerländska skulpturens allmänna historia och stilhistoria Om verket passar både i klassen för tidsperiod och klassen för land ges företräde åt klassen för land Verk om skulptur i övriga världsdelar under olika tidsperioder förs till klassen för den ifrågavarande världsdelens skulpturhistoria Formtillägget 09 används inte i samband med klasserna 70-77.4985 @sv
scope note: Tähän ja alaluokkiin Euroopan ja länsimaiden kuvanveistotaiteen yleinen historia ja tyylihistoria Jos teos sopii sekä aikakausittaiseen että maittaiseen luokkaan, annetaan etusija maan mukaiselle luokalle Muiden maanosien eri aikakausien kuvanveistotaidetta koskevat teokset luokitetaan ko. maanosien luokkaan Muotoluokkaa 09 ei käytetä luokkien 70-77.4985 yhteydessä

Esihistoriallinen ja vanhan ajan kuvanveistotaide
type: Concept
References: Kuvanveistotaiteen historia, Aasia
References: Kuvanveistotaiteen historia, Afrikka
type: YKL-luokka
alternative label: Antiikki, kuvanveisto (73.911)
alternative label: Antiken, skulptur (73.911) @sv
alternative label: Esihistoria, kuvanveisto (73.911)
alternative label: Etrusker, skulptur (73.911) @sv
alternative label: Etruskit, kuvanveisto (73.911)
alternative label: Förhistoria, skulptur (73.911) @sv
alternative label: Gamla tiden, skulptur (73.911) @sv
alternative label: Grekland, antikens skulptur (73.911) @sv
alternative label: Kreikka, antiikin kuvanveisto (73.911)
alternative label: Romerska riket, skulptur (73.911) @sv
alternative label: Rooman valtakunta, kuvanveisto (73.911)
alternative label: Vanha aika, kuvanveisto (73.911)
broader: Euroopan kuvanveistotaide
in scheme: YKL - Yleisten kirjastojen luokitusjärjestelmä
notation: 73.911
preferred label: Den förhistoriska tidens och gamla tidens skulptur @sv
preferred label: Prehistoric and ancient sculpture @en
scope note: Hit allmänna verk om skulptur i Europa under förhistorisk tid och under gamla tiden Antikens skulptur Formtillägget 09 används inte i samband med klasserna 70-77.4985 @sv
scope note: Tähän Euroopan esihistoriallisen ja vanhan ajan kuvanveistotaiteen yleisteokset Antiikin kuvanveistotaide Muotoluokkaa 09 ei käytetä luokkien 70-77.4985 yhteydessä

Keskiajan kuvanveistotaide
type: Concept
type: YKL-luokka
alternative label: Bysans, skulptur (73.912) @sv
alternative label: Bysantti, kuvanveisto (73.912)
alternative label: Gotiikka, kuvanveisto (73.912)
alternative label: Gotik, skulptur (73.912) @sv
alternative label: Keskiaika, kuvanveisto (73.912)
alternative label: Medeltiden, skulptur (73.912) @sv
alternative label: Romaaninen kuvanveisto (73.912)
alternative label: Romansk skulptur (73.912) @sv
broader: Euroopan kuvanveistotaide
in scheme: YKL - Yleisten kirjastojen luokitusjärjestelmä
notation: 73.912
preferred label: Medeltida skulptur @sv
preferred label: Medieval sculpture @en
scope note: Hit allmänna verk om medeltida europeisk skulptur Romansk och gotisk skulptur Hit också bysantinsk skulptur Formtillägget 09 används inte i samband med klasserna 70-77.4985 @sv
scope note: Tähän Euroopan keskiajan kuvanveistotaiteen yleisteokset Romaaninen ja goottilainen kuvanveistotaide Tähän myös Bysantin kuvanveistotaide Muotoluokkaa 09 ei käytetä luokkien 70-77.4985 yhteydessä

Uuden ajan kuvanveistotaide
type: Concept
type: YKL-luokka
alternative label: Nya tiden, skulptur (73.913+) @sv
alternative label: Uusi aika, kuvanveisto (73.913+)
broader: Euroopan kuvanveistotaide
in scheme: YKL - Yleisten kirjastojen luokitusjärjestelmä
narrower: Renessanssin kuvanveistotaide
narrower: Barokin ja rokokoon kuvanveistotaide
narrower: 1800-luvun ja vuosisadan vaihteen kuvanveistotaide
narrower: Nykyajan kuvanveistotaide
notation: 73.913
preferred label: Nya tidens skulptur @sv
preferred label: Sculpture of the modern era @en
scope note: Hit och till underklasserna allmänna verk om skulptur i Europa och västerlandet under nya tiden Formtillägget 09 används inte i samband med klasserna 70-77.4985 @sv
scope note: Tähän ja alaluokkiin Euroopan ja länsimaiden uuden ajan kuvanveistotaiteen yleisteokset Muotoluokkaa 09 ei käytetä luokkien 70-77.4985 yhteydessä

Renessanssin kuvanveistotaide
type: Concept
type: YKL-luokka
alternative label: Manierism, skulptur (73.9131) @sv
alternative label: Manierismi, kuvanveisto (73.9131)
alternative label: Renessanssi, kuvanveisto (73.9131)
alternative label: Renässans, skulptur (73.9131) @sv
broader: Uuden ajan kuvanveistotaide
in scheme: YKL - Yleisten kirjastojen luokitusjärjestelmä
notation: 73.9131
preferred label: Renaissance sculpture @en
preferred label: Renässansens skulptur @sv
scope note: Formtillägget 09 används inte i samband med klasserna 70-77.4985 @sv
scope note: Muotoluokkaa 09 ei käytetä luokkien 70-77.4985 yhteydessä

Barokin ja rokokoon kuvanveistotaide
type: Concept
type: YKL-luokka
alternative label: Barock, skulptur (73.9132) @sv
alternative label: Barokki, kuvanveisto (73.9132)
alternative label: Rokoko, skulptur (73.9132) @sv
alternative label: Rokokoo, kuvanveisto (73.9132)
broader: Uuden ajan kuvanveistotaide
in scheme: YKL - Yleisten kirjastojen luokitusjärjestelmä
notation: 73.9132
preferred label: Barockens och rokokons skulptur @sv
preferred label: Baroque and rococo sculpture @en
scope note: Formtillägget 09 används inte i samband med klasserna 70-77.4985 @sv
scope note: Muotoluokkaa 09 ei käytetä luokkien 70-77.4985 yhteydessä

1800-luvun ja vuosisadan vaihteen kuvanveistotaide
type: Concept
type: YKL-luokka
alternative label: Art nouveau, kuvanveisto (73.9133)
alternative label: Art nouveau, skulptur (73.9133) @sv
alternative label: Imitationsstilar, skulptur (73.9133) @sv
alternative label: Impressionism, skulptur (73.9133) @sv
alternative label: Impressionismi, kuvanveisto (73.9133)
alternative label: Jugend, kuvanveisto (73.9133)
alternative label: Jugend, skulptur (73.9133) @sv
alternative label: Kansallisromantiikka, kuvanveisto (73.9133)
alternative label: Kertaustyylit, kuvanveisto (73.9133)
alternative label: L'art nouveau, kuvanveisto (73.9133)
alternative label: L'art nouveau, skulptur (73.9133) @sv
alternative label: Nationalromantik, skulptur (73.9133) @sv
alternative label: Naturalism, skulptur (73.9133) @sv
alternative label: Naturalismi, kuvanveisto (73.9133)
alternative label: Nyklassicism, skulptur (73.9133) @sv
alternative label: Realism, skulptur, 1800-talet (73.9133) @sv
alternative label: Realismi, kuvanveisto, 1800-luku (73.9133)
alternative label: Romantiikka, kuvanveisto (73.9133)
alternative label: Romantik, skulptur (73.9133) @sv
alternative label: Symbolism, skulptur (73.9133) @sv
alternative label: Symbolismi, kuvanveisto (73.9133)
alternative label: Uusklassismi, kuvanveisto (73.9133)
broader: Uuden ajan kuvanveistotaide
in scheme: YKL - Yleisten kirjastojen luokitusjärjestelmä
notation: 73.9133
preferred label: 1800-talets och sekelskiftets skulptur @sv
preferred label: Sculpture of the 19th century and the turn of the century @en
scope note: Hit allmänna verk om romantikens, nationalromantikens och jugendtidens skulptur i Europa och västerlandet Hit också imitationsstilarnas, t.ex. nyklassicismens, skulptur i Europa och västerlandet Formtillägget 09 används inte i samband med klasserna 70-77.4985 @sv
scope note: Tähän Euroopan ja länsimaiden romantiikan, kansallisromantiikan ja jugendin kuvanveistotaidetta koskevat yleisteokset Tähän myös Euroopan ja länsimaiden kertaustyylien, esim. uusklassismin, kuvanveistotaide Muotoluokkaa 09 ei käytetä luokkien 70-77.4985 yhteydessä

Nykyajan kuvanveistotaide
type: Concept
type: YKL-luokka
alternative label: Abstrakt konst, skulptur, allm. (73.9134) @sv
alternative label: Abstrakti taide, kuvanveisto, yl. (73.9134)
alternative label: Dadaism, skulptur (73.9134) @sv
alternative label: Dadaismi, kuvanveisto (73.9134)
alternative label: Ekspressionismi, kuvanveisto (73.9134)
alternative label: Expressionism, skulptur (73.9134) @sv
alternative label: Futurism, skulptur (73.9134) @sv
alternative label: Futurismi, kuvanveisto (73.9134)
alternative label: Konkreettinen taide, kuvanveisto (73.9134)
alternative label: Konkret konst, skulptur (73.9134) @sv
alternative label: Konstruktivism, skulptur (73.9134) @sv
alternative label: Konstruktivismi, kuvanveisto (73.9134)
alternative label: Kubism, skulptur (73.9134) @sv
alternative label: Kubismi, kuvanveisto (73.9134)
alternative label: Minimalism, skulptur (73.9134) @sv
alternative label: Minimalismi, kuvanveisto (73.9134)
alternative label: Modernism, skulptur (73.9134) @sv
alternative label: Modernismi, kuvanveisto (73.9134)
alternative label: Naivism, skulptur (73.9134) @sv
alternative label: Naivismi, kuvanveisto (73.9134)
alternative label: Nonfiguratiivinen taide, kuvanveisto (73.9134)
alternative label: Nonfigurativ konst, skulptur (73.9134) @sv
alternative label: Nutiden, skulptur (73.9134) @sv
alternative label: Nykyaika, kuvanveisto (73.9134)
alternative label: Optinen taide, kuvanveisto (73.9134)
alternative label: Optisk konst, skulptur (73.9134) @sv
alternative label: Popkonst, skulptur (73.9134) @sv
alternative label: Poptaide, kuvanveisto (73.9134)
alternative label: Postmodernism, skulptur (73.9134) @sv
alternative label: Postmodernismi, kuvanveisto (73.9134)
alternative label: Psykedeelinen taide, kuvanveisto (73.9134)
alternative label: Psykedelisk konst, skulptur (73.9134) @sv
alternative label: Realism, skulptur, 1900-talet (73.9134) @sv
alternative label: Realismi, kuvanveisto, 1900-luku (73.9134)
alternative label: Socialistisk realism, skulptur (73.9134) @sv
alternative label: Sosialistinen realismi, kuvanveisto (73.9134)
alternative label: Surrealism, skulptur (73.9134) @sv
alternative label: Surrealismi, kuvanveisto (73.9134)
alternative label: Underground, skulptur (73.9134) @sv
alternative label: Underground-taide, kuvanveisto (73.9134)
broader: Uuden ajan kuvanveistotaide
in scheme: YKL - Yleisten kirjastojen luokitusjärjestelmä
notation: 73.9134
preferred label: Contemporary sculpture @en
preferred label: Modern skulptur @sv
scope note: Hit allmänna verk om modern europeisk och västerländsk skulptur från och med expressionismen och kubismen Hit också allmänna verk om europeisk och västerländsk skulptur från 1900- och 2000-talet Modernism och postmodernism i skulpturen Formtillägget 09 används inte i samband med klasserna 70-77.4985 @sv
scope note: Tähän Euroopan ja länsimaiden nykyajan kuvanveistotaiteen yleisteokset ekspressionismista ja kubismista alkaen Tähän myös Euroopan ja länsimaiden 1900- ja 2000-luvun kuvanveistotaiteen yleisteokset Modernismi ja postmodernismi kuvanveistotaiteessa Muotoluokkaa 09 ei käytetä luokkien 70-77.4985 yhteydessä

Kuvanveistotaiteen historia, Suomi
type: Concept
type: YKL-luokka
alternative label: Kuvanveisto, historia, Suomi (73.92)
alternative label: Skulptur, historia, Finland (73.92) @sv
broader: Kuvanveistotaiteen historia
in scheme: YKL - Yleisten kirjastojen luokitusjärjestelmä
notation: 73.92
preferred label: History of sculpture, Finland @en
preferred label: Skulpturens historia, Finland @sv

Kuvanveistotaiteen historia, Pohjoismaat
type: Concept
type: YKL-luokka
broader: Kuvanveistotaiteen historia
in scheme: YKL - Yleisten kirjastojen luokitusjärjestelmä
notation: 73.93
preferred label: History of sculpture, Nordic countries @en
preferred label: Skulpturens historia, Norden @sv
scope note: Danmark. Island. Norge. Sverige Hit också Färöarna och Grönland Hit också verk som behandlar flera nordiska länder, även Finland @sv
scope note: Islanti. Norja. Ruotsi. Tanska Tähän myös Fär-saaret ja Grönlanti Tähän myös teokset, jotka koskevat useampia Pohjoismaita, myös Suomea

Kuvanveistotaiteen historia, Keski-Eurooppa
type: Concept
type: YKL-luokka
broader: Kuvanveistotaiteen historia
in scheme: YKL - Yleisten kirjastojen luokitusjärjestelmä
narrower: Kuvanveistotaiteen historia, Saksa
notation: 73.94
preferred label: History of sculpture, Central Europe @en
preferred label: Skulpturens historia, Mellaneuropa @sv
scope note: Alankomaat. Belgia. Itävalta. Liechtenstein. Luxemburg. Slovakia. Sveitsi. Tsekki. Unkari
scope note: Belgien. Liechtenstein. Luxemburg. Nederländerna. Schweiz. Slovakien. Tjeckien. Ungern. Österrike @sv

Kuvanveistotaiteen historia, Saksa
type: Concept
type: YKL-luokka
broader: Kuvanveistotaiteen historia, Keski-Eurooppa
in scheme: YKL - Yleisten kirjastojen luokitusjärjestelmä
notation: 73.941
preferred label: History of sculpture, Germany @en
preferred label: Skulpturens historia, Tyskland @sv

Kuvanveistotaiteen historia, Iso-Britannia. Irlanti
type: Concept
type: YKL-luokka
broader: Kuvanveistotaiteen historia
in scheme: YKL - Yleisten kirjastojen luokitusjärjestelmä
notation: 73.95
preferred label: History of sculpture, Great Britain. Ireland @en
preferred label: Skulpturens historia, Storbritannien. Irland @sv

Kuvanveistotaiteen historia, Etelä-Eurooppa
type: Concept
type: YKL-luokka
alternative label: Grekland, modern skulptur (73.96) @sv
alternative label: Kreikka, nykyajan kuvanveisto (73.96)
broader: Kuvanveistotaiteen historia
in scheme: YKL - Yleisten kirjastojen luokitusjärjestelmä
narrower: Kuvanveistotaiteen historia, Ranska
narrower: Kuvanveistotaiteen historia, Italia
narrower: Kuvanveistotaiteen historia, Espanja
notation: 73.96
preferred label: History of sculpture, Etelä-Eurooppa @en
preferred label: Skulpturens historia, Sydeuropa @sv
scope note: Albania. Bosnia ja Hertsegovina. Bulgaria. Kreikka. Kroatia. Makedonia. Malta. Portugali. Romania. Serbia ja Montenegro. Slovenia
scope note: Albanien. Bosnien-Hercegovina. Bulgarien. Grekland. Kroatien. Makedonien. Malta. Portugal. Rumänien. Serbien och Montenegro. Slovenien @sv

Kuvanveistotaiteen historia, Ranska
type: Concept
type: YKL-luokka
broader: Kuvanveistotaiteen historia, Etelä-Eurooppa
in scheme: YKL - Yleisten kirjastojen luokitusjärjestelmä
notation: 73.961
preferred label: History of sculpture, France @en
preferred label: Skulpturens historia, Frankrike @sv
scope note: Hit också Monaco @sv
scope note: Tähän myös Monaco

Kuvanveistotaiteen historia, Italia
type: Concept
type: YKL-luokka
broader: Kuvanveistotaiteen historia, Etelä-Eurooppa
in scheme: YKL - Yleisten kirjastojen luokitusjärjestelmä
notation: 73.962
preferred label: History of sculpture, Italy @en
preferred label: Skulpturens historia, Italien @sv
scope note: Hit också San Marino och Vatikanstaten @sv
scope note: Tähän myös San Marino ja Vatikaanivaltio

Kuvanveistotaiteen historia, Espanja
type: Concept
type: YKL-luokka
broader: Kuvanveistotaiteen historia, Etelä-Eurooppa
in scheme: YKL - Yleisten kirjastojen luokitusjärjestelmä
notation: 73.963
preferred label: History of sculpture, Spain @en
preferred label: Skulpturens historia, Spanien @sv
scope note: Hit också Andorra @sv
scope note: Tähän myös Andorra

Kuvanveistotaiteen historia, Itä-Eurooppa
type: Concept
type: YKL-luokka
broader: Kuvanveistotaiteen historia
in scheme: YKL - Yleisten kirjastojen luokitusjärjestelmä
narrower: Kuvanveistotaiteen historia, Venäjä. Ukraina. Valko-Venäjä. Moldova
notation: 73.97
preferred label: History of sculpture, Eastern Europe @en
preferred label: Skulpturens historia, Östeuropa @sv
scope note: Estland. Lettland. Litauen. Polen @sv
scope note: Latvia. Liettua. Puola. Viro

Kuvanveistotaiteen historia, Venäjä. Ukraina. Valko-Venäjä. Moldova
type: Concept
type: YKL-luokka
broader: Kuvanveistotaiteen historia, Itä-Eurooppa
in scheme: YKL - Yleisten kirjastojen luokitusjärjestelmä
notation: 73.971
preferred label: History of sculpture, Russia. Ukraine. Belarus. Moldova @en
preferred label: Skulpturens historia, Ryssland. Ukraina. Vitryssland. Moldova @sv

Kuvanveistotaiteen historia, Aasia
type: Concept
type: YKL-luokka
broader: Kuvanveistotaiteen historia
in scheme: YKL - Yleisten kirjastojen luokitusjärjestelmä
notation: 73.981
preferred label: History of sculpture, Asia @en
preferred label: Skulpturens historia, Asien @sv
scope note: Hit också österländsk skulptur @sv
scope note: Tähän myös itämainen kuvanveistotaide

Kuvanveistotaiteen historia, Afrikka
type: Concept
type: YKL-luokka
broader: Kuvanveistotaiteen historia
in scheme: YKL - Yleisten kirjastojen luokitusjärjestelmä
notation: 73.982
preferred label: History of sculpture, Africa @en
preferred label: Skulpturens historia, Afrika @sv
scope note: Hit också det forntida Egyptens skulptur @sv
scope note: Tähän myös Egyptin muinaisajan kuvanveistotaide

Kuvanveistotaiteen historia, Amerikka
type: Concept
type: YKL-luokka
alternative label: Atsteekit, kuvanveisto (73.983)
alternative label: Azteker, skulptur (73.983) @sv
alternative label: Indianer, skulptur (73.983) @sv
alternative label: Inkafolket, skulptur (73.983) @sv
alternative label: Inkat, kuvanveisto (73.983)
alternative label: Intiaanit, kuvanveisto (73.983)
alternative label: Mayafolket, skulptur (73.983) @sv
alternative label: Mayat, kuvanveisto (73.983)
broader: Kuvanveistotaiteen historia
in scheme: YKL - Yleisten kirjastojen luokitusjärjestelmä
notation: 73.983
preferred label: History of sculpture, America @en
preferred label: Skulpturens historia, Amerika @sv

Kuvanveistotaiteen historia, Australia ja Oseania
type: Concept
type: YKL-luokka
broader: Kuvanveistotaiteen historia
in scheme: YKL - Yleisten kirjastojen luokitusjärjestelmä
notation: 73.985
preferred label: History of sculpture, Australia and Oceania @en
preferred label: Skulpturens historia, Australien. Oceanien @sv

MAALAUSTAIDE. PIIRUSTUSTAIDE
type: Concept
References: Lasimaalaus. Posliinimaalaus
References: UUDET TAIDEMUODOT
References: GRAFIIKKA. VALOKUVAUS
References: Lasitaide. Keramiikkataide
References: Koristetaide. Ornamentiikka
References: KUVAKIRJAT
References: SARJAKUVAT
type: YKL-luokka
alternative label: Bildkonst, målarkonst (74+) @sv
alternative label: Konst (70 ... 78+) @sv
alternative label: Konst, olika konstformer (70 ... 78+) @sv
alternative label: Konstformer (70 ... 78+) @sv
alternative label: Kuvataide, maalaustaide (74+)
alternative label: Taide, eri taidemuodot (70 ... 78+)
alternative label: Taidemuodot (70 ... 78+)
alternative label: Taiteet (70 ... 78+)
alternative label: Taulut, kehystäminen (74)
alternative label: Tavlor, inramning (74) @sv
broader: TAITEET. LIIKUNTA
in scheme: YKL - Yleisten kirjastojen luokitusjärjestelmä
narrower: Piirustustaide
narrower: Maalaustaide
narrower: Aiheet piirustus- ja maalaustaiteessa
narrower: Piirustus- ja maalaustaiteen historia
notation: 74
preferred label: MÅLARKONST. TECKNINGSKONST @sv
preferred label: PAINTING. DRAWING @en
scope note: Hit allmänna verk som behandlar både tecknings-och målarkonstens teknik och historia Om ett verk passar i klasserna för tecknings- eller målarkonstens teknik, motiv, land och tidsperiod ges företräde i följande ordning: teknik, motiv, land, tidsperiod Verk om enskilda konstnärer eller deras produktion förs dock alltid till klass 74.9+ Konstnärens land bestäms enligt det land där han eller hon haft sin huvudsakliga konstnärsbana Teckningskonst 74.1+ Målarkonst 74.2+ Motiv i tecknings- och målarkonsten 74.3 Tecknings- och målarkonstens historia 74.9+ Formtillägget 09 används inte i samband med klasserna 70-77.4985 @sv
scope note: Tähän yleisteokset, jotka koskevat sekä piirustus- että maalaustaiteen tekniikkaa ja historiaa Jos teos sopii sekä piirustus- tai maalaustaiteen tekniikan, aihepiirien, maan tai aikakauden mukaiseen luokkaan, annetaan etusija järjestyksessä: tekniikka, aihepiiri, maa, aikakausi Yksittäistä taiteilijaa tai hänen tuotantoaan koskevat teokset luokitetaan kuitenkin aina luokkaan 74.9+ Taiteilijan maa määräytyy sen mukaan, missä hän on tehnyt keskeisen uransa Piirustustaide 74.1+ Maalaustaide 74.2+ Aihepiirit piirustus- ja maalaustaiteessa 74.3 Piirustus- ja maalaustaiteen historia 74.9+ Muotoluokkaa 09 ei käytetä luokkien 70-77.4985 yhteydessä

Piirustustaide
type: Concept
References: Aiheet piirustus- ja maalaustaiteessa
References: Piirustus- ja maalaustaiteen historia
References: Grafiikka
References: Animaatioelokuva
References: KUVAKIRJAT
References: SARJAKUVAT
type: YKL-luokka
alternative label: Bildkonst, teckningskonst (74.1+) @sv
alternative label: Kuvataide, piirustustaide (74.1+)
alternative label: Piirustus, piirustustaide (74.1)
alternative label: Piirustustaide (74.1)
alternative label: Teckning, teckningskonst (74.1) @sv
alternative label: Teckningskonst (74.1) @sv
broader: MAALAUSTAIDE. PIIRUSTUSTAIDE
in scheme: YKL - Yleisten kirjastojen luokitusjärjestelmä
narrower: Piirustuksen tekniikka
narrower: Tekstaus. Kalligrafia
narrower: Pilapiirrokset. Karikatyyrit
notation: 74.1
preferred label: Drawing @en
preferred label: Teckningskonst @sv
scope note: Hit allmänna verk om teckningskonst som behandlar både teckningsteknik och teckningskonstens historia Om verket behandlar både teckningskonst och grafisk konst ges företräde åt klass 75.1+ Formtillägget 09 används inte i samband med klasserna 70-77.4985 @sv
scope note: Tähän piirustustaiteen yleisteokset, jotka koskevat sekä piirustuksen tekniikkaa että piirustustaiteen historiaa Jos teos koskee sekä piirustustaidetta että graafista taidetta, annetaan etusija luokalle 75.1+ Muotoluokkaa 09 ei käytetä luokkien 70-77.4985 yhteydessä

Piirustuksen tekniikka
type: Concept
References: Geodesia. Maanmittaus. Kartoitus
References: Tekninen piirustus
References: Konetekniikka. Voitelutekniikka
References: Rakennusstatiikka. Rakennussuunnittelu
References: ARKKITEHTUURI
References: Grafiikan materiaalit ja tekniikka
References: Animaatioelokuva
References: Sarjakuvien historia ja tutkimus
type: YKL-luokka
alternative label: Alastonmalli, piirustustaiteen tekniikka (74.11)
alternative label: Anatomi, tecknings- och målarkonst (74.11) @sv
alternative label: Anatomia, piirustus- ja maalaustaide (74.11)
alternative label: Asetelmat, piirustustaiteen tekniikka (74.11)
alternative label: Djurmotiv, teckningskonstens teknik (74.11) @sv
alternative label: Eläinaiheet, piirustustaiteen tekniikka (74.11)
alternative label: Hiilipiirustus, piirustustaiteen tekniikka (74.11)
alternative label: Kasviaiheet, piirustustaiteen tekniikka (74.11)
alternative label: Kolteckning, teckningskonstens teknik (74.11) @sv
alternative label: Landskap, teckningskonstens teknik (74.11) @sv
alternative label: Maisemat, piirustustaiteen tekniikka (74.11)
alternative label: Mallipiirustus, piirustustaiteen tekniikka (74.11)
alternative label: Modellteckning, teckningskonstens teknik (74.11) @sv
alternative label: Muotokuvat, piirustustaiteen tekniikka (74.11)
alternative label: Nakenmodell, teckningskonstens teknik (74.11) @sv
alternative label: Paperilaadut, piirustustaiteen tekniikka (74.11)
alternative label: Papperssorter, teckningskonstens teknik (74.11) @sv
alternative label: Perspektiivioppi, piirustustaiteen tekniikka (74.11)
alternative label: Perspektivlära, teckningskonstens teknik (74.11) @sv
alternative label: Piirustus, oppaat (74.11)
alternative label: Piirustus, piirustustaide, tekniikka (74.11)
alternative label: Piirustus, välineet ja materiaalit (74.11)
alternative label: Piirustustaide, tekniikka (74.11)
alternative label: Porträtt, teckningskonstens teknik (74.11) @sv
alternative label: Projektio-oppi, piirustustaiteen tekniikka (74.11)
alternative label: Projektionslära, teckningskonstens teknik (74.11) @sv
alternative label: Sarjakuvat, piirustuksen tekniikka (74.11)
alternative label: Seriebilder, teckningens teknik (74.11) @sv
alternative label: Stilleben, teckningskonstens teknik (74.11) @sv
alternative label: Teckning, handböcker (74.11) @sv
alternative label: Teckning, medel och material (74.11) @sv
alternative label: Teckning, teckningskonst, teknik (74.11) @sv
alternative label: Teckningskonst, teknik (74.11) @sv
alternative label: Växtmotiv, teckningskonstens teknik (74.11) @sv
broader: Piirustustaide
in scheme: YKL - Yleisten kirjastojen luokitusjärjestelmä
notation: 74.11
preferred label: Drawing technique @en
preferred label: Teckningsteknik @sv
scope note: Hit praktiska handböcker i teckning. Konsten att teckna i allmänhet Ritpapper och pennor. Kolteckning Anatomi för konstnärer. Modellteckning Hit också serieteckningsteknik Perspektiv- och projektionslära ur teckningskonstens synvinkel Om verket behandlar både tecknings- och målarkonstens teknik ges företräde åt klass 74.21 Formtillägget 09 används inte i samband med klasserna 70-77.4985 @sv
scope note: Tähän käytännön piirustusoppaat. Piirustustaito yleensä Piirustuspaperit ja -kynät. Hiilipiirustus Anatomia taiteilijoille. Mallipiirustus Tähän myös sarjakuvapiirustuksen tekniikka Perspektiivi- ja projektio-oppi piirustustaiteen kannalta Jos teos koskee sekä piirustus- että maalaustaiteen tekniikkaa, annetaan etusija luokalle 74.21 Muotoluokkaa 09 ei käytetä luokkien 70-77.4985 yhteydessä

Tekstaus. Kalligrafia
type: Concept
References: Kirjoitus
References: Kirjoituksen historia. Paleografia. Epigrafia
type: YKL-luokka
alternative label: Kalligrafi, konst (74.12) @sv
alternative label: Kalligrafia, taide (74.12)
alternative label: Kirjainmuodot, tekstausoppaat (74.12)
alternative label: Tekstausoppaat (74.12)
alternative label: Tekstaustaide (74.12)
alternative label: Textningshandböcker (74.12) @sv
alternative label: Textningskonst (74.12) @sv
alternative label: Typsnitt, textningshandböcker (74.12) @sv
broader: Piirustustaide
in scheme: YKL - Yleisten kirjastojen luokitusjärjestelmä
notation: 74.12
preferred label: Lettering. Calligraphy @en
preferred label: Textning. Kalligrafi @sv
scope note: Tekstaus- ja kalligrafiataiteen tekniikka ja historia Tekstausoppaat Muotoluokkaa 09 ei käytetä luokkien 70-77.4985 yhteydessä
scope note: Textnings- och kalligrafikonstens teknik och historia Textningshandböcker Formtillägget 09 används inte i samband med klasserna 70-77.4985 @sv

Pilapiirrokset. Karikatyyrit
type: Concept
References: Piirustuksen tekniikka
References: Sananlaskut. Arvoitukset. Vertaukset. Kaskut
References: KERTOMAKIRJALLISUUS
References: KUVAKIRJAT
type: YKL-luokka
alternative label: Karikatyrer (74.17) @sv
alternative label: Karikatyyrit (74.17)
alternative label: Pilakuvat, piirretyt (74.17)
alternative label: Pilapiirrokset (74.17)
alternative label: Poliittiset pilapiirrokset (74.17)
alternative label: Politiska karikatyrer (74.17) @sv
alternative label: Skämtbilder, tecknade (74.17) @sv
alternative label: Skämtteckningar (74.17) @sv
broader: Piirustustaide
in scheme: YKL - Yleisten kirjastojen luokitusjärjestelmä
notation: 74.17
preferred label: Cartoons. Caricatures @en
preferred label: Skämtteckningar. Karikatyrer @sv
scope note: Pilapiirros- ja karikatyyritaiteen historia Tähän myös poliittiset pilapiirrokset ja niiden historia Muotoluokkaa 09 ei käytetä luokkien 70-77.4985 yhteydessä
scope note: Skämt- och karikatyrkonstens historia Hit också politiska skämtteckningar och deras historia Formtillägget 09 används inte i samband med klasserna 70-77.4985 @sv

Maalaustaide
type: Concept
References: Lasimaalaus. Posliinimaalaus
References: UUDET TAIDEMUODOT
References: Piirustustaide
References: Piirustus- ja maalaustaiteen historia
References: Kuvitustaide
References: Lasitaide. Keramiikkataide
References: KUVAKIRJAT
type: YKL-luokka
alternative label: Maalaustaide (74.2)
alternative label: Målarkonst (74.2) @sv
broader: MAALAUSTAIDE. PIIRUSTUSTAIDE
in scheme: YKL - Yleisten kirjastojen luokitusjärjestelmä
narrower: Maalaustaiteen materiaalit ja tekniikka
notation: 74.2
preferred label: Målarkonst @sv
preferred label: Painting @en
scope note: Hit allmänna verk om målarkonst som innehåller både målarkonstens teknik och dess historia Formtillägget 09 används inte i samband med klasserna 70-77.4985 @sv
scope note: Tähän maalaustaiteen yleisteokset, joissa on sekä maalaustaiteen tekniikkaa että historiaa Muotoluokkaa 09 ei käytetä luokkien 70-77.4985 yhteydessä

Maalaustaiteen materiaalit ja tekniikka
type: Concept
References: Lasimaalaus. Posliinimaalaus
References: Taiteen estetiikka
References: Piirustuksen tekniikka
References: Grafiikan materiaalit ja tekniikka
References: Lasitaide. Keramiikkataide
alternative label: Air brush -tekniikka, maalaustaiteen tekniikka (74.21)
alternative label: Air brush -teknik, målarkonstens teknik (74.21) @sv
alternative label: Akrylmålning, målarkonstens teknik (74.21) @sv
alternative label: Akryylimaalaus, maalaustaiteen tekniikka (74.21)
alternative label: Akvareller, målarkonstens teknik (74.21) @sv
alternative label: Akvarellhandböcker (74.21) @sv
alternative label: Akvarellioppaat (74.21)
alternative label: Akvarellit, maalaustaiteen tekniikka (74.21)
alternative label: Alastonmalli, maalaustaiteen tekniikka (74.21)
alternative label: Altartavlor, målarkonstens teknik (74.21) @sv
alternative label: Alttaritaulut, maalaustaiteen tekniikka (74.21)
alternative label: Asetelmat, maalaustaiteen tekniikka (74.21)
alternative label: Blomstermålningar, målarkonstens teknik (74.21) @sv
alternative label: Collage (74.21) @sv
alternative label: Djurmotiv, målarkonstens teknik (74.21) @sv
alternative label: Eläinaiheet, maalaustaiteen tekniikka (74.21)
alternative label: Entistäminen, maalaustaide (74.21)
alternative label: Entisöinti, maalaustaide (74.21)
alternative label: Fresker, målarkonstens teknik (74.21) @sv
alternative label: Freskot, maalaustaiteen tekniikka (74.21)
alternative label: Färger, målarkonstens teknik (74.21) @sv
alternative label: Färgsprutteknik, målarkonstens teknik (74.21) @sv
alternative label: Gouache, målarkonstens teknik (74.21) @sv
alternative label: Guassit, maalaustaiteen tekniikka (74.21)
alternative label: Ikoner, målarkonstens teknik (74.21) @sv
alternative label: Ikonit, maalaustaiteen tekniikka (74.21)
alternative label: Kasviaiheet, maalaustaiteen tekniikka (74.21)
alternative label: Kollaasit, maalaustaiteen tekniikka (74.21)
alternative label: Kollaasitaide (74.21)
alternative label: Kollage, målarkonstens teknik (74.21) @sv
alternative label: Konservering, målarkonst (74.21) @sv
alternative label: Konservointi, maalaustaide (74.21)
alternative label: Kukkamaalaukset, maalaustaiteen tekniikka (74.21)
alternative label: Landskap, målarkonstens teknik (74.21) @sv
alternative label: Maalaustaide, materiaalit ja tekniikka (74.21)
alternative label: Maisemat, maalaustaiteen tekniikka (74.21)
alternative label: Miniatyrmålningar, målarkonstens teknik (74.21) @sv
alternative label: Miniatyyrimaalaukset, maalaustaiteen tekniikka (74.21)
alternative label: Muotokuvat, maalaustaiteen tekniikka (74.21)
alternative label: Målarkonst, material och teknik (74.21) @sv
alternative label: Nakenmodell, målarkonstens teknik (74.21) @sv
alternative label: Oljefärger, handböcker (74.21) @sv
alternative label: Oljemålningar, målarkonstens teknik (74.21) @sv
alternative label: Paperilaadut, maalaustaiteen tekniikka (74.21)
alternative label: Papperssorter, målarkonstens teknik (74.21) @sv
alternative label: Pastellimaalaukset, maalaustaiteen tekniikka (74.21)
alternative label: Pastellmålningar, målarkonstens teknik (74.21) @sv
alternative label: Perspektiivioppi, maalaustaiteen tekniikka (74.21)
alternative label: Perspektivlära, målarkonstens teknik (74.21) @sv
alternative label: Porträtt, målarkonstens teknik (74.21) @sv
alternative label: Projektio-oppi, maalaustaiteen tekniikka (74.21)
alternative label: Projektionslära, målarkonstens teknik (74.21) @sv
alternative label: Restaurering, målarkonst (74.21) @sv
alternative label: Restaurointi, maalaustaide (74.21)
alternative label: Ruiskumaalaus, maalaustaiteen tekniikka (74.21)
alternative label: Seinämaalaukset, maalaustaiteen tekniikka (74.21)
alternative label: Sprutmålning, målarkonstens teknik (74.21) @sv
alternative label: Stilleben, målarkonstens teknik (74.21) @sv
alternative label: Temperamaalaukset, maalaustaiteen tekniikka (74.21)
alternative label: Temperamålningar, målarkonstens teknik (74.21) @sv
alternative label: Vattenfärgsmålningar, målarkonstens teknik (74.21) @sv
alternative label: Vesivärimaalaukset, maalaustaiteen tekniikka (74.21)
alternative label: Vesivärioppaat (74.21)
alternative label: Väggmålningar, målarkonstens teknik (74.21) @sv
alternative label: Väriruiskutekniikka, maalaustaiteen tekniikka (74.21)
alternative label: Värit, maalaustaiteen tekniikka (74.21)
alternative label: Växtmotiv, målarkonstens teknik (74.21) @sv
alternative label: Öljyvärimaalaukset, maalaustaiteen tekniikka (74.21)
alternative label: Öljyvärioppaat (74.21)
broader: Maalaustaide
in scheme: YKL - Yleisten kirjastojen luokitusjärjestelmä
notation: 74.21
scope note: Hit praktiska handböcker om t.ex. akvarell-, olje-, akryl-, gouache-, pastell-, fresko-, kollage-, ikon- och miniatyrmåleriets teknik Hit också konservering och restaurering av målningar Om verket behandlar både målar- och teckningskonstens teknik, ges företräde åt klass 74.21 Formtillägget 09 används inte i samband med klasserna 70-77.4985 @sv
scope note: Tähän esim. akvarelli-, öljy-, akryyli-, guassi-, pastelli-, fresko-, kollaasi-, ikoni- ja miniatyyrimaalauksen tekniikkaa koskevat käytännön oppaat Tähän myös maalausten konservointi ja entisöinti Jos teos koskee sekä maalaus- että piirustustaiteen tekniikkaa, annetaan etusija luokalle 74.21 Muotoluokkaa 09 ei käytetä luokkien 70-77.4985 yhteydessä

Aiheet piirustus- ja maalaustaiteessa
type: Concept
References: Piirustuksen tekniikka
References: Maalaustaiteen materiaalit ja tekniikka
References: Piirustus- ja maalaustaiteen historia
type: YKL-luokka
alternative label: Alastonmalli, maalaustaiteen historia (74.3)
alternative label: Alastonmalli, piirustustaiteen historia (74.3)
alternative label: Altartavlor, målarkonstens historia (74.3) @sv
alternative label: Alttaritaulut, maalaustaiteen historia (74.3)
alternative label: Asetelmat, maalaustaiteen historia (74.3)
alternative label: Asetelmat, piirustustaiteen historia (74.3)
alternative label: Blomstermålningar, målarkonstens historia (74.3) @sv
alternative label: Djurmotiv, målarkonstens historia (74.3) @sv
alternative label: Djurmotiv, teckningskonstens historia (74.3) @sv
alternative label: Eläinaiheet, maalaustaiteen historia (74.3)
alternative label: Eläinaiheet, piirustustaiteen historia (74.3)
alternative label: Ikoner, målarkonstens historia (74.3) @sv
alternative label: Ikonit, maalaustaiteen historia (74.3)
alternative label: Kasviaiheet, maalaustaiteen historia (74.3)
alternative label: Kasviaiheet, piirustustaiteen historia (74.3)
alternative label: Kukkamaalaukset, maalaustaiteen historia (74.3)
alternative label: Landskap, målarkonstens historia (74.3) @sv
alternative label: Landskap, teckningskonstens historia (74.3) @sv
alternative label: Maalaustaide, aihepiirit (74.3)
alternative label: Maisemat, maalaustaiteen historia (74.3)
alternative label: Maisemat, piirustustaiteen historia (74.3)
alternative label: Muotokuvat, maalaustaiteen historia (74.3)
alternative label: Muotokuvat, piirustustaiteen historia (74.3)
alternative label: Målarkonst, motivkretsar (74.3) @sv
alternative label: Nakenmodell, målarkonstens historia (74.3) @sv
alternative label: Nakenmodell, teckningskonstens historia (74.3) @sv
alternative label: Piirustus, piirustustaide, aihepiirit (74.3)
alternative label: Piirustustaide, aihepiirit (74.3)
alternative label: Porträtt, målarkonstens historia (74.3) @sv
alternative label: Porträtt, teckningskonstens historia (74.3) @sv
alternative label: Stilleben, målarkonstens historia (74.3) @sv
alternative label: Stilleben, teckningskonstens historia (74.3) @sv
alternative label: Teckning, teckningskonst, motivkretsar (74.3) @sv
alternative label: Teckningskonst, motivkretsar (74.3) @sv
alternative label: Växtmotiv, målarkonstens historia (74.3) @sv
alternative label: Växtmotiv, teckningskonstens historia (74.3) @sv
broader: MAALAUSTAIDE. PIIRUSTUSTAIDE
in scheme: YKL - Yleisten kirjastojen luokitusjärjestelmä
notation: 74.3
preferred label: Motifs in drawing and painting @en
preferred label: Tecknings- och målarkonstens motiv @sv
scope note: Hit oavsett land eller tidsperiod olika motivkretsar i tecknings- och målarkonsten och deras historia Stilleben. Porträtt. Landskap. Djur- och blomstermotiv Hit också ikoner och deras historia Om verket behandlar både ett enskilt motiv i tecknings- och målarkonsten och tecknings- och målarkonstens teknik, ges företräde åt klasserna 74.11 och 74.21 Hit också verk som rör motivkretsar och där målarkonsten tydligt dominerar, även om delar av verket innehåller t.ex. teckningskonst, skulptur eller fotokonst Verk om enskilda konstnärer eller deras produktion förs dock alltid till klass 74.9+ Formtillägget 09 används inte i samband med klasserna 70-77.4985 @sv
scope note: Tähän maasta tai aikakaudesta riippumatta eri aihepiireihin liittyvä piirustus- ja maalaustaide ja sen historia Asetelmat. Muotokuvat. Maisemat. Eläin- ja kasviaiheet Tähän myös ikonit ja niiden historia Jos teoksessa on sekä tiettyyn aihepiiriin liittyvää piirustus- tai maalaustaidetta että piirustus- tai maalaustaiteen tekniikkaa, annetaan etusija luokille 74.11 ja 74.21 Tähän myös aihepiirejä koskevat teokset, jotka selvästi painottuvat piirustus- ja maalaustaiteeseen, vaikka niissä olisikin osa esim. kuvanveisto- tai valokuvataidetta. Yksittäistä taiteilijaa tai hänen tuotantoaan koskevat teokset sijoitetaan kuitenkin aina luokkaan 74.9+ Muotoluokkaa 09 ei käytetä luokkien 70-77.4985 yhteydessä

Piirustus- ja maalaustaiteen historia
type: Concept
References: Tekstaus. Kalligrafia
References: Pilapiirrokset. Karikatyyrit
References: Aiheet piirustus- ja maalaustaiteessa
References: Lasitaide. Keramiikkataide
type: YKL-luokka
alternative label: Akrylmålning, målarkonstens historia (74.9+) @sv
alternative label: Akryylimaalaus, maalaustaiteen historia (74.9+)
alternative label: Akvareller, målarkonstens histroria (74.9+) @sv
alternative label: Akvarellit, maalaustaiteen historia (74.9+)
alternative label: Arabialainen maalaustaide (74.9+)
alternative label: Arabisk målarkonst (74.9+) @sv
alternative label: Bergkonst (74.9+) @sv
alternative label: Collage (74.9) @sv
alternative label: Fresker, målarkonstens historia (74.9+) @sv
alternative label: Freskot, maalaustaiteen historia (74.9+)
alternative label: Gouache, målarkonstens historia (74.9+) @sv
alternative label: Grottmålningar (74.9+) @sv
alternative label: Guassit, maalaustaiteen historia (74.9+)
alternative label: Islam, maalaustaide (74.9+)
alternative label: Islam, målarkonst (74.9+) @sv
alternative label: Kalliotaide (74.9+)
alternative label: Kollaasit, maalaustaiteen historia (74.9+)
alternative label: Kollaasitaide (74.9)
alternative label: Kollage, målarkonstens historia (74.9+) @sv
alternative label: Konstnärer (74.9+) @sv
alternative label: Luolamaalaukset (74.9+)
alternative label: Maalaustaide, historia (74.9+)
alternative label: Miniatyrmålningar, målarkonstens historia (74.9+) @sv
alternative label: Miniatyyrimaalaukset, maalaustaiteen historia (74.9+)
alternative label: Målarkonst, historia (74.9+) @sv
alternative label: Oljemålningar, målarkonstens historia (74.9+) @sv
alternative label: Pastellimaalaukset, maalaustaiteen historia (74.9+)
alternative label: Pastellmålningar, målarkonstens historia (74.9+) @sv
alternative label: Piirtäjät, piirustus- ja maalaustaide (74.9+)
alternative label: Piirustus, historia (74.9+)
alternative label: Piirustus, piirustustaide, historia (74.9+)
alternative label: Piirustustaide, historia (74.9+)
alternative label: Pilapiirtäjät, piirustus- ja maalaustaide (74.9+)
alternative label: Sarjakuvataiteilijat, piirustus- ja maalaustaide (74.9+)
alternative label: Seinämaalaukset, maalaustaiteen historia (74.9+)
alternative label: Serieskapare, tecknings- och målarkonst (74.9+) @sv
alternative label: Skämttecknare, tecknings- och målarkonst (74.9+) @sv
alternative label: Taidemaalarit, elämäkerrat ja muistelmat (74.9+)
alternative label: Tecknare, tecknings- och målarkonst (74.9+) @sv
alternative label: Teckning, historia (74.9+) @sv
alternative label: Teckning, teckningskonst, historia (74.9+) @sv
alternative label: Teckningskonst, historia (74.9+) @sv
alternative label: Temperamaalaukset, maalaustaiteen historia (74.9+)
alternative label: Temperamålningar, målarkonstens historia (74.9+) @sv
alternative label: Vattenfärgsmålningar, målarkonstens historia (74.9+) @sv
alternative label: Vesivärimaalaukset, maalaustaiteen historia (74.9+)
alternative label: Väggmålningar, målarkonstens historia (74.9+) @sv
alternative label: Öljyvärimaalaukset, maalaustaiteen historia (74.9+)
broader: MAALAUSTAIDE. PIIRUSTUSTAIDE
in scheme: YKL - Yleisten kirjastojen luokitusjärjestelmä
narrower: Euroopan piirustus- ja maalaustaide
narrower: Piirustus- ja maalaustaiteen historia, Suomi
narrower: Piirustus- ja maalaustaiteen historia, Pohjoismaat
narrower: Piirustus- ja maalaustaiteen historia, Keski-Eurooppa
narrower: Piirustus- ja maalaustaiteen historia, Iso-Britannia. Irlanti
narrower: Piirustus- ja maalaustaiteen historia, Etelä-Eurooppa
narrower: Piirustus- ja maalaustaiteen historia, Itä-Eurooppa
narrower: Piirustus- ja maalaustaiteen historia, Aasia
narrower: Piirustus- ja maalaustaiteen historia, Afrikka
narrower: Piirustus- ja maalaustaiteen historia, Amerikka
narrower: Piirustus- ja maalaustaiteen historia, Australia ja Oseania
notation: 74.9
preferred label: History of drawing and painting @en
preferred label: Tecknings- och målarkonstens historia @sv
scope note: Hit allmänna verk om tecknings- och målarkonstens historia Hit och till underklasserna också verk som behandlar tecknings- och målarkonst eller dess historia i olika världsdelar eller länder samt verk som behandlar enskilda konstnärer eller deras produktion Konstnärens land bestäms enligt det land där han eller hon haft sin huvudsakliga konstnärsbana Formtillägget 09 används inte i samband med klasserna 70-77.4985 @sv
scope note: Tähän piirustus- ja maalaustaiteen historian yleisteokset Tähän ja alaluokkiin myös teokset, jotka koskevat eri maanosien tai maiden piirustus- ja maalaustaidetta tai niiden historiaa sekä teokset, jotka koskevat yksittäisiä taiteilijoita tai heidän tuotantoaan Taiteilijan maa määräytyy sen mukaan, missä hän on tehnyt keskeisen uransa Muotoluokkaa 09 ei käytetä luokkien 70-77.4985 yhteydessä

Euroopan piirustus- ja maalaustaide
type: Concept
type: YKL-luokka
alternative label: Länsimainen maalaustaide (74.91+)
alternative label: Västerländsk målarkonst (74.91+) @sv
broader: Piirustus- ja maalaustaiteen historia
in scheme: YKL - Yleisten kirjastojen luokitusjärjestelmä
narrower: Esihistoriallisen ja vanhan ajan piirustus- ja maalaustaide
narrower: Keskiajan piirustus- ja maalaustaide
narrower: Uuden ajan piirustus- ja maalaustaide
notation: 74.91
preferred label: European drawing and painting @en
preferred label: Europeisk tecknings- och målarkonst @sv
scope note: Hit och till underklasserna också den europeiska och västerländska tecknings- och målarkonstens allmänna stilhistoria Om verket passar både i klassen för tidsperiod och klassen för land ges företräde åt klassen för land Verk om övriga världsdelars tecknings- och målarkonst under olika perioder förs till klassen för tecknings- och målarkonstens historia i den berörda världsdelen Formtillägget 09 används inte i samband med klasserna 70-77.4985 @sv
scope note: Tähän ja alaluokkiin myös Euroopan ja länsimaiden piirustus- ja maalaustaiteen yleinen tyylihistoria Jos teos sopii sekä aikakausittaiseen että maittaiseen luokkaan, annetaan etusija maan mukaiselle luokalle Muiden maanosien eri aikakausien piirustus- ja maalaus- taidetta koskevat teokset luokitetaan ko. maanosan luokkaan Muotoluokkaa 09 ei käytetä luokkien 70-77.4985 yhteydessä

Esihistoriallisen ja vanhan ajan piirustus- ja maalaustaide
type: Concept
References: Piirustus- ja maalaustaiteen historia, Aasia
References: Piirustus- ja maalaustaiteen historia, Afrikka
type: YKL-luokka
alternative label: Antiikki, maalaustaide (74.911)
alternative label: Antiken, målarkonst (74.911) @sv
alternative label: Berginristningar, förhistorisk tid (74.911) @sv
alternative label: Bergkonst, förhistorisk tid, Europa (74.911) @sv
alternative label: Bergmålningar, förhistorisk tid (74.911) @sv
alternative label: Esihistoria, maalaustaide (74.911)
alternative label: Etrusker, målarkonst (74.911) @sv
alternative label: Etruskit, maalaustaide (74.911)
alternative label: Förhistoria, målarkonst (74.911) @sv
alternative label: Gamla tiden, målarkonst (74.911) @sv
alternative label: Grekland, antikens målarkonst (74.911) @sv
alternative label: Grottmålningar, förhistorisk tid, Europa (74.911) @sv
alternative label: Kalliomaalaukset, esihistoriallinen aika (74.911)
alternative label: Kalliopiirrokset, esihistoriallinen aika (74.911)
alternative label: Kalliotaide, esihistoriallinen aika, Euroopa (74.911)
alternative label: Kreikka, antiikin maalaustaide (74.911)
alternative label: Luolamaalaukset, esihistoriallinen aika, Eurooppa (74.911)
alternative label: Romerska riket, målarkonst (74.911) @sv
alternative label: Rooman valtakunta, maalaustaide (74.911)
alternative label: Vanha aika, maalaustaide (74.911)
broader: Euroopan piirustus- ja maalaustaide
in scheme: YKL - Yleisten kirjastojen luokitusjärjestelmä
notation: 74.911
preferred label: Drawing and painting of prehistoric times and antiquity @en
preferred label: Tecknings- och målarkonst under förhistorisk tid och gamla tiden @sv
scope note: Hit allmänna verk om europeisk tecknings- och målarkonst under förhistorisk tid och under gamla tiden Förhistoriska grottmålningar. Förhistorisk bergkonst Antikens tecknings- och målarkonst Formtillägget 09 används inte i samband med klasserna 70-77.4985 @sv
scope note: Tähän Euroopan esihistoriallisen ja vanhan ajan piirustus- ja maalaustaiteen yleisteokset Esihistorialliset luolamaalaukset. Esihistorillinen kalliotaide Antiikin piirustus- ja maalaustaide Muotoluokkaa 09 ei käytetä luokkien 70-77.4985 yhteydessä

Keskiajan piirustus- ja maalaustaide
type: Concept
type: YKL-luokka
alternative label: Bysans, målarkonst (74.912) @sv
alternative label: Bysantti, maalaustaide (74.912)
alternative label: Gotiikka, maalaustaide (74.912)
alternative label: Gotik, målarkonst (74.912) @sv
alternative label: Keskiaika, maalaustaide (74.912)
alternative label: Medeltiden, målarkonst (74.912) @sv
alternative label: Romaaninen maalaustaide (74.912)
alternative label: Romansk målarkonst (74.912) @sv
broader: Euroopan piirustus- ja maalaustaide
in scheme: YKL - Yleisten kirjastojen luokitusjärjestelmä
notation: 74.912
preferred label: Medeltidens tecknings- och målarkonst @sv
preferred label: Medieval drawing and painting @en
scope note: Hit allmänna verk om medeltida europeisk tecknings- och målarkonst Romansk och gotisk tecknings- och målarkonst Hit också bysantinsk tecknings- och målarkonst Formtillägget 09 används inte i samband med klasserna 70-77.4985 @sv
scope note: Tähän Euroopan keskiajan piirustus- ja maalaustaiteen yleisteokset Romaaninen ja goottilainen piirustus- ja maalaustaide Tähän myös Bysantin piirustus- ja maalaustaide Muotoluokkaa 09 ei käytetä luokkien 70-77.4985 yhteydessä

Uuden ajan piirustus- ja maalaustaide
type: Concept
type: YKL-luokka
alternative label: Nya tiden, målarkonst (74.913+) @sv
alternative label: Uusi aika, maalaustaide (74.913+)
broader: Euroopan piirustus- ja maalaustaide
in scheme: YKL - Yleisten kirjastojen luokitusjärjestelmä
narrower: Renessanssin piirustus- ja maalaustaide
narrower: Barokin ja rokokoon piirustus- ja maalaustaide
narrower: 1800-luvun ja vuosisadan vaihteen piirustus- ja maalaustaide
narrower: Nykyajan piirustus- ja maalaustaide
notation: 74.913
preferred label: Drawing and painting of the modern era @en
preferred label: Nya tidens tecknings- och målarkonst @sv
scope note: Hit och till underklasserna allmänna verk om europeisk och västerländsk tecknings- och målarkonst under nya tiden Formtillägget 09 används inte i samband med klasserna 70-77.4985 @sv
scope note: Tähän ja alaluokkiin Euroopan ja länsimaiden uuden ajan piirustus- ja maalaustaiteen yleisteokset Muotoluokkaa 09 ei käytetä luokkien 70-77.4985 yhteydessä

Renessanssin piirustus- ja maalaustaide
type: Concept
type: YKL-luokka
alternative label: Manierism, målarkonst (74.9131) @sv
alternative label: Manierismi, maalaustaide (74.9131)
alternative label: Renessanssi, maalaustaide (74.9131)
alternative label: Renässans, målarkonst (74.9131) @sv
broader: Uuden ajan piirustus- ja maalaustaide
in scheme: YKL - Yleisten kirjastojen luokitusjärjestelmä
notation: 74.9131
preferred label: Renaissance drawing and painting @en
preferred label: Renässansens tecknings- och målarkonst @sv
scope note: Formtillägget 09 används inte i samband med klasserna 70-77.4985 @sv
scope note: Muotoluokkaa 09 ei käytetä luokkien 70-77.4985 yhteydessä

Barokin ja rokokoon piirustus- ja maalaustaide
type: Concept
type: YKL-luokka
alternative label: Barock, målarkonst (74.9132) @sv
alternative label: Barokki, maalaustaide (74.9132)
alternative label: Rokoko, målarkonst (74.9132) @sv
alternative label: Rokokoo, maalaustaide (74.9132)
broader: Uuden ajan piirustus- ja maalaustaide
in scheme: YKL - Yleisten kirjastojen luokitusjärjestelmä
notation: 74.9132
preferred label: Barockens och rokokons tecknings- och målarkonst @sv
preferred label: Baroque and rococo drawing and painting @en
scope note: Formtillägget 09 används inte i samband med klasserna 70-77.4985 @sv
scope note: Muotoluokkaa 09 ei käytetä luokkien 70-77.4985 yhteydessä

1800-luvun ja vuosisadan vaihteen piirustus- ja maalaustaide
type: Concept
type: YKL-luokka
alternative label: Art nouveau, maalaustaide (74.9133)
alternative label: Art nouveau, målarkonst (74.9133) @sv
alternative label: Imitationsstilar, målarkonst (74.9133) @sv
alternative label: Impressionism, målarkonst (74.9133) @sv
alternative label: Impressionismi, maalaustaide (74.9133)
alternative label: Jugend, maalaustaide (74.9133)
alternative label: Jugend, målarkonst (74.9133) @sv
alternative label: Kansallisromantiikka, maalaustaide (74.9133)
alternative label: Kertaustyylit, maalaustaide (74.9133)
alternative label: L'art nouveau, maalaustaide (74.9133)
alternative label: L'art nouveau, målarkonst (74.9133) @sv
alternative label: Nationalromantik, målarkonst (74.9133) @sv
alternative label: Naturalism, målarkonst (74.9133) @sv
alternative label: Naturalismi, maalaustaide (74.9133)
alternative label: Nyklassicism, målarkonst (74.9133) @sv
alternative label: Realism, målarkonst, 1800-talet (74.9133) @sv
alternative label: Realismi, maalaustaide, 1800-luku (74.9133)
alternative label: Romantiikka, maalaustaide (74.9133)
alternative label: Romantik, målarkonst (74.9133) @sv
alternative label: Symbolism, målarkonst (74.9133) @sv
alternative label: Symbolismi, maalaustaide (74.9133)
alternative label: Uusklassismi, maalaustaide (74.9133)
broader: Uuden ajan piirustus- ja maalaustaide
in scheme: YKL - Yleisten kirjastojen luokitusjärjestelmä
notation: 74.9133
preferred label: 1800-talets tecknings- och målarkonst @sv
preferred label: Drawing and painting of the 19th century and the turn of the century @en
scope note: Hit allmänna verk om romantikens, nationalromantikens, symbolismens, impressionismens och jugendstilens tecknings- och målarkonst i Europa och västerlandet Hit också imitationsstilarnas, t.ex. nyklassicismens, tecknings- och målarkonst Formtillägget 09 används inte i samband med klasserna 70-77.4985 @sv
scope note: Tähän Euroopan ja länsimaiden romantiikan, kansallisromantiikan, symbolismin, jugendin tai impressionismin piirustus- ja maalaustaidetta koskevat yleisteokset Tähän myös Euroopan ja länsimaiden kertaustyylien, esim. uusklassismin, piirustus-ja maalaustaide Muotoluokkaa 09 ei käytetä luokkien 70-77.4985 yhteydessä

Nykyajan piirustus- ja maalaustaide
type: Concept
type: YKL-luokka
alternative label: Abstrakt konst, målarkonst, allm. (74.9134) @sv
alternative label: Abstrakti taide, maalaustaide, yl. (74.9134)
alternative label: Dadaism, målarkonst (74.9134) @sv
alternative label: Dadaismi, maalaustaide (74.9134)
alternative label: Ekspressionismi, maalaustaide (74.9134)
alternative label: Expressionism, målarkonst (74.9134) @sv
alternative label: Fauvism, målarkonst (74.9134) @sv
alternative label: Fauvismi, maalaustaide (74.9134)
alternative label: Fotorealism, målarkonst (74.9134) @sv
alternative label: Fotorealismi, maalaustaide (74.9134)
alternative label: Futurism, målarkonst (74.9134) @sv
alternative label: Futurismi, maalaustaide (74.9134)
alternative label: Jälki-impressionismi, maalaustaide (74.9134)
alternative label: Konkreettinen taide, maalaustaide (74.9134)
alternative label: Konkret konst, målarkonst (74.9134) @sv
alternative label: Konstruktivism, målarkonst (74.9134) @sv
alternative label: Konstruktivismi, maalaustaide (74.9134)
alternative label: Kubism, målarkonst (74.9134) @sv
alternative label: Kubismi, maalaustaide (74.9134)
alternative label: Minimalism, målarkonst (74.9134) @sv
alternative label: Minimalismi, maalaustaide (74.9134)
alternative label: Modernism, målarkonst (74.9134) @sv
alternative label: Modernismi, maalaustaide (74.9134)
alternative label: Naivism, målarkonst (74.9134) @sv
alternative label: Naivismi, maalaustaide (74.9134)
alternative label: Nonfiguratiivinen taide, maalaustaide (74.9134)
alternative label: Nonfigurativ konst, målarkonst (74.9134) @sv
alternative label: Nutiden, målarkonst (74.9134) @sv
alternative label: Nykyaika, maalaustaide (74.9134)
alternative label: Optinen taide, maalaustaide (74.9134)
alternative label: Optisk konst, målarkonst (74.9134) @sv
alternative label: Pointillism, målarkonst (74.9134) @sv
alternative label: Pointillismi, maalaustaide (74.9134)
alternative label: Popkonst, målarkonst (74.9134) @sv
alternative label: Poptaide, maalaustaide (74.9134)
alternative label: Postimpressionism, målarkonst (74.9134) @sv
alternative label: Postmodernism, målarkonst (74.9134) @sv
alternative label: Postmodernismi, maalaustaide (74.9134)
alternative label: Psykedeelinen taide, maalaustaide (74.9134)
alternative label: Psykedelisk konst, målarkonst (74.9134) @sv
alternative label: Realism, målarkonst, 1900-talet (74.9134) @sv
alternative label: Realismi, maalaustaide, 1900-luku (74.9134)
alternative label: Socialistisk realism, målarkonst (74.9134) @sv
alternative label: Sosialistinen realismi, maalaustaide (74.9134)
alternative label: Surrealism, målarkonst (74.9134) @sv
alternative label: Surrealismi, maalaustaide (74.9134)
alternative label: Underground, målarkonst (74.9134) @sv
alternative label: Underground-taide, maalaustaide (74.9134)
broader: Uuden ajan piirustus- ja maalaustaide
in scheme: YKL - Yleisten kirjastojen luokitusjärjestelmä
notation: 74.9134
preferred label: Contemporary drawing and painting @en
preferred label: Nutidens tecknings- och målarkonst @sv
scope note: Hit allmänna verk om europeisk och västerländsk tecknings- och målarkonst från och med expressionismen och kubismen Hit också allmänna verk om europeisk och västerländsk tecknings och målarkonst under 1900-talet Modernism och postmodernism i tecknings- och målarkonsten Formtillägget 09 används inte i samband med klasserna 70-77.4985 @sv
scope note: Tähän Euroopan ja länsimaiden nykyajan piirustus- ja maalaustaiteen yleisteokset ekspressionismista ja kubismista alkaen Tähän myös Euroopan ja länsimaiden 1900- ja 2000-luvun piirustus- ja maalaustaiteen yleisteokset Modernismi ja postmodernismi piirustus- ja maalaustaiteessa Muotoluokkaa 09 ei käytetä luokkien 70-77.4985 yhteydessä

Piirustus- ja maalaustaiteen historia, Suomi
type: Concept
type: YKL-luokka
alternative label: Maalaustaide, historia, Suomi (74.92)
alternative label: Målarkonst, historia, Finland (74.92) @sv
broader: Piirustus- ja maalaustaiteen historia
in scheme: YKL - Yleisten kirjastojen luokitusjärjestelmä
notation: 74.92
preferred label: History of drawing and painting, Finland @en
preferred label: Tecknings- och målarkonstens historia, Finland @sv

Piirustus- ja maalaustaiteen historia, Pohjoismaat
type: Concept
type: YKL-luokka
broader: Piirustus- ja maalaustaiteen historia
in scheme: YKL - Yleisten kirjastojen luokitusjärjestelmä
notation: 74.93
preferred label: History of drawing and painting, Nordic countries @en
preferred label: Tecknings- och målarkonstens historia, Norden @sv
scope note: Danmark. Island. Norge. Sverige Hit också Färöarna och Grönland Hit också verk som behandlar flera nordiska länder, även Finland @sv
scope note: Islanti. Norja. Ruotsi. Tanska Tähän myös Fär-saaret ja Grönlanti Tähän myös teokset, jotka koskevat useampia Pohjoismaita, myös Suomea

Piirustus- ja maalaustaiteen historia, Keski-Eurooppa
type: Concept
type: YKL-luokka
broader: Piirustus- ja maalaustaiteen historia
in scheme: YKL - Yleisten kirjastojen luokitusjärjestelmä
narrower: Piirustus- ja maalaustaiteen historia, Saksa
narrower: Piirustus- ja maalaustaiteen historia, Alankomaat. Belgia
notation: 74.94
preferred label: History of drawing and painting, Central Europe @en
preferred label: Tecknings- och målarkonstens historia, Mellaneuropa @sv
scope note: Belgia. Itävalta. Liechtenstein. Luxemburg. Slovakia. Sveitsi Tsekki. Unkari
scope note: Belgien. Liechtenstein. Luxemburg. Schweiz. Slovakien. Tjeckien. Ungern. Österrike @sv

Piirustus- ja maalaustaiteen historia, Saksa
type: Concept
type: YKL-luokka
broader: Piirustus- ja maalaustaiteen historia, Keski-Eurooppa
in scheme: YKL - Yleisten kirjastojen luokitusjärjestelmä
notation: 74.941
preferred label: History of drawing and painting, Germany @en
preferred label: Tecknings- och målarkonstens historia, Tyskland @sv

Piirustus- ja maalaustaiteen historia, Alankomaat. Belgia
type: Concept
type: YKL-luokka
broader: Piirustus- ja maalaustaiteen historia, Keski-Eurooppa
in scheme: YKL - Yleisten kirjastojen luokitusjärjestelmä
notation: 74.948
preferred label: History of drawing and painting, Netherlands. Belgium @en
preferred label: Tecknings- och målarkonstens historia, Nederländerna. Belgien @sv

Piirustus- ja maalaustaiteen historia, Iso-Britannia. Irlanti
type: Concept
type: YKL-luokka
broader: Piirustus- ja maalaustaiteen historia
in scheme: YKL - Yleisten kirjastojen luokitusjärjestelmä
notation: 74.95
preferred label: History of drawing and painting, Great Britain. Ireland @en
preferred label: Tecknings- och målarkonstens historia, Storbritannien. Irland @sv

Piirustus- ja maalaustaiteen historia, Etelä-Eurooppa
type: Concept
type: YKL-luokka
alternative label: Grekland, modern målarkonst (74.96) @sv
alternative label: Kreikka, nykyajan maalaustaide (74.96)
broader: Piirustus- ja maalaustaiteen historia
in scheme: YKL - Yleisten kirjastojen luokitusjärjestelmä
narrower: Piirustus- ja maalaustaiteen historia, Ranska
narrower: Piirustus- ja maalaustaiteen historia, Italia
narrower: Piirustus- ja maalaustaiteen historia, Espanja
notation: 74.96
preferred label: History of drawing and painting, Etelä-Eurooppa @en
preferred label: Tecknings- och målarkonstens historia, Sydeuropa @sv
scope note: Albania. Bosnia ja Hertsegovina. Bulgaria. Kreikka. Kroatia. Makedonia. Malta. Portugali. Romania. Serbia ja Montenegro. Slovenia
scope note: Albanien. Bosnien-Hercegovina. Bulgarien. Grekland. Kroatien. Makedonien. Malta. Portugal. Rumänien. Serbien och Montenegro. Slovenien @sv

Piirustus- ja maalaustaiteen historia, Ranska
type: Concept
type: YKL-luokka
broader: Piirustus- ja maalaustaiteen historia, Etelä-Eurooppa
in scheme: YKL - Yleisten kirjastojen luokitusjärjestelmä
notation: 74.961
preferred label: History of drawing and painting, France @en
preferred label: Tecknings- och målarkonstens historia, Frankrike @sv
scope note: Hit också Monaco @sv
scope note: Tähän myös Monaco

Piirustus- ja maalaustaiteen historia, Italia
type: Concept
type: YKL-luokka
broader: Piirustus- ja maalaustaiteen historia, Etelä-Eurooppa
in scheme: YKL - Yleisten kirjastojen luokitusjärjestelmä
notation: 74.962
preferred label: History of drawing and painting, Italy @en
preferred label: Tecknings- och målarkonstens historia, Italien @sv
scope note: Hit också San Marino och Vatikanstaten @sv
scope note: Tähän myös San Marino ja Vatikaanivaltio

Piirustus- ja maalaustaiteen historia, Espanja
type: Concept
type: YKL-luokka
broader: Piirustus- ja maalaustaiteen historia, Etelä-Eurooppa
in scheme: YKL - Yleisten kirjastojen luokitusjärjestelmä
notation: 74.963
preferred label: History of drawing and painting, Spain @en
preferred label: Tecknings- och målarkonstens historia, Spanien @sv
scope note: Hit också Andorra @sv
scope note: Tähän myös Andorra

Piirustus- ja maalaustaiteen historia, Itä-Eurooppa
type: Concept
type: YKL-luokka
broader: Piirustus- ja maalaustaiteen historia
in scheme: YKL - Yleisten kirjastojen luokitusjärjestelmä
narrower: Piirustus- ja maalaustaiteen historia, Venäjä. Ukraina. Valko-Venäjä. Moldova
notation: 74.97
preferred label: History of drawing and painting, Eastern Europe @en
preferred label: Tecknings- och målarkonstens historia, Östeuropa @sv
scope note: Estland. Lettland. Litauen. Polen @sv
scope note: Latvia. Liettua. Puola. Viro

Piirustus- ja maalaustaiteen historia, Venäjä. Ukraina. Valko-Venäjä. Moldova
type: Concept
type: YKL-luokka
broader: Piirustus- ja maalaustaiteen historia, Itä-Eurooppa
in scheme: YKL - Yleisten kirjastojen luokitusjärjestelmä
notation: 74.971
preferred label: History of drawing and painting, Russia. Ukraine. Belarus. Moldova @en
preferred label: Tecknings- och målarkonstens historia, Ryssland. Ukraina. Vitryssland. Moldova @sv

Piirustus- ja maalaustaiteen historia, Aasia
type: Concept
type: YKL-luokka
broader: Piirustus- ja maalaustaiteen historia
in scheme: YKL - Yleisten kirjastojen luokitusjärjestelmä
notation: 74.981
preferred label: History of drawing and painting, Asien @en
preferred label: Tecknings- och målarkonstens historia, Asia @sv
scope note: Hit också österländsk tecknings- och målarkonst @sv
scope note: Tähän myös itämainen piirustus- ja maalaustaide

Piirustus- ja maalaustaiteen historia, Afrikka
type: Concept
type: YKL-luokka
broader: Piirustus- ja maalaustaiteen historia
in scheme: YKL - Yleisten kirjastojen luokitusjärjestelmä
notation: 74.982
preferred label: History of drawing and painting, Africa @en
preferred label: Tecknings- och målarkonstens historia, Afrika @sv
scope note: Hit också det forntida Egyptens tecknings- och målarkonst @sv
scope note: Tähän myös Egyptin muinaisajan piirustus- ja maalaustaide

Piirustus- ja maalaustaiteen historia, Amerikka
type: Concept
type: YKL-luokka
alternative label: Atsteekit, maalaustaide (74.983)
alternative label: Azteker, målarkonst (74.983) @sv
alternative label: Mayafolket, målarkonst (74.983) @sv
alternative label: Mayat, maalaustaide (74.983)
broader: Piirustus- ja maalaustaiteen historia
in scheme: YKL - Yleisten kirjastojen luokitusjärjestelmä
notation: 74.983
preferred label: History of drawing and painting, America @en
preferred label: Tecknings- och målarkonstens historia, Amerika @sv

Piirustus- ja maalaustaiteen historia, Australia ja Oseania
type: Concept
type: YKL-luokka
broader: Piirustus- ja maalaustaiteen historia
in scheme: YKL - Yleisten kirjastojen luokitusjärjestelmä
notation: 74.985
preferred label: History of drawing and painting, Australia and Oceania @en
preferred label: Tecknings- och målarkonstens historia, Australien. Oceanien @sv

GRAFIIKKA. VALOKUVAUS
type: Concept
type: YKL-luokka
alternative label: Konst (70 ... 78+) @sv
alternative label: Konst, olika konstformer (70 ... 78+) @sv
alternative label: Konstformer (70 ... 78+) @sv
alternative label: Taide, eri taidemuodot (70 ... 78+)
alternative label: Taidemuodot (70 ... 78+)
alternative label: Taiteet (70 ... 78+)
broader: TAITEET. LIIKUNTA
in scheme: YKL - Yleisten kirjastojen luokitusjärjestelmä
narrower: Grafiikka
narrower: Valokuvaus. Valokuvataide
notation: 75
preferred label: GRAFIK. FOTOGRAFI @sv
preferred label: GRAPHIC ART. PHOTOGRAPHY @en
scope note: Hit allmänna verk som behandlar både grafik och fotografi Formtillägget 09 används inte i samband med klasserna 70-77.4985 @sv
scope note: Tähän yleisteokset, jotka koskevat sekä grafiikkaa että valokuvausta Muotoluokkaa 09 ei käytetä luokkien 70-77.4985 yhteydessä

Grafiikka
type: Concept
References: Kirjapainotaito. Graafinen teollisuus
References: Piirustustaide
References: Valokuvaus. Valokuvataide
type: YKL-luokka
alternative label: Bildkonst, grafik (75.1+) @sv
alternative label: Graafinen suunnittelu (75.1+)
alternative label: Graafinen taide (75.1+)
alternative label: Grafiikka, taide (75.1+)
alternative label: Grafik, konst (75.1+) @sv
alternative label: Grafisk konst (75.1+) @sv
alternative label: Grafisk planering (75.1+) @sv
alternative label: Kuvataide, grafiikka (75.1+)
broader: GRAFIIKKA. VALOKUVAUS
in scheme: YKL - Yleisten kirjastojen luokitusjärjestelmä
narrower: Grafiikan materiaalit ja tekniikka
narrower: Kuvitustaide
narrower: Käyttögrafiikka
narrower: Grafiikan historia
notation: 75.1
preferred label: Grafik @sv
preferred label: Graphic art @en
scope note: Hit allmänna verk om konst- och bruksgrafik som innehåller både historia och grafisk teknik Om verket innehåller både grafik och teckningskonst ges företräde åt klass 75.1+ Formtillägget 09 används inte i samband med klasserna 70-77.4985 @sv
scope note: Tähän taide- ja käyttögrafiikan yleisteokset, joissa on sekä historiaa että tekniikkaa Jos teoksessa on sekä grafiikkaa että piirustustaidetta, annetaan etusija luokalle 75.1+ Muotoluokkaa 09 ei käytetä luokkien 70-77.4985 yhteydessä

Grafiikan materiaalit ja tekniikka
type: Concept
References: Kirjapainotaito. Graafinen teollisuus
References: Piirustuksen tekniikka
type: YKL-luokka
alternative label: Akvatint, grafikens teknik (75.11) @sv
alternative label: Akvatinta, grafiikan tekniikka (75.11)
alternative label: Bruksgrafik, material och teknik (75.11) @sv
alternative label: Etsaukset, grafiikan tekniikka (75.11)
alternative label: Etsningar, grafikens teknik (75.11) @sv
alternative label: Färger, grafikens teknik (75.11) @sv
alternative label: Färggrafik, grafikens teknik (75.11) @sv
alternative label: Grafiikka, materiaalit ja tekniikka (75.11)
alternative label: Grafiikkaohjelmat, graafisen taiteen tekniikka (75.11)
alternative label: Grafik, material och teknik (75.11) @sv
alternative label: Grafikprogram, teknik i grafisk konst (75.11) @sv
alternative label: Kivipiirrokset, grafiikan tekniikka (75.11)
alternative label: Konstgrafik, material och teknik (75.11) @sv
alternative label: Konstindustriell grafik, material och teknik (75.11) @sv
alternative label: Kopparstick, grafikens teknik (75.11) @sv
alternative label: Kuivaneula, grafiikan tekniikka (75.11)
alternative label: Kuparipiirrokset, grafiikan tekniikka (75.11)
alternative label: Käyttögrafiikka, materiaalit ja tekniikka (75.11)
alternative label: Linoleikkaukset, grafiikan tekniikka (75.11)
alternative label: Linoleumsnitt, grafikens teknik (75.11) @sv
alternative label: Litografiat, grafiikan tekniikka (75.11)
alternative label: Litografier, grafikens teknik (75.11) @sv
alternative label: Mezzotint, grafikens teknik (75.11) @sv
alternative label: Mezzotinto, grafiikan tekniikka (75.11)
alternative label: Painovärit, grafiikan tekniikka (75.11)
alternative label: Puupiirrokset, grafiikan tekniikka (75.11)
alternative label: Radeeraukset, grafiikan tekniikka (75.11)
alternative label: Raderingar, grafikens teknik (75.11) @sv
alternative label: Serigrafi, grafikens teknik (75.11) @sv
alternative label: Serigrafia, grafiikan tekniikka (75.11)
alternative label: Silk screen, grafikens teknik (75.11) @sv
alternative label: Silkkipainanta, grafiikan tekniikka (75.11)
alternative label: Stålgravyrer, grafikens teknik (75.11) @sv
alternative label: Taidegrafiikka, materiaalit ja tekniikka (75.11)
alternative label: Taideteollinen grafiikka, materiaalit ja tekniikka (75.11)
alternative label: Teräspiirrokset, grafiikan tekniikka (75.11)
alternative label: Torrnål, grafikens teknik (75.11) @sv
alternative label: Tryckfärger, grafikens teknik (75.11) @sv
alternative label: Träsnitt, grafikens teknik (75.11) @sv
alternative label: Värigrafiikka, grafiikan tekniikka (75.11)
alternative label: Värit, grafiikan tekniikka (75.11)
broader: Grafiikka
in scheme: YKL - Yleisten kirjastojen luokitusjärjestelmä
notation: 75.11
preferred label: Grafikens material och grafisk teknik @sv
preferred label: Graphical materials and techniques @en
scope note: Konstgrafikens material och teknik. Brukgrafikens material och teknik Hit praktiska handböcker om träsnitts-, etsnings-, litografi-, kopparsticks-, stålsticks-, mezzotint-, akvatint-, torrnåls-, linoleumsnitt- och serigrafiteknik Hit också verk som behandlar både grafikens och teckningskonstens material och tekniker Formtillägget 09 används inte i samband med klasserna 70-77.4985 @sv
scope note: Taidegrafiikan materiaalit ja tekniikka. Käyttögrafiikan materiaalit ja tekniikka Tähän esim. puupiirros-, etsaus-, kivipiirros-, vaskipiirros-, teräspiirros-, mezzotinta-, akvatinta-, kuivaneula-, linoleikkaus- ja silkkipainotekniikkaa koskevat käytännön oppaat Tähän myös teokset, jotka koskevat sekä grafiikan että piirustustaiteen materiaaleja ja tekniikkaa Muotoluokkaa 09 ei käytetä luokkien 70-77.4985 yhteydessä

Kuvitustaide
type: Concept
References: Kirjansidonta
References: Grafiikan materiaalit ja tekniikka
References: KUVAKIRJAT
References: SARJAKUVAT
References: Lasten- ja nuortenkirjallisuuden historia ja tutkimus
References: Sarjakuvien historia ja tutkimus
type: YKL-luokka
alternative label: Bilderböcker, bokillustrationskonst (75.12) @sv
alternative label: Bokillustrationskonst (75.12) @sv
alternative label: Bokkonst, illustrationskonst (75.12) @sv
alternative label: Bokmåleri (75.12) @sv
alternative label: Illustrationskonst (75.12) @sv
alternative label: Kirjamaalaus (75.12)
alternative label: Kirjankuvitustaide (75.12)
alternative label: Kirjataide, kirjankuvitustaide (75.12)
alternative label: Kuvakirjat, kirjankuvitustaide (75.12)
alternative label: Kuvitustaide (75.12)
broader: Grafiikka
in scheme: YKL - Yleisten kirjastojen luokitusjärjestelmä
notation: 75.12
preferred label: Art of illustration @en
preferred label: Illustrationskonst @sv
scope note: Hit illustrationskonstens historia och personhistoria ur såväl grafikens som tecknings- och målarkonstens synvinkel Formtillägget 09 används inte i samband med klasserna 70-77.4985 @sv
scope note: Tähän kuvitustaiteen historia ja henkilöhistoria sekä grafiikan että piirustus- ja maalaustaiteen kannalta Muotoluokkaa 09 ei käytetä luokkien 70-77.4985 yhteydessä

Käyttögrafiikka
type: Concept
References: Kirjapainotaito. Graafinen teollisuus
References: Mainonta
References: Postimerkkeily
References: Grafiikan materiaalit ja tekniikka
References: Keräily
References: Rahatiede. Mitalitiede
type: YKL-luokka
alternative label: Affischkonst (75.13) @sv
alternative label: Bruksgrafik, historia (75.13) @sv
alternative label: Etiketit, keräily (75.13)
alternative label: Etiketter, samlande (75.13) @sv
alternative label: Etikettitaide (75.13)
alternative label: Etikettkonst (75.13) @sv
alternative label: Ex librikset, keräily (75.13)
alternative label: Ex libris -taide (75.13)
alternative label: Ex libris, konst (75.13) @sv
alternative label: Ex libris, samlande (75.13) @sv
alternative label: Exlibrikset, keräily (75.13)
alternative label: Exlibris, samlande (75.13) @sv
alternative label: Exlibriskonst (75.13) @sv
alternative label: Exlibristaide (75.13)
alternative label: Frimärkskonst, bruksgrafik (75.13) @sv
alternative label: Grafiikka, käyttögrafiikka (75.13)
alternative label: Grafiikka, taideteollinen (75.13)
alternative label: Grafik, bruksgrafik (75.13) @sv
alternative label: Grafik, konstindustriell (75.13) @sv
alternative label: Julistetaide (75.13)
alternative label: Keräily, etiketit (75.13)
alternative label: Keräily, ex librikset (75.13)
alternative label: Keräily, käyttögrafiikka (75.13)
alternative label: Keräily, postikortit (75.13)
alternative label: Konstindustriell grafik (75.13) @sv
alternative label: Käyttögrafiikka, historia (75.13)
alternative label: Liikemerkit, käyttögrafiikka (75.13)
alternative label: Logoer, bruksgrafik (75.13) @sv
alternative label: Logot, graafinen suunnittelu (75.13)
alternative label: Logotyper, grafisk design (75.13) @sv
alternative label: Mainostaide, käyttögrafiikka (75.13)
alternative label: Postikortit, keräily (75.13)
alternative label: Postikorttitaide (75.13)
alternative label: Postimerkkitaide, käyttögrafiikka (75.13)
alternative label: Postkort, samlande (75.13) @sv
alternative label: Postkortskonst (75.13) @sv
alternative label: Produktmärken, grafisk design (75.13) @sv
alternative label: Reklamkonst, bruksgrafik (75.13) @sv
alternative label: Samlarverksamhet, bruksgrafik (75.13) @sv
alternative label: Samlarverksamhet, etiketter (75.13) @sv
alternative label: Samlarverksamhet, exlibris (75.13) @sv
alternative label: Samlarverksamhet, postkort (75.13) @sv
alternative label: Taideteollinen grafiikka (75.13)
alternative label: Tavaramerkit, graafinen suunnittelu (75.13)
alternative label: Tulitikkuetiketit, keräily (75.13)
alternative label: Tuotemerkit, graafinen suunnittelu (75.13)
alternative label: Tändsticksetiketter, samlande (75.13) @sv
alternative label: Varumärken, grafisk design (75.13) @sv
broader: Grafiikka
in scheme: YKL - Yleisten kirjastojen luokitusjärjestelmä
notation: 75.13
preferred label: Bruksgrafik @sv
preferred label: Commercial graphics @en
scope note: Hit bruksgrafikens och den konstindustriella grafikens historia och personhistoria Hit t.ex. affisch-, reklam-, etikett-, postkorts- och exlibriskonstens historia Hit också logotyper ur grafisk synvinkel Hit också samlande av bruksgrafik Formtillägget 09 används inte i samband med klasserna 70-77.4985 @sv
scope note: Tähän käyttögrafiikan tai taideteollisen grafiikan historia ja henkilöhistoria Tähän esim. juliste-, mainos-, etiketti-, postikortti- ja exlibristaiteen historia Tähän myös liikemerkit grafiikan kannalta Tähän myös käyttögrafiikan keräily Muotoluokkaa 09 ei käytetä luokkien 70-77.4985 yhteydessä

Grafiikan historia
type: Concept
References: Piirustus- ja maalaustaiteen historia
References: Kuvitustaide
References: Käyttögrafiikka
References: Valokuvauksen ja valokuvataiteen historia
type: YKL-luokka
alternative label: Akvatint, grafikens historia (75.19+) @sv
alternative label: Akvatinta, grafiikan historia (75.19+)
alternative label: Art nouveau, grafiikka (75.19+)
alternative label: Art nouveau, grafik (75.19+) @sv
alternative label: Etsaukset, grafiikan historia (75.19+)
alternative label: Etsningar, grafikens historia (75.19+) @sv
alternative label: Färggrafik, grafikens historia (75.19+) @sv
alternative label: Graafikot, elämäkerrat ja muistelmat (75.19+)
alternative label: Grafiikka, historia (75.19+)
alternative label: Grafik, historia (75.19+) @sv
alternative label: Grafiker, biografier och memoarer (75.19+) @sv
alternative label: Impressionism, grafik (75.19+) @sv
alternative label: Impressionismi, grafiikka (75.19+)
alternative label: Jugend, grafiikka (75.19+)
alternative label: Jugend, grafik (75.19+) @sv
alternative label: Kivipiirrokset, grafiikan historia (75.19+)
alternative label: Konstgrafik, historia (75.19+) @sv
alternative label: Kopparstick, grafikens historia (75.19+) @sv
alternative label: Kuivaneula, grafiikan historia (75.19+)
alternative label: Kuparipiirrokset, grafiikan historia (75.19+)
alternative label: L'art nouveau, grafiikka (75.19+)
alternative label: L'art nouveau, grafik (75.19+) @sv
alternative label: Linoleikkaukset, grafiikan historia (75.19+)
alternative label: Linoleumsnitt, grafikens historia (75.19+) @sv
alternative label: Litografiat, grafiikan historia (75.19+)
alternative label: Litografier, grafikens historia (75.19+) @sv
alternative label: Mezzotint, grafikens historia (75.19+) @sv
alternative label: Mezzotinto, grafiikan historia (75.19+)
alternative label: Popkonst, grafik (75.19+) @sv
alternative label: Poptaide, grafiikka (75.19+)
alternative label: Puupiirrokset, grafiikan historia (75.19+)
alternative label: Radeeraukset, grafiikan historia (75.19+)
alternative label: Raderingar, grafikens historia (75.19+) @sv
alternative label: Serigrafi, grafikens historia (75.19+) @sv
alternative label: Serigrafia, grafiikan historia (75.19+)
alternative label: Silk screen, grafikens historia (75.19+) @sv
alternative label: Silkkipainanta, grafiikan historia (75.19+)
alternative label: Stålgravyrer. grafikens historia (75.19+) @sv
alternative label: Taidegrafiikka, historia (75.19+)
alternative label: Teräspiirrokset, grafiikan historia (75.19+)
alternative label: Torrnål, grafikens historia (75.19+) @sv
alternative label: Träsnitt, grafikens historia (75.19+) @sv
alternative label: Värigrafiikka, grafiikan historia (75.19+)
broader: Grafiikka
in scheme: YKL - Yleisten kirjastojen luokitusjärjestelmä
narrower: Grafiikan historia, Suomi
notation: 75.19
preferred label: Grafikens historia @sv
preferred label: History of graphic art @en
scope note: Hit allmänna verk om grafikens historia och personhistoria Hit också allmänna verk om grafik eller grafikens historia i olika världsdelar eller länder, samt verk om enskilda grafiker eller deras produktion Om verket innehåller såväl grafikens som tecknings- och målarkonstens historia, ges företräde åt klass 75.19+ Den finländska grafikens historia 75.192 Formtillägget 09 används inte i samband med klasserna 70-77.4985 @sv
scope note: Tähän grafiikan historian ja henkilöhistorian yleisteokset Tähän myös teokset, jotka koskevat eri maanosien tai maiden grafiikkaa yleensä tai sen yleistä historiaa Jos teoksessa on sekä grafiikan että piirustus-tai valokuvataiteen historiaa, annetaan etusija luokalle 75.19+ Suomen grafiikan historia 75.192 Muotoluokkaa 09 ei käytetä luokkien 70-77.4985 yhteydessä

Grafiikan historia, Suomi
type: Concept
type: YKL-luokka
alternative label: Grafiikka, historia, Suomi (75.192)
alternative label: Grafik, historia, Finland (75.192) @sv
broader: Grafiikan historia
in scheme: YKL - Yleisten kirjastojen luokitusjärjestelmä
notation: 75.192
preferred label: Grafikens historia @sv
preferred label: History of graphic art @en
scope note: Formtillägget 09 används inte i samband med klasserna 70-77.4985 @sv
scope note: Muotoluokkaa 09 ei käytetä luokkien 70-77.4985 yhteydessä

Valokuvaus. Valokuvataide
type: Concept
References: Optiset ja lääketieteelliset laitteet
References: Elokuva. Elokuvataide
type: YKL-luokka
alternative label: Bildkonst, fotografering (75.7+) @sv
alternative label: Dokumenttivalokuvaus (75.7+)
alternative label: Dokumentärfotografering (75.7+) @sv
alternative label: Fotografering (75.7+) @sv
alternative label: Fotokonst (75.7+) @sv
alternative label: Kuvataide, valokuvaus (75.7+)
alternative label: Lehtivalokuvaus (75.7+)
alternative label: Pressfotografering (75.7+) @sv
alternative label: Valokuvataide (75.7+)
alternative label: Valokuvaus (75.7+)
broader: GRAFIIKKA. VALOKUVAUS
in scheme: YKL - Yleisten kirjastojen luokitusjärjestelmä
narrower: Aiheet valokuvataiteessa
narrower: Valokuvauksen tekniikka. Valokuvausoppaat
narrower: Valokuvauksen ja valokuvataiteen historia
notation: 75.7
preferred label: Fotografi. Fotokonst @sv
preferred label: Photography. Photographic art @en
scope note: Hit allmänna verk om fotografi och fotokonst som innehåller både fototeknik och fotografins historia Hit och till underklasserna också fotoaffärer och fotografens arbete Hit och till underklasserna också pressfotografering och pressfotografens arbete Om verket passar i klassen för fotografins eller fotokonstens teknik, motiv land ges företräde i följande ordning: teknik, motiv, land Verk om enskilda fotografer fotografer / konstnärsgrupper eller deras reduktion förs dock alltid till klass 75.79+ Formtillägget 09 används inte i samband med klasserna 70-77.4985 @sv
scope note: Tähän valokuvauksen ja valokuvataiteen yleisteokset, joissa on sekä valokuvauksen tekniikkaa että historiaa Tähän ja alaluokkiin myös valokuvausliikkeet ja valokuvaajan työ Tähän ja alaluokkiin myös lehtivalokuvaus ja lehtivalokuvaajan työ Jos teos sopii sekä valokuvauksen tai valokuva-taiteen tekniikan, aihepiirien tai maan mukaiseen luokkaan, annetaan etusija järjestyksessä: tekniikka, aihepiirit, maa Yksittäistä valokuvaajaa / taiteilijaryhmää tai valokuvaajan / taiteilijaryhmän tuotantoa koskevat teokset sijoitetaan kuitenkin aina luokkaan 75.79+ Muotoluokkaa 09 ei käytetä luokkien 70-77.4985 yhteydessä

Aiheet valokuvataiteessa
type: Concept
References: Valokuvauksen tekniikka. Valokuvausoppaat
References: Valokuvauksen ja valokuvataiteen historia
type: YKL-luokka
alternative label: Alastonmalli, valokuvataiteen historia (75.71)
alternative label: Asetelmat, valokuvataiteen historia (75.71)
alternative label: Djurmotiv, fotokonstens historia (75.71) @sv
alternative label: Eläinaiheet, valokuvataiteen historia (75.71)
alternative label: Fotokonst, material och teknik (75.71) @sv
alternative label: Fotokonst, motivkretsar, historia (75.71) @sv
alternative label: Kasviaiheet, valokuvataiteen historia (75.71)
alternative label: Landskap, fotokonstens historia (75.71) @sv
alternative label: Luonnonvalokuvaus, valokuvataiteen historia (75.71)
alternative label: Maisemat, valokuvataiteen historia (75.71)
alternative label: Muotokuvat, valokuvataiteen historia (75.71)
alternative label: Nakenmodell, fotokonstens historia (75.71) @sv
alternative label: Naturfotografering, fotografikonstens historia (75.71) @sv
alternative label: Porträtt, fotokonstens historia (75.71) @sv
alternative label: Stilleben, fotokonstens historia (75.71) @sv
alternative label: Valokuvataide, aihepiirit, historia (75.71)
alternative label: Valokuvataide, materiaalit ja tekniikka (75.71)
alternative label: Växtmotiv, fotokonstens historia (75.71) @sv
broader: Valokuvaus. Valokuvataide
in scheme: YKL - Yleisten kirjastojen luokitusjärjestelmä
notation: 75.71
preferred label: Motifs in photographic art @en
preferred label: Motiv i fotokonsten @sv
scope note: Hit oavsett land olika motiv i fotokonsten och deras historia Porträtt. Nakenstudier. Stilleben. Landskap Djur- och växtmotiv. Naturfotografering som konst Om verket innehåller både fotokonst i anslutning till ett bestämt motiv och fotografisk teknik ges företräde åt klass 75.72 Verk om enskilda fotografer / konstnärsgrupper eller deras konstnärliga produktion förs alltid till klass 75.79+ Fackböcker illustrerade med fotografier samt böcker som presenterar sitt ämne eller objekt dokumentariska genom fotografier klassificeras enligt område I osäkra fall ges företräde åt klass 75.71 Formtillägget 09 används inte i samband med klasserna 70-77.4985 @sv
scope note: Tähän maasta riippumatta eri aihepiireihin liittyvä valokuvataide ja sen historia Muotokuvat. Alastonkuvaus. Asetelmat. Maisemat Eläin- ja kasviaiheet. Valokuvataiteellinen luonnonkuvaus Jos teoksessa on sekä tiettyyn aihepiiriin liittyvää valokuvataidetta että valokuvauksen tekniikkaa, annetaan etusija luokalle 75.72 Yksittäistä valokuvaajaa / taiteilijaryhmää tai valokuvaajan / taiteilijaryhmän tuotantoa koskevat teokset sijoitetaan aina luokkaan 75.79+ Valokuvin kuvitetut tietokirjat sekä tiettyä aihetta tai kohdetta dokumentaarisesti esittelevät valokuvateokset luokitetaan alan mukaan Epävarmoissa tapauksissa annetaan etusija luokalle 75.71 Muotoluokkaa 09 ei käytetä luokkien 70-77.4985 yhteydessä

Valokuvauksen tekniikka. Valokuvausoppaat
type: Concept
References: Tähtitieteelliset kojeet
References: Geodesia. Maanmittaus. Kartoitus
References: Optiset ja lääketieteelliset laitteet
References: Elokuvatekniikka
References: Video- ja kaitafilmauksen tekniikka
alternative label: Alastonmalli, valokuvauksen tekniikka (75.72)
alternative label: Asetelmat, valokuvauksen tekniikka (75.72)
alternative label: Diabilder, fotograferingens teknik (75.72) @sv
alternative label: Diakuvat, valokuvauksen tekniikka (75.72)
alternative label: Digitaalikamerat, valokuvaus (75.72)
alternative label: Digitaalikuvaus (75.72)
alternative label: Digitalfotografering (75.72) @sv
alternative label: Digitalkameror, fotografering (75.72) @sv
alternative label: Djurmotiv, fotograferingens teknik (75.72) @sv
alternative label: Eläinaiheet, valokuvauksen tekniikka (75.72)
alternative label: Filmer, fotograferingens teknik (75.72) @sv
alternative label: Filmit, valokuvauksen tekniikka (75.72)
alternative label: Filtrar, fotograferingens teknik (75.72) @sv
alternative label: Fotografering, material och teknik (75.72) @sv
alternative label: Fotograferingskemi (75.72) @sv
alternative label: Fotografier, förvaringsteknik (75.72) @sv
alternative label: Fotografier, restaurering (75.72) @sv
alternative label: Fotografihandböcker (75.72) @sv
alternative label: Fotokonst, motivkretsar, teknik (75.72) @sv
alternative label: Framkallning, fotograferingens teknik (75.72) @sv
alternative label: Färgfotografering, fotograferingens teknik (75.72) @sv
alternative label: Förstoring, fotograferingens teknik (75.72) @sv
alternative label: Kamerapuhelimet, valokuvauksen tekniikka (75.72)
alternative label: Kamerat, valokuvauksen tekniikka (75.72)
alternative label: Kameratelefoner, fotografisk teknik (75.72) @sv
alternative label: Kameror, fotograferingens teknik (75.72) @sv
alternative label: Kasviaiheet, valokuvauksen tekniikka (75.72)
alternative label: Kauko-objektiivit, valokuvauksen tekniikka (75.72)
alternative label: Kehitys, valokuvauksen tekniikka (75.72)
alternative label: Konservering, fotokonst (75.72) @sv
alternative label: Konservointi, valokuvataide (75.72)
alternative label: Kopiering, fotograferingens teknik (75.72) @sv
alternative label: Kopiointi, valokuvauksen tekniikka (75.72)
alternative label: Landskap, fotograferingens teknik (75.72) @sv
alternative label: Luonnonvalokuvaus, valokuvauksen tekniikka (75.72)
alternative label: Maisemat, valokuvauksen tekniikka (75.72)
alternative label: Makrofotografering, fotograferingens teknik (75.72) @sv
alternative label: Makrokuvaus, valokuvauksen tekniikka (75.72)
alternative label: Mikrofilmaus (75.72)
alternative label: Mikrofilmer, tillverkning (75.72) @sv
alternative label: Mikrofilmit, valmistus (75.72)
alternative label: Mikrofilmning (75.72) @sv
alternative label: Mikrofotografering, fotograferingens teknik (75.72) @sv
alternative label: Mikrokort, mikrofotografering (75.72) @sv
alternative label: Mikrokortit, mikrokuvaus (75.72)
alternative label: Mikrokuvaus, valokuvauksen tekniikka (75.72)
alternative label: Mikroskooppikuvaus, valokuvauksen tekniikka (75.72)
alternative label: Mikroskopfotografering, fotograferingens teknik (75.72) @sv
alternative label: Muotokuvat, valokuvauksen tekniikka (75.72)
alternative label: Mustavalkokuvaus, valokuvauksen tekniikka (75.72)
alternative label: Nakenmodell, fotograferingens teknik (75.72) @sv
alternative label: Naturfotografering, fotograferingens teknik (75.72) @sv
alternative label: Objektiivit, valokuvauksen tekniikka (75.72)
alternative label: Objektiv, fotograferingens teknik (75.72) @sv
alternative label: Photoshop, fotografisk teknik (75.72) @sv
alternative label: Photoshop, valokuvauksen tekniikka (75.72)
alternative label: Retusointi, valokuvauksen tekniikka (75.72)
alternative label: Studiot, valokuvauksen tekniikka (75.72)
alternative label: Suodattimet, valokuvauksen tekniikka (75.72)
alternative label: Suurennus, valokuvauksen tekniikka (75.72)
alternative label: Trikkikuvaus, valokuvauksen tekniikka (75.72)
alternative label: Valokuvat, entisöinti (75.72)
alternative label: Valokuvat, säilytystekniikka (75.72)
alternative label: Valokuvataide, aihepiirit, tekniikka (75.72)
alternative label: Valokuvaus, materiaalit ja tekniikka (75.72)
alternative label: Valokuvauskemia (75.72)
alternative label: Valokuvausoppaat (75.72)
alternative label: Värivalokuvaus, valokuvauksen tekniikka (75.72)
alternative label: Älypuhelimet, valokuvauksen tekniikka (75.72)
broader: Valokuvaus. Valokuvataide
in scheme: YKL - Yleisten kirjastojen luokitusjärjestelmä
notation: 75.72
scope note: Kamerat, objektiivit, suodattimet ja filmit valokuvauksen kannalta Valokuvien kehitys, kopiointi, suurennus, yhdistely, retusointi ja muokkaus Valokuvien säilyttäminen ja entisöinti Makrokuvaus. Mikrokuvaus. Trikkikuvaus. Mikroskooppikuvaus Älypuhelimet valokuvauksen tekniikan kannalta Erikoisalojen valokuvatekniikka luokitetaan alan mukaan Jos teoksessa on sekä valokuvauksen tekniikkaa että tiettyyn aihepiiriin liittyvää valokuvataidetta, annetaan etusija luokalle 75.72 Muotoluokkaa 09 ei käytetä luokkien 70-77.4985 yhteydessä
scope note: Kameror, objektiv, filter och film ur fotografins synvinkel Framkallning, kopiering, förstoring, kombination, retuschering och manipulation av fotografier Förvaring och restauration av fotografier Makrofotografering. Mikrofotografering. Trickfotografering. Mikroskopfotografering Smarttelefoner ur fotografins synvinkel Fototeknik inom specialområden klassificeras enligt område Om verket innehåller både fotografisk teknik och fotokonst med anknytning till ett enskilt motiv, ges företräde åt klass 75.72 Formtillägget 09 används inte i samband med klasserna 70-77.4985 @sv

Valokuvauksen ja valokuvataiteen historia
type: Concept
References: Grafiikan historia
References: Aiheet valokuvataiteessa
type: YKL-luokka
alternative label: Diabilder, fotokonstens historia (75.79+) @sv
alternative label: Diakuvat, valokuvataiteen historia (75.79+)
alternative label: Fotografer, biografier och memoarer (75.79+) @sv
alternative label: Fotografering, historia (75.79+) @sv
alternative label: Fotokonst, historia (75.79+) @sv
alternative label: Valokuvaajat, elämäkerrat ja muistelmat (75.79+)
alternative label: Valokuvataide, historia (75.79+)
alternative label: Valokuvaus, historia (75.79+)
broader: Valokuvaus. Valokuvataide
in scheme: YKL - Yleisten kirjastojen luokitusjärjestelmä
narrower: Valokuvauksen ja valokuvataiteen historia, Suomi
narrower: Valokuvauksen ja valokuvataiteen historia, Pohjoismaat
narrower: Valokuvauksen ja valokuvataiteen historia, Keski-Eurooppa
narrower: Valokuvauksen ja valokuvataiteen historia, Iso-Britannia. Irlanti
narrower: Valokuvauksen ja valokuvataiteen historia, Etelä-Eurooppa
narrower: Valokuvauksen ja valokuvataiteen historia, Itä-Eurooppa
narrower: Valokuvauksen ja valokuvataiteen historia, Aasia
narrower: Valokuvauksen ja valokuvataiteen historia, Afrikka
narrower: Valokuvauksen ja valokuvataiteen historia, Amerikka
narrower: Valokuvauksen ja valokuvataiteen historia, Australia ja Oseania
notation: 75.79
preferred label: Fotografins och fotokonstens historia @sv
preferred label: History of photography and photographic art @en
scope note: Hit allmänna verk om fotografins och fotokonstens historia Hit och till underklasserna också verk som behandlar fotografi eller fotokonst eller deras historia i olika världsdelar, länder eller under olika tidsperioden, samt verk som behandlar enskilda fotografer / konstnärsgrupper eller deras reduktion Fotografens land bestäms enligt det land där han eller hon haft sin huvudsakliga konstnärsbana Hit allmänna verk om den europeiska fotografins och fotokonstens historia Om verket innehåller både fotokonstens och grafikens historia ges företräde åt klass 75.19+ Formtillägget 09 används inte i samband med klasserna 70-77.4985 @sv
scope note: Tähän valokuvauksen ja valokuvataiteen historian yleisteokset Tähän ja alaluokkiin myös teokset, jotka koskevat eri maanosien, maiden tai aikakausien valokuvausta tai valokuvataidetta tai niiden historiaa sekä teokset, jotka koskevat yksittäisiä valokuvaajia / taiteilijaryhmiä tai heidän tuotantoaan Valokuvaajan maa määräytyy sen mukaan, missä hän on tehnyt keskeisen uransa Tähän Euroopan valokuvauksen ja valokuvataiteen historian yleisteokset Jos teoksessa on sekä valokuvataiteen että grafiikan historiaa, annetaan etusija luokalle 75.19+ Muotoluokkaa 09 ei käytetä luokkien 70-77.4985 yhteydessä

Valokuvauksen ja valokuvataiteen historia, Suomi
type: Concept
type: YKL-luokka
alternative label: Fotografering, historia, Finland (75.792) @sv
alternative label: Fotokonst, historia, Finland (75.792) @sv
alternative label: Valokuvataide, historia, Suomi (75.792)
alternative label: Valokuvaus, historia, Suomi (75.792)
broader: Valokuvauksen ja valokuvataiteen historia
in scheme: YKL - Yleisten kirjastojen luokitusjärjestelmä
notation: 75.792
preferred label: Fotografins och fotokonstens historia, Finland @sv
preferred label: History of photography and photographic art, Finland @en

Valokuvauksen ja valokuvataiteen historia, Pohjoismaat
type: Concept
type: YKL-luokka
broader: Valokuvauksen ja valokuvataiteen historia
in scheme: YKL - Yleisten kirjastojen luokitusjärjestelmä
notation: 75.793
preferred label: Fotografins och fotokonstens historia, Norden @sv
preferred label: History of photography and photographic art, Nordic countries @en
scope note: Danmark. Island. Norge. Sverige Hit också Färöarna och Grönland Hit också verk som behandlar flera nordiska länder, även Finland @sv
scope note: Islanti. Norja. Ruotsi. Tanska Tähän myös Fär-saaret ja Grönlanti Tähän myös teokset, jotka koskevat useampia Pohjoismaita, myös Suomea

Valokuvauksen ja valokuvataiteen historia, Keski-Eurooppa
type: Concept
type: YKL-luokka
broader: Valokuvauksen ja valokuvataiteen historia
in scheme: YKL - Yleisten kirjastojen luokitusjärjestelmä
narrower: Valokuvauksen ja valokuvataiteen historia, Saksa
notation: 75.794
preferred label: Fotografins och fotokonstens historia, Mellaneuropa @sv
preferred label: History of photography and photographic art, Central Europe @en
scope note: Alankomaat. Belgia. Itävalta. Liechtenstein. Luxemburg. Slovakia. Sveitsi. Tsekki. Unkari
scope note: Belgien. Liechtenstein. Luxemburg. Nederländerna. Schweiz. Slovakien. Tjeckien. Ungern. Österrike @sv

Valokuvauksen ja valokuvataiteen historia, Saksa
type: Concept
type: YKL-luokka
broader: Valokuvauksen ja valokuvataiteen historia, Keski-Eurooppa
in scheme: YKL - Yleisten kirjastojen luokitusjärjestelmä
notation: 75.7941
preferred label: Fotografins och fotokonstens historia, Tyskland @sv
preferred label: History of photography and photographic art, Germany @en

Valokuvauksen ja valokuvataiteen historia, Iso-Britannia. Irlanti
type: Concept
type: YKL-luokka
broader: Valokuvauksen ja valokuvataiteen historia
in scheme: YKL - Yleisten kirjastojen luokitusjärjestelmä
notation: 75.795
preferred label: Fotografins och fotokonstens historia, Storbritannien. Irland @sv
preferred label: History of photography and photographic art, Great Britain. Ireland @en

Valokuvauksen ja valokuvataiteen historia, Etelä-Eurooppa
type: Concept
type: YKL-luokka
broader: Valokuvauksen ja valokuvataiteen historia
in scheme: YKL - Yleisten kirjastojen luokitusjärjestelmä
narrower: Valokuvauksen ja valokuvataiteen historia, Ranska
narrower: Valokuvauksen ja valokuvataiteen historia, Italia
narrower: Valokuvauksen ja valokuvataiteen historia, Espanja
notation: 75.796
preferred label: Fotografins och fotokonstens historia, Sydeuropa @sv
preferred label: History of photography and photographic art, Southern Europe @en
scope note: Albania. Bosnia ja Hertsegovina. Bulgaria. Kreikka. Kroatia. Makedonia. Malta. Portugali. Romania. Serbia ja Montenegro. Slovenia
scope note: Albanien. Bosnien-Hercegovina. Bulgarien. Grekland. Kroatien. Makedonien. Malta. Portugal. Rumänien. Serbien och Montenegro. Slovenien @sv

Valokuvauksen ja valokuvataiteen historia, Ranska
type: Concept
type: YKL-luokka
broader: Valokuvauksen ja valokuvataiteen historia, Etelä-Eurooppa
in scheme: YKL - Yleisten kirjastojen luokitusjärjestelmä
notation: 75.7961
preferred label: Fotografins och fotokonstens historia, Frankrike @sv
preferred label: History of photography and photographic art, France @en
scope note: Hit också Monaco @sv
scope note: Tähän myös Monaco

Valokuvauksen ja valokuvataiteen historia, Italia
type: Concept
type: YKL-luokka
broader: Valokuvauksen ja valokuvataiteen historia, Etelä-Eurooppa
in scheme: YKL - Yleisten kirjastojen luokitusjärjestelmä
notation: 75.7962
preferred label: Fotografins och fotokonstens historia, Italien @sv
preferred label: History of photography and photographic art, Italy @en
scope note: Hit också San Marino och Vatikanstaten @sv
scope note: Tähän myös San Marino ja Vatikaanivaltio

Valokuvauksen ja valokuvataiteen historia, Espanja
type: Concept
type: YKL-luokka
broader: Valokuvauksen ja valokuvataiteen historia, Etelä-Eurooppa
in scheme: YKL - Yleisten kirjastojen luokitusjärjestelmä
notation: 75.7963
preferred label: Fotografins och fotokonstens historia, Spanien @sv
preferred label: History of photography and photographic art, Spain @en
scope note: Hit också Andorra @sv
scope note: Tähän myös Andorra

Valokuvauksen ja valokuvataiteen historia, Itä-Eurooppa
type: Concept
type: YKL-luokka
broader: Valokuvauksen ja valokuvataiteen historia
in scheme: YKL - Yleisten kirjastojen luokitusjärjestelmä
narrower: Valokuvauksen ja valokuvataiteen historia, Venäjä. Ukraina. Valko-Venäjä. Moldova
notation: 75.797
preferred label: Fotografins och fotokonstens historia, Östeuropa @sv
preferred label: History of photography and photographic art, Eastern Europe @en
scope note: Estland. Lettland. Litauen. Polen @sv
scope note: Latvia. Liettua. Puola. Viro

Valokuvauksen ja valokuvataiteen historia, Venäjä. Ukraina. Valko-Venäjä. Moldova
type: Concept
type: YKL-luokka
broader: Valokuvauksen ja valokuvataiteen historia, Itä-Eurooppa
in scheme: YKL - Yleisten kirjastojen luokitusjärjestelmä
notation: 75.7971
preferred label: Fotografins och fotokonstens historia, Ryssland. Ukraina. Vitryssland. Moldova @sv
preferred label: History of photography and photographic art, Russia. Ukraine. Belarus. Moldova @en

Valokuvauksen ja valokuvataiteen historia, Aasia
type: Concept
type: YKL-luokka
broader: Valokuvauksen ja valokuvataiteen historia
in scheme: YKL - Yleisten kirjastojen luokitusjärjestelmä
notation: 75.7981
preferred label: Fotografins och fotokonstens historia, Asien @sv
preferred label: History of photography and photographic art, Asia @en

Valokuvauksen ja valokuvataiteen historia, Afrikka
type: Concept
type: YKL-luokka
broader: Valokuvauksen ja valokuvataiteen historia
in scheme: YKL - Yleisten kirjastojen luokitusjärjestelmä
notation: 75.7982
preferred label: Fotografins och fotokonstens historia, Afrika @sv
preferred label: History of photography and photographic art, Africa @en

Valokuvauksen ja valokuvataiteen historia, Amerikka
type: Concept
type: YKL-luokka
broader: Valokuvauksen ja valokuvataiteen historia
in scheme: YKL - Yleisten kirjastojen luokitusjärjestelmä
notation: 75.7983
preferred label: Fotografins och fotokonstens historia, Amerika @sv
preferred label: History of photography and photographic art, America @en

Valokuvauksen ja valokuvataiteen historia, Australia ja Oseania
type: Concept
type: YKL-luokka
broader: Valokuvauksen ja valokuvataiteen historia
in scheme: YKL - Yleisten kirjastojen luokitusjärjestelmä
notation: 75.7985
preferred label: Fotografins och fotokonstens historia, Australien och Oceanien @sv
preferred label: History of photography and photographic art, Australia and Oceania @en

MUOTOILU. TAIDETEOLLISUUS. TAIDEKÄSITYÖ
type: Concept
References: Kirkolliset esineet ja symbolit
References: KÄSITYÖ. KOTITEOLLISUUS
References: Markkinointi. Kauppa
References: Taidekauppa
References: Antiikkiesineiden keräily
References: Muoti ja muodin historia
type: YKL-luokka
alternative label: Design (76+)
alternative label: Design-taiteilijat, elämäkerrat ja muistelmat (76+)
alternative label: Designkonstnärer, biografier och memoarer (76+) @sv
alternative label: Esineellinen kulttuuri, taideteollisuus (76+)
alternative label: Formgivare, biografier och memoarer (76+) @sv
alternative label: Formgivning, konstindustri (76+) @sv
alternative label: Industriell formgivning (76) @sv
alternative label: Konservering, konsthantverk (76+) @sv
alternative label: Konservering, konstindustri (76+) @sv
alternative label: Konservointi, taidekäsityö (76+)
alternative label: Konservointi, taideteollisuus (76+)
alternative label: Konst (70 ... 78+) @sv
alternative label: Konst, olika konstformer (70 ... 78+) @sv
alternative label: Konstformer (70 ... 78+) @sv
alternative label: Konsthantverk (76+) @sv
alternative label: Konstindustri (76+) @sv
alternative label: Materiell kultur, konstindustri (76+) @sv
alternative label: Muotoilijat, elämäkerrat ja muistelmat (76+)
alternative label: Muotoilu, taideteollisuus (76+)
alternative label: Taide, eri taidemuodot (70 ... 78+)
alternative label: Taidekäsityö (76+)
alternative label: Taidemuodot (70 ... 78+)
alternative label: Taideteollisuus (76+)
alternative label: Taiteet (70 ... 78+)
alternative label: Teollinen muotoilu (76)
broader: TAITEET. LIIKUNTA
in scheme: YKL - Yleisten kirjastojen luokitusjärjestelmä
narrower: Sisustusarkkitehtuuri. Huonekalutaide
narrower: Tekstiilitaide
narrower: Lasitaide. Keramiikkataide
narrower: Taidetaonta. Korutaide
narrower: Koristetaide. Ornamentiikka
narrower: Paperitaide
narrower: Antiikkiesineiden keräily
narrower: Taideteollisuuden ja taidekäsityön historia
notation: 76
preferred label: DESIGN. INDUSTRIAL ART. ART HANDICRAFT @en
preferred label: FORMGIVNING. KONSTINDUSTRI. KONSTHANTVERK @sv
scope note: Hit allmänna verk om konstindustri, konstindustriell formgivning, industriell formgivning och konsthantverk Hit och till underklasserna verk som handlar om konstindustri ur konsthistorisk synvinkel eller presenterar konstindustriprodukter eller konsthantverksprodukter Om verket innehåller både presentation av konstindustriprodukter eller konsthantverksprodukter och handarbetsbeskrivningar, ges företräde åt klass 65+ Industriell formgivning och planering förs enligt område till klassen 76+ och 60-64+ Formtillägget 09 används inte i samband med klasserna 70-77.4985 @sv
scope note: Tähän taideteollisuuden, taideteollisen muotoilun, teollisen muotoilun ja taidekäsityön yleisteokset Tähän ja alaluokkiin teokset, jotka koskevat taideteollisuutta taidehistorian kannalta tai esittelevät taideteollisuuden ja taidekäsityön tuotteita Jos teoksessa on sekä taideteollisuuden tai taidekäsityön tuotteiden esittelyä että käsityöohjeita, annetaan etusija luokalle 65+ Teollinen muotoilu ja suunnittelu alan mukaan luokkiin 76+ ja 60-64+ Muotoluokkaa 09 ei käytetä luokkien 70-77.4985 yhteydessä

Sisustusarkkitehtuuri. Huonekalutaide
type: Concept
References: Huonekaluteollisuus
References: Huonekalujen rakentaminen
References: Rakennusaineet. Rakennustyöt
References: Sisustusoppaat
References: ARKKITEHTUURI
alternative label: Arkitektur, inredningskonst (76.1) @sv
alternative label: Arkkitehtuuri, sisustusarkkitehtuuri (76.1)
alternative label: Art nouveau, huonekalutaide (76.1)
alternative label: Art nouveau, möbelkonst (76.1) @sv
alternative label: Asunnot, sisustusarkkitehtuuri (76.1)
alternative label: Badrum, inredningskonst (76.1) @sv
alternative label: Barock, möbelkonst. (76.1) @sv
alternative label: Barokki, huonekalutaide (76.1)
alternative label: Belysningsanordningar, inredningskonst (76.1) @sv
alternative label: Belysningsanordningar, konstindustri (76.1) @sv
alternative label: Biblioteksplanering, inredningskonst (76.1) @sv
alternative label: Biedermeier, huonekalutaide (76.1)
alternative label: Biedermeier, möbelkonst (76.1) @sv
alternative label: Bildhuggeri, träsnideri (76.1) @sv
alternative label: Bostäder, inredningskonst (76.1) @sv
alternative label: Byggnadskonst, inredningskonst (76.1) @sv
alternative label: Empire, möbelkonst (76.1) @sv
alternative label: Empire-tyyli, huonekalutaide (76.1)
alternative label: Funktionalism, möbelkonst (76.1) @sv
alternative label: Funktionalismi, huonekalutaide (76.1)
alternative label: Gardiner, inredningskonst (76.1) @sv
alternative label: Gustaviansk stil, möbelkonst (76.1) @sv
alternative label: Heminredning, inredningskonst (76.1) @sv
alternative label: Huonekalusuunnittelu (76.1)
alternative label: Huonekalut, huonekalu- ja puuleikkaustaide (76.1)
alternative label: Huonekalut, sisustusarkkitehtuuri (76.1)
alternative label: Huonekalut, tyylihistoria (76.1)
alternative label: Huonekalutaide (76.1)
alternative label: Huonetilat, sisustusarkkitehtuuri (76.1)
alternative label: Huvilat, sisustusarkkitehtuuri (76.1)
alternative label: Inredningsarkitekter, biografier och memoarer (76.1) @sv
alternative label: Inredningsarkitektur (76.1) @sv
alternative label: Inredningskonst (76.1) @sv
alternative label: Intarsia (76.1)
alternative label: Jugend, huonekalutaide (76.1)
alternative label: Jugend, möbelkonst (76.1) @sv
alternative label: Julkiset tilat, sisustusarkkitehtuuri (76.1)
alternative label: Keittiöt, sisustusarkkitehtuuri (76.1)
alternative label: Kirjastosuunnittelu, sisustusarkkitehtuuri (76.1)
alternative label: Kodinsisustus, sisustusarkkitehtuuri (76.1)
alternative label: Konsttapeter (76.1) @sv
alternative label: Kontor, inredningskonst (76.1) @sv
alternative label: Kustavilainen tyyli, huonekalutaide (76.1)
alternative label: Kylpyhuoneet, sisustusarkkitehtuuri (76.1)
alternative label: Kök, inredningskonst (76.1) @sv
alternative label: L'art nouveau, huonekalutaide (76.1)
alternative label: Lamput, sisustusarkkitehtuuri (76.1)
alternative label: Lamput, taideteollisuus (76.1)
alternative label: Matot, sisustusarkkitehtuuri (76.1)
alternative label: Piirustus, sisustusarkkitehtuuri (76.1)
alternative label: Puuleikkaustaide (76.1)
alternative label: Puutyöt, taideteollisuus (76.1)
alternative label: Rakennustaide, sisustusarkkitehtuuri (76.1)
alternative label: Rokokoo, huonekalutaide (76.1)
alternative label: Sisustusarkkitehdit, elämäkerrat ja muistelmat (76.1)
alternative label: Sisustusarkkitehtuuri (76.1)
alternative label: Sisustustaide (76.1)
alternative label: Taidepuutyöt (76.1)
alternative label: Taidetapetit (76.1)
alternative label: Takat, sisustusarkkitehtuuri (76.1)
alternative label: Tapetit, sisustusarkkitehtuuri (76.1)
alternative label: Tapettitaide (76.1)
alternative label: Tila, sisustusarkkitehtuuri (76.1)
alternative label: Toimistot, sisustusarkkitehtuuri (76.1)
alternative label: Tyylit, sisustustaide (76.1)
alternative label: Valaisimet, sisustusarkkitehtuuri (76.1)
alternative label: Valaisimet, taideteollisuus (76.1)
alternative label: Veistotaide, puuleikkaustaide (76.1)
alternative label: Verhot, sisustusarkkitehtuuri (76.1)
broader: MUOTOILU. TAIDETEOLLISUUS. TAIDEKÄSITYÖ
in scheme: YKL - Yleisten kirjastojen luokitusjärjestelmä
notation: 76.1
scope note: Inredningsstilar. Möbelstilar Träsnideskonst. Konsttapeter Hit också inredningsarkitekturens och möbelkonstens historia och personhistoria Om verket innehåller både inredningsarkitektur och praktiska inredningsråd, ges företräde åt klass 68.4 Om verket innehåller både inredningsarkitektur och arkitektur ges företräde åt klass 72+ Formtillägget 09 används inte i samband med klasserna 70-77.4985 @sv
scope note: Sisustustyylit. Huonekalutyylit Puuleikkaustaide. Taidetapetit Tähän myös sisustusarkkitehtuurin ja huonekalutaiteen historia ja henkilöhistoria Jos teoksessa on sekä sisustusarkkitehtuuria että käytännön sisustusohjeita, annetaan etusija luokalle 68.4 Jos teoksessa on sekä sisustusarkkitehtuuria että arkkitehtuuria, annetaan etusija luokalle 72+ Muotoluokkaa 09 ei käytetä luokkien 70-77.4985 yhteydessä

Tekstiilitaide
type: Concept
References: KANSATIEDE. KULTTUURIANTROPOLOGIA
References: Tekstiili- ja vaatetusteollisuus
References: Nahka- ja jalkineteollisuus
References: Nahkatyö
References: Tekstiilityö
References: Kudonta
References: Ompelu
References: Neulonta
References: Kankaanpainanta
References: Tilataide. Ympäristötaide
References: Muoti ja muodin historia
alternative label: Batiikkitaide (76.2)
alternative label: Batikkonst (76.2) @sv
alternative label: Bildtapetskonst (76.2) @sv
alternative label: Broderikonst (76.2) @sv
alternative label: Dubbelvävnadskonst (76.2) @sv
alternative label: Fransflätningskonst (76.2) @sv
alternative label: Fransutaide (76.2)
alternative label: Gardiner, textilkonst (76.2) @sv
alternative label: Gobeliinitaide (76.2)
alternative label: Gobelängkonst (76.2) @sv
alternative label: Itämaiset matot (76.2)
alternative label: Kankaanpainantataide (76.2)
alternative label: Kankaat, tekstiilitaide (76.2)
alternative label: Kirjontataide (76.2)
alternative label: Konstsömnad (76.2) @sv
alternative label: Konsttextilier (76.2) @sv
alternative label: Konstvävning (76.2) @sv
alternative label: Koruompelutaide (76.2)
alternative label: Kuultokudostaide (76.2)
alternative label: Kuvakudostaide (76.2)
alternative label: Lapptäcken, konstindustri (76.2) @sv
alternative label: Läderarbeten, konstindustri (76.2) @sv
alternative label: Makrameetaide (76.2)
alternative label: Makramékonst (76.2) @sv
alternative label: Matot, mattotaide (76.2)
alternative label: Mattkonst (76.2) @sv
alternative label: Mattor, mattkonst (76.2) @sv
alternative label: Mattotaide (76.2)
alternative label: Nahkatyöt, taideteollisuus (76.2)
alternative label: Pitsit, tekstiilitaide (76.2)
alternative label: Poppanakonst (76.2) @sv
alternative label: Poppanataide (76.2)
alternative label: Pälsverk, konstindustri (76.2) @sv
alternative label: Raanutaide (76.2)
alternative label: Ranor, konsthantverk (76.2) @sv
alternative label: Ryakonst (76.2) @sv
alternative label: Ryijytaide (76.2)
alternative label: Saalitaide (76.2)
alternative label: Schalkonst (76.2) @sv
alternative label: Seinävaatteet, tekstiilitaide (76.2)
alternative label: Shaalitaide (76.2)
alternative label: Sidenmålningskonst (76.2) @sv
alternative label: Silkkimaalaustaide (76.2)
alternative label: Sjalkonst (76.2) @sv
alternative label: Spetsar, textilkonst (76.2) @sv
alternative label: Taidekudonta (76.2)
alternative label: Taideompelu (76.2)
alternative label: Taidetekstiilit (76.2)
alternative label: Tapisserikonst (76.2) @sv
alternative label: Tekstiilisuunnittelijat, elämäkerrat ja muistelmat (76.2)
alternative label: Tekstiilitaide (76.2)
alternative label: Tekstiilitaiteilijat, elämäkerrat ja muistelmat (76.2)
alternative label: Textilformgivare, biografier och memoarer (76.2) @sv
alternative label: Textilkonst (76.2) @sv
alternative label: Textilkonstnärer, biografier och memoarer (76.2) @sv
alternative label: Textiltryckskonst (76.2) @sv
alternative label: Tilkkutyöt, taideteollisuus (76.2)
alternative label: Transparangkonst (76.2) @sv
alternative label: Turkistyöt, taideteollisuus (76.2)
alternative label: Tyger, textilkonst (76.2) @sv
alternative label: Täkänätaide (76.2)
alternative label: Verhot, tekstiilitaide (76.2)
alternative label: Väggbonader, textilkonst (76.2) @sv
broader: MUOTOILU. TAIDETEOLLISUUS. TAIDEKÄSITYÖ
in scheme: YKL - Yleisten kirjastojen luokitusjärjestelmä
notation: 76.2
scope note: Rya-, rana-, gobeläng-, matt-, bildvävs-, batik- och silkesmålningskonst Hit också läderarbeten ur konstindustrins och konsthantverkets synvinkel Hit också textilkonstens historia och personhistoria Formtillägget 09 används inte i samband med klasserna 70-77.4985 @sv
scope note: Ryijy-, raanu-, gobeliini-, matto-, kuvakudos-, batiikki- ja silkkimaalaustaide Tähän myös nahkatyöt taideteollisuuden ja taidekäsityön kannalta Tähän ja alaluokkiin myös tekstiilitaiteen historia ja henkilöhistoria Muotoluokkaa 09 ei käytetä luokkien 70-77.4985 yhteydessä

Lasitaide. Keramiikkataide
type: Concept
References: Keraaminen teollisuus. Lasiteollisuus. Sementtiteollisuus
References: Muovailu. Keramiikkatyöt
References: Lasimaalaus. Posliinimaalaus
type: YKL-luokka
alternative label: Astiat, lasi- ja keramiikkataide (76.3)
alternative label: Bysans, mosaikkonst (76.3) @sv
alternative label: Bysantti, mosaiikkitaide (76.3)
alternative label: Fajanskonst (76.3) @sv
alternative label: Fajanssitaide (76.3)
alternative label: Glasföremål, konstglas (76.3) @sv
alternative label: Glaskonst (76.3) @sv
alternative label: Glasmåleri (76.3) @sv
alternative label: Keraamikot, elämäkerrat ja muistelmat (76.3)
alternative label: Keramiikkataide (76.3)
alternative label: Keramikarbeten, konstindustri (76.3) @sv
alternative label: Keramiker, biografier och memoarer (76.3) @sv
alternative label: Keramisk konst (76.3) @sv
alternative label: Kivitavara, keramiikkataide (76.3)
alternative label: Konstglas (76.3) @sv
alternative label: Konstkeramikindustri (76.3) @sv
alternative label: Kristallföremål, glaskonst (76.3) @sv
alternative label: Kristalliesineet, lasitaide (76.3)
alternative label: Kärl, glas- och keramikkonst (76.3) @sv
alternative label: Lasiesineet, taidelasi (76.3)
alternative label: Lasimaalaustaide (76.3)
alternative label: Lasitaide (76.3)
alternative label: Majolikakonst (76.3) @sv
alternative label: Majolikataide (76.3)
alternative label: Mosaiikkitaide (76.3)
alternative label: Mosaikkonst (76.3) @sv
alternative label: Peilit, lasitaide (76.3)
alternative label: Porslinskonst (76.3) @sv
alternative label: Porslinsmålningskonst (76.3) @sv
alternative label: Posliinimaalaustaide (76.3)
alternative label: Posliinitaide (76.3)
alternative label: Savityöt, taideteollisuus (76.3)
alternative label: Speglar, glaskonst (76.3) @sv
alternative label: Stengods, keramikkonst (76.3) @sv
alternative label: Taidelasi (76.3)
alternative label: Taidesaviteollisuus (76.3)
broader: MUOTOILU. TAIDETEOLLISUUS. TAIDEKÄSITYÖ
in scheme: YKL - Yleisten kirjastojen luokitusjärjestelmä
notation: 76.3
preferred label: Glaskonst. Keramikkonst @sv
preferred label: Glass art Ceramic art @en
scope note: Hit också fajans-, porslins- och mosaikkonst samt glas- och porslinsmålningskonst Hit också glas- och keramikkonstens samt glas- och keramikmålningskonstens historia och personhistoria Formtillägget 09 används inte i samband med klasserna 70-77.4985 @sv
scope note: Tähän myös fajanssi-, posliini- ja mosaiikkitaide sekä lasimaalaus- ja posliinimaalaustaide Tähän myös lasi- ja keramiikkataiteen sekä lasi- ja posliinimaalaustaiteen historia ja henkilöhistoria Muotoluokkaa 09 ei käytetä luokkien 70-77.4985 yhteydessä

Taidetaonta. Korutaide
type: Concept
References: Kelloteollisuus
References: KÄSITYÖ. KOTITEOLLISUUS
References: Metallityö
References: Koristetaide. Ornamentiikka
alternative label: Benföremål, konstindustri (76.4) @sv
alternative label: Bronsföremål, konstindustri (76.4) @sv
alternative label: Bärnsten, guldsmide (76.4) @sv
alternative label: Elfenbensföremål, konstindustri (76.4) @sv
alternative label: Emalitaide (76.4)
alternative label: Emalityöohjeet ja -mallit (76.4)
alternative label: Emaljarbeten, instruktioner och modeller (76.4) @sv
alternative label: Emaljkonst (76.4) @sv
alternative label: Gravörens arbete, guldsmide (76.4) @sv
alternative label: Guldföremål, konsthantverk och smyckekonst (76.4) @sv
alternative label: Guldsmedens arbete (76.4) @sv
alternative label: Guldsmide (76.4) @sv
alternative label: Halvädelstenar, konsthantverk och smyckekonst (76.4) @sv
alternative label: Helmet, taidekäsityö (76.4)
alternative label: Helmityöt, taidekäsityö (76.4)
alternative label: Hionta, jalokivet (76.4)
alternative label: Hopeaesineet, taidekäsityö ja korutaide (76.4)
alternative label: Hopeasepän työ (76.4)
alternative label: Hopeasepäntaide (76.4)
alternative label: Jade, konsthantverk (76.4) @sv
alternative label: Jade, taidekäsityö (76.4)
alternative label: Jalokivet, hionta (76.4)
alternative label: Jalokivet, kultasepäntaide ja korutaide (76.4)
alternative label: Jalometallit, kultasepäntaide (76.4)
alternative label: Kaivertajan työ, kultasepäntaide (76.4)
alternative label: Kameet, korutaide (76.4)
alternative label: Kaméer, smyckekonst (76.4) @sv
alternative label: Kivi, korutaiteen materiaalit (76.4)
alternative label: Konstsmide (76.4) @sv
alternative label: Kopparföremål, konstindustri och -hantverk (76.4) @sv
alternative label: Korallföremål, konstindustri (76.4) @sv
alternative label: Koralliesineet, taideteollisuus (76.4)
alternative label: Korut, taideteollisuus (76.4)
alternative label: Korutaiteilijat, elämäkerrat ja muistelmat (76.4)
alternative label: Kultaesineet, taidekäsityö ja korutaide (76.4)
alternative label: Kultasepän työ (76.4)
alternative label: Kultasepäntaide (76.4)
alternative label: Kupariesineet, taideteollisuus ja -käsityö (76.4)
alternative label: Luuesineet, taideteollisuus (76.4)
alternative label: Meripihka, kultasepäntaide (76.4)
alternative label: Messinkiesineet, taideteollisuus (76.4)
alternative label: Metallföremål, konstindustri (76.4) @sv
alternative label: Metalliesineet, taideteollisuus (76.4)
alternative label: Metallitaide (76.4)
alternative label: Metallkonst (76.4) @sv
alternative label: Mässingföremål, konstindustri (76.4) @sv
alternative label: Norsunluuesineet, taideteollisuus (76.4)
alternative label: Paperikorut, korutaide (76.4)
alternative label: Papperssmycken, smyckekonst (76.4) @sv
alternative label: Pronssiesineet, taideteollisuus (76.4)
alternative label: Puolijalokivet, taidekäsityö ja korutaide (76.4)
alternative label: Pärlarbeten, konsthantverk (76.4) @sv
alternative label: Pärlor, konsthantverk (76.4) @sv
alternative label: Silverföremål, konsthantverk och smyckekonst (76.4) @sv
alternative label: Silversmedens arbete (76.4) @sv
alternative label: Silversmide (76.4) @sv
alternative label: Slipning, juveler (76.4) @sv
alternative label: Smideskonst (76.4) @sv
alternative label: Smyckekonstnärer, biografier och memoarer (76.4) @sv
alternative label: Smycken, konstindustri (76.4) @sv
alternative label: Sten, smyckekonstens material (76.4) @sv
alternative label: Taidetaonta (76.4)
alternative label: Taontataide (76.4)
alternative label: Tennföremål, konstindustri (76.4) @sv
alternative label: Tinaesineet, taideteollisuus (76.4)
alternative label: Ädelmetaller, guldsmide (76.4) @sv
alternative label: Ädelstenar, guldsmide och smyckekonst (76.4) @sv
alternative label: Ädelstenar, slipning (76.4) @sv
broader: MUOTOILU. TAIDETEOLLISUUS. TAIDEKÄSITYÖ
in scheme: YKL - Yleisten kirjastojen luokitusjärjestelmä
notation: 76.4
preferred label: Konstsmide. Smyckeskonst @sv
preferred label: Smithery. Art jewellery @en
scope note: Guldsmide. Silversmide Guld-, silver-, brons-, koppar-, tenn-, mässings- och andra metallarbeten Ädelstens-, emalj-, ben- och elfenbensarbeten samt smycken av olika material Hit också konstsmidets, guld- och silversmedskonstens och smyckekonstens historia och personhistoria Om verket innehåller både guldsmeds- och urmakararbete ges företräde åt klass 64.57 Formtillägget 09 används inte i samband med klasserna 70-77.4985 @sv
scope note: Kultasepäntyö ja -taide. Hopeasepäntyö ja -taide Kulta-, hopea-, pronssi-, kupari-, tina-, messinki- ja muut metallityöt Jalokivi-, emali-, luu- ja norsunluutyöt sekä eri materiaaleista valmistetut korut Tähän myös taidetaonnan, kulta- ja hopeasepäntaiteen sekä korutaiteen historia ja henkilöhistoria Jos teoksessa on sekä kulta- että kellosepän työtä, annetaan etusija luokalle 64.57 Muotoluokkaa 09 ei käytetä luokkien 70-77.4985 yhteydessä

Koristetaide. Ornamentiikka
type: Concept
References: KANSATIEDE. KULTTUURIANTROPOLOGIA
References: KÄSITYÖ. KOTITEOLLISUUS
References: Arkkitehtuurin historia
References: Taidetaonta. Korutaide
type: YKL-luokka
alternative label: Dekoration (76.5) @sv
alternative label: Dekorationsmålning (76.5) @sv
alternative label: Dekorationsstilar, dekorativ konst (76.5) @sv
alternative label: Dekorativ konst (76.5) @sv
alternative label: Joulukoristeet, koristetaide (76.5)
alternative label: Julprydnader, dekorativ konst (76.5) @sv
alternative label: Koristeet, koristetaide (76.5)
alternative label: Koristekuviot, koristetaide (76.5)
alternative label: Koristelu (76.5)
alternative label: Koristemaalaus (76.5)
alternative label: Koristemallit, koristetaide (76.5)
alternative label: Koristetaide (76.5)
alternative label: Koristetyylit, koristetaide (76.5)
alternative label: Maalaus, koristemaalaus (76.5)
alternative label: Målning, dekorationsmålning (76.5) @sv
alternative label: Ootraus (76.5)
alternative label: Ornament, dekorativ konst (76.5) @sv
alternative label: Ornamentiikka (76.5)
alternative label: Ornamentik (76.5) @sv
alternative label: Ornamentmönster, dekorativ konst (76.5) @sv
alternative label: Prydnader, dekorativ konst (76.5) @sv
alternative label: Pääsiäiskoristeet, koristetaide (76.5)
alternative label: Påskdekorationer, prydnadskonst (76.5) @sv
alternative label: Sablonimaalaus (76.5)
alternative label: Schablonmålning (76.5) @sv
alternative label: Ådring (76.5) @sv
broader: MUOTOILU. TAIDETEOLLISUUS. TAIDEKÄSITYÖ
in scheme: YKL - Yleisten kirjastojen luokitusjärjestelmä
notation: 76.5
preferred label: Decorative art. Ornamentation @en
preferred label: Ornamentkonst. Ornament @sv
scope note: Hit allmänna verk om ornamentkonst och ornamentik Ornamentmodeller, ornamentmönster och ornamentala stilar i allmänhet Hit också ornamentkonsten och ornamentikens historia och personhistoria Ornamentkonst och prydnadsföremål inom olika områden klassificeras enligt område Formtillägget 09 används inte i samband med klasserna 70-77.4985 @sv
scope note: Tähän koristetaiteen ja ornamentiikan yleisteokset Koristemallit, -kuviot ja -tyylit yleensä Tähän myös koristetaiteen ja ornamentiikan historia ja henkilöhistoria Eri alojen koristetaide ja koriste-esineet luokitetaan alan mukaan Muotoluokkaa 09 ei käytetä luokkien 70-77.4985 yhteydessä

Paperitaide
type: Concept
References: Paperi- ja pahvityöt
References: Taidetaonta. Korutaide
type: YKL-luokka
alternative label: Origamikonst (76.7) @sv
alternative label: Origamitaide (76.7)
alternative label: Paperinleikkaustaide (76.7)
alternative label: Paperintaittelutaide (76.7)
alternative label: Paperitaide (76.7)
alternative label: Pappersklippskonst, konsthantverk (76.7) @sv
alternative label: Papperskonst (76.7) @sv
alternative label: Pappersvikningskonst (76.7) @sv
alternative label: Siluetit, paperitaide (76.7)
alternative label: Siluetter, papperskonst (76.7) @sv
broader: MUOTOILU. TAIDETEOLLISUUS. TAIDEKÄSITYÖ
in scheme: YKL - Yleisten kirjastojen luokitusjärjestelmä
notation: 76.7
preferred label: Paper art @en
preferred label: Papperskonst @sv
scope note: Origami. Silhuettkonst Hit också papperskonstens historia och personhistoria Formtillägget 09 används inte i samband med klasserna 70-77.4985 @sv
scope note: Origamitaide. Siluettitaide Tähän myös paperitaiteen historia ja henkilöhistoria Muotoluokkaa 09 ei käytetä luokkien 70-77.4985 yhteydessä

Antiikkiesineiden keräily
type: Concept
References: Kustannustoiminta. Kirjakauppa
References: Kirkolliset esineet ja symbolit
References: Taidekauppa
References: Keräily
type: YKL-luokka
alternative label: Antiikkiesineet (76.8)
alternative label: Antiikkiesineet, keräily (76.8)
alternative label: Antiikkiliikkeet (76.8)
alternative label: Antikföremål (76.8) @sv
alternative label: Antikföremål, samlande (76.8) @sv
alternative label: Antikvitetsaffärer (76.8) @sv
alternative label: Auktion, antikföremål (76.8) @sv
alternative label: Entistäminen, antiikkiesineet (76.8)
alternative label: Entisöinti, antiikkiesineet (76.8)
alternative label: Handel, antikföremål (76.8) @sv
alternative label: Huutokauppa, antiikkiesineeet (76.8)
alternative label: Kauppa, antiikkiesineet (76.8)
alternative label: Keräily, antiikkiesineet (76.8)
alternative label: Restaurering, antikföremål (76.8) @sv
alternative label: Restaurointi, antiikkiesineet (76.8)
alternative label: Samlarverksamhet, antikföremål (76.8) @sv
broader: MUOTOILU. TAIDETEOLLISUUS. TAIDEKÄSITYÖ
in scheme: YKL - Yleisten kirjastojen luokitusjärjestelmä
notation: 76.8
preferred label: Antikvitetssamlande @sv
preferred label: Collecting antiquities @en
scope note: Allmänna atkvitetshandledningar. Antikviteter, antikvitetssamlande och antikvitetshandel i allmänhet Förvaring, iståndsättande och restaurering av antikviteter i allmänhet Antikvitetsaffärer, antikvitetsauktioner och antikvitetsmässor i allmänhet Antikviteter, antikvitetssamlande och antikvitetshandel inom specialområden klassificeras enligt område @sv
scope note: Yleiset antiikkioppaat. Antiikkiesineet, niiden keräily ja kauppa yleensä Antiikkiesineiden säilytys, kunnostus ja entisöinti yleensä Antiikkiliikkeet, antiikkihuutokaupat ja antiikkimessut yleensä Erikoisalojen antiikkiesineet, niiden keräily ja kauppa alan mukaisessa luokassa

Taideteollisuuden ja taidekäsityön historia
type: Concept
References: Taideteollisuuden ja taidekäsityön historia, Suomi
References: Muoti ja muodin historia
type: YKL-luokka
alternative label: Art nouveau, konstindustri (76.9+) @sv
alternative label: Art nouveau, taideteollisuus (76.9+)
alternative label: Barock, konsthantverk (76.9+) @sv
alternative label: Barokki, taidekäsityö (76.9+)
alternative label: Design, historia (76.9+)
alternative label: Empire, konstindustri (76.9+) @sv
alternative label: Empire-tyyli, taideteollisuus (76.9+)
alternative label: Formgivning, historia (76.9+) @sv
alternative label: Funktionalism, konstindustri (76.9+) @sv
alternative label: Funktionalismi, taideteollisuus (76.9+)
alternative label: Imitationsstilar, konstindustri (76.9+) @sv
alternative label: Jugend, konstindustri (76.9+) @sv
alternative label: Jugend, taideteollisuus (76.9+)
alternative label: Kertaustyylit, taideteollisuus (76.9+)
alternative label: Konstindustri, historia (76.9+) @sv
alternative label: L'art nouveau, konstindustri (76.9+) @sv
alternative label: L'art nouveau, taideteollisuus (76.9+)
alternative label: Modernism, konstindustri (76.9+) @sv
alternative label: Modernismi, taideteollisuus (76.9+)
alternative label: Muotoilu, historia (76.9+)
alternative label: Nyklassicism, konstindustri (76.9+) @sv
alternative label: Postmodernism, konstindustri (76.9+) @sv
alternative label: Postmodernismi, taideteollisuus (76.9+)
alternative label: Rokoko, konsthantverk (76.9+) @sv
alternative label: Rokokoo, taidekäsityö (76.9+)
alternative label: Taideteollisuus, historia (76.9+)
alternative label: Uusklassismi, taideteollisuus (76.9+)
broader: MUOTOILU. TAIDETEOLLISUUS. TAIDEKÄSITYÖ
in scheme: YKL - Yleisten kirjastojen luokitusjärjestelmä
narrower: Taideteollisuuden ja taidekäsityön historia, Suomi
notation: 76.9
preferred label: History of industrial art and art handicraft @en
preferred label: Konstindustrins och konsthantverkets historia @sv
scope note: Hit konstindustrins, den konstindustriella formgivningens och konsthantverkets historia i allmänhet Hit också verk om konstindustri eller konsthantverk eller deras historia i olika världsdelar och länder samt under olika tidsperioden Hit också verk om konstnärer som verkat inom flera konstindustriella områden eller verk om deras produktion Konstindustrins och konsthantverkets historia och personhistoria inom olika områden 76.1-76.7 Formtillägget 09 används inte i samband med klasserna 70-77.4985 @sv
scope note: Tähän taideteollisuuden, taideteollisen muotoilun ja taidekäsityön yleinen historia Tähän myös teokset, jotka koskevat eri maanosien, maiden tai aikakausien taideteollisuutta tai taidekäsitytä tai niiden historiaa sekä teokset, jotka koskevat useilla eri taideteollisuuden aloilla toimineita taiteilijoita tai heidän tuotantoaan Taideteollisuuden ja taidekäsityön eri alojen historia ja henkilöhistoria sijoitetaan luokkiin 76.1-76.7 Muotoluokkaa 09 ei käytetä luokkien 70-77.4985 yhteydessä

Taideteollisuuden ja taidekäsityön historia, Suomi
type: Concept
type: YKL-luokka
alternative label: Design, historia, Finland, allm.. (76.92) @sv
alternative label: Design, historia, Suomi (76.92)
alternative label: Formgivning, historia, Finland (76.92) @sv
alternative label: Konstindustri, historia, Finland (76.92) @sv
alternative label: Muotoilu, historia, Suomi (76.92)
alternative label: Taideteollisuus, historia, Suomi (76.92)
broader: Taideteollisuuden ja taidekäsityön historia
in scheme: YKL - Yleisten kirjastojen luokitusjärjestelmä
notation: 76.92
preferred label: History of industrial art and art handicraft, Finland @en
preferred label: Konstindustrins och konsthantverkets historia, Finland @sv
scope note: Formtillägget 09 används inte i samband med klasserna 70-77.4985 @sv
scope note: Muotoluokkaa 09 ei käytetä luokkien 70-77.4985 yhteydessä

NÄYTTÄMÖTAIDE. ELOKUVATAIDE
type: Concept
References: Näyttämömusiikki
type: YKL-luokka
alternative label: Dramatiikka, näyttämö- ja elokuvataide (77+)
alternative label: Dramatik, scen- och filmkonst (77+) @sv
alternative label: Esitystaiteen tuottajat (77+)
alternative label: Esitystaiteen tuottajat, elämäkerrat ja muistelmat (77+)
alternative label: Konst (70 ... 78+) @sv
alternative label: Konst, olika konstformer (70 ... 78+) @sv
alternative label: Konstformer (70 ... 78+) @sv
alternative label: Näyttämötaide (77+)
alternative label: Producenter av framställningskonst (77+) @sv
alternative label: Producenter av framställningskonst, biografier och memoarer (77+) @sv
alternative label: Scenkonst (77+) @sv
alternative label: Taide, eri taidemuodot (70 ... 78+)
alternative label: Taidemuodot (70 ... 78+)
alternative label: Taiteet (70 ... 78+)
broader: TAITEET. LIIKUNTA
in scheme: YKL - Yleisten kirjastojen luokitusjärjestelmä
narrower: Teatteritaide
narrower: Ilmaisutaito. Puhetaito. Lausuntataide
narrower: Tanssi
narrower: Elokuva. Elokuvataide
notation: 77
preferred label: DRAMATIC ART CINEMATIC ART @en
preferred label: SCENKONST. FILMKONST @sv
scope note: Hit allmänna verk som behandlar både scen- och filmkonst Hit också allmänna verk som behandlar både teater- och danskonst Formtillägget 09 används inte i samband med klasserna 70-77.4985 @sv
scope note: Tähän yleisteokset, jotka koskevat sekä näyttämö- että elokuvataidetta Tähän myös yleisteokset, jotka koskevat sekä teatteri- että tanssitaidetta Muotoluokkaa 09 ei käytetä luokkien 70-77.4985 yhteydessä

Teatteritaide
type: Concept
References: URN:NBN:fi:au:ykl:38.48
References: Keskiasteen koulutus. Toisen asteen koulutus
References: Performanssitaide. Esitystaide
References: Tanssitaide
References: Elokuva. Elokuvataide
References: Näyttämömusiikki
References: NÄYTELMÄT
type: YKL-luokka
alternative label: Arvostelu, teatteri (77.1)
alternative label: Esittävät taiteet, teatteri (77.1+)
alternative label: Esitykset, teatteri (77.1+)
alternative label: Experimentell teater (77.1) @sv
alternative label: Föreställande konst, teater (77.1+) @sv
alternative label: Föreställningar, teater (77.1+) @sv
alternative label: Institutionsteater (77.1) @sv
alternative label: Kokeellinen teatteri (77.1)
alternative label: Komediat, teatteritaiteen tutkimus (77.1+)
alternative label: Komedier, forskning i teaterkonst (77.1+) @sv
alternative label: Kritik, teater (77.1) @sv
alternative label: Laitosteatteri (77.1)
alternative label: Näytelmät, teatteritaide (77.1+)
alternative label: Näyttämötaide, teatteritaide (77.1+)
alternative label: Ohjelmistonsuunnittelu, teatterit (77.1)
alternative label: Programplanering, teater (77.1) @sv
alternative label: Scenkonst, teaterkonst (77.1+) @sv
alternative label: Skådespel, teaterkonst (77.1+) @sv
alternative label: Teater (77.1) @sv
alternative label: Teater (77.1+) @sv
alternative label: Teaterbesök (77.1) @sv
alternative label: Teaterföreställningar, teaterkonst (77.1+) @sv
alternative label: Teaterförvaltning (77.1) @sv
alternative label: Teaterkonst (77.1+) @sv
alternative label: Teaterkritik (77.1) @sv
alternative label: Teaterledning (77.1) @sv
alternative label: Teaterorganisation (77.1) @sv
alternative label: Teaterpsykologi (77.1) @sv
alternative label: Teaterrepertoarer, planering (77.1) @sv
alternative label: Teatersociologi (77.1) @sv
alternative label: Teatteri (77.1)
alternative label: Teatteri (77.1+)
alternative label: Teatteriarvostelu (77.1)
alternative label: Teatteriesitykset, teatteritaide (77.1+)
alternative label: Teatterihallinto (77.1)
alternative label: Teatterinjohto (77.1)
alternative label: Teatteriohjelmistot, suunnittelu (77.1)
alternative label: Teatteriorganisaatio (77.1)
alternative label: Teatteripsykologia (77.1)
alternative label: Teatterisosiologia (77.1)
alternative label: Teatterissakäynti (77.1)
alternative label: Teatteritaide (77.1+)
broader: NÄYTTÄMÖTAIDE. ELOKUVATAIDE
in scheme: YKL - Yleisten kirjastojen luokitusjärjestelmä
narrower: Teatterityö
narrower: Harrastajateatteri
narrower: Lastenteatteri
narrower: Teatterimuodot
narrower: Teatteri- ja näyttämötaiteen historia
notation: 77.1
preferred label: Teaterkonst @sv
preferred label: Theatre @en
scope note: Hit allmänna verk om teaterkonst Teaterkritik Administration och organisation inom teatern samt planering av program och verksamhet Teaterpsykologi. Teatersociologi Formtillägget 09 används inte i samband med klasserna 70-77.4985 @sv
scope note: Tähän teatteritaiteen yleisteokset Teatteriarvostelu Teatterin hallinto ja organisaatio sekä ohjelmiston ja toiminnan suunnittelu Teatteripsykologia. Teatterisosiologia Muotoluokkaa 09 ei käytetä luokkien 70-77.4985 yhteydessä

Teatterityö
type: Concept
References: Ilmaisutaito. Puhetaito. Lausuntataide
References: Tanssitaide
References: Elokuvatekniikka
type: YKL-luokka
alternative label: Dramaturgi, teaterkonst (77.11) @sv
alternative label: Dramaturgia, teatteritaide (77.11)
alternative label: Framställningskonst, teaterskådespelarens arbete (77.11) @sv
alternative label: Fysisk framställning, teaterskådespelarens arbete (77.11) @sv
alternative label: Ilmaisutaito, teatterinäyttelijän työ (77.11)
alternative label: Improvisaatio, teatterinäyttelijän työ (77.11)
alternative label: Improvisation, teaterskådespelarens arbete (77.11) @sv
alternative label: Liikunnallinen ilmaisutaito, teatterinäytt. työ (77.11)
alternative label: Muntlig framställning, teaterskådespelarens arbete (77.11) @sv
alternative label: Näyttelijän työ, teatteritaide (77.11)
alternative label: Ohjaus, teatteritaide (77.11)
alternative label: Puhetaito ja -tekniikka, teatterinäyttelijän työ (77.11)
alternative label: Regi, teaterkonst (77.11) @sv
alternative label: Skådespelarens arbete, teaterkonst (77.11) @sv
alternative label: Suullinen esitystaito, teatterinäyttelijän työ (77.11)
alternative label: Talarkonst och talteknik, teaterskådespelarens arbete (77.11) @sv
alternative label: Teaterarbete (77.11+) @sv
alternative label: Teaterdramaturgi (77.11) @sv
alternative label: Teaterproducenter (77.11+) @sv
alternative label: Teaterregissörens arbete (77.11) @sv
alternative label: Teaterskådespelarens arbete (77.11) @sv
alternative label: Teatteridramaturgia (77.11)
alternative label: Teatterinäyttelijän työ (77.11)
alternative label: Teatteriohjaajan työ (77.11)
alternative label: Teatterituottajat (77.11+)
alternative label: Teatterityö (77.11+)
broader: Teatteritaide
in scheme: YKL - Yleisten kirjastojen luokitusjärjestelmä
narrower: Teatteritekniikka
notation: 77.11
preferred label: Teaterarbete @sv
preferred label: Theatrical work @en
scope note: Näyttelijän työ. Ohjaus. Dramaturgia Suullinen ja liikunnallinen ilmaisutaito ja sen kehittäminen näyttelijän työn kannalta Tiettyä teatterimuotoa koskeva teatterityö ja sen historia sijoitetaan ko. teatterimuodon luokkaan 77.12-77.15+ Yksittäistä näyttelijää, ohjaajaa tai dramaturgia koskevat teokset sijoitetaan luokkaan 77.19+ Jos teos koskee sekä teatterityötä että elokuvan tuottamista, annetaan etusija luokalle 77.11+ Muotoluokkaa 09 ei käytetä luokkien 70-77.4985 yhteydessä
scope note: Skådespelarens arbete. Regi. Dramaturgi Muntlig och fysisk framställning och utvecklandet av dem ur skådespelaryrkets synvinkel Teaterarbete inom en viss form av teater samt dess historia förs till klassen för ifrågavarande teaterform 77.12-77.15+ Verk om enskilda skådespelare, regissörer eller dramaturger förs till klass 77.19 Om verket behandlar både teaterarbete och filmproduktion ges företräde åt klass 77.11+ Formtillägget 09 används inte i samband med klasserna 70-77.4985 @sv

Teatteritekniikka
type: Concept
References: Elokuvatekniikka
type: YKL-luokka
alternative label: Belysning, teaterkonst (77.111) @sv
alternative label: Effekter, teaterteknik (77.111) @sv
alternative label: Erikoistehosteet, teatteritekniikka (77.111)
alternative label: Kläddesign, teaterkostymering (77.111) @sv
alternative label: Kostymering, teaterkonst (77.111) @sv
alternative label: Lavastus, teatteritaide (77.111)
alternative label: Maskeeraus, teatteritaide (77.111)
alternative label: Maskerader, maskering (77.111) @sv
alternative label: Maskering, teaterkonst (77.111) @sv
alternative label: Naamiaiset, maskeeraus (77.111)
alternative label: Naamiointi, teatteritaide (77.111)
alternative label: Puvustus, teatteritaide (77.111)
alternative label: Scenografi, teaterkonst (77.111) @sv
alternative label: Specialeffekter, teaterteknik (77.111) @sv
alternative label: Teaterbelysning (77.111) @sv
alternative label: Teaterkostymering (77.111) @sv
alternative label: Teatermaskering (77.111) @sv
alternative label: Teaterscenografi (77.111) @sv
alternative label: Teaterteknik (77.111) @sv
alternative label: Teatterilavastus (77.111)
alternative label: Teatterinaamiointi (77.111)
alternative label: Teatteripuvustus (77.111)
alternative label: Teatteritekniikka (77.111)
alternative label: Teatterivalaistus (77.111)
alternative label: Tehosteet, teatteritekniikka (77.111)
alternative label: Vaatesuunnittelu, teatteripuvustus (77.111)
alternative label: Valaistus, teatteritaide (77.111)
broader: Teatterityö
in scheme: YKL - Yleisten kirjastojen luokitusjärjestelmä
notation: 77.111
preferred label: Teaterteknik @sv
preferred label: Theatre technique @en
scope note: Lavastus. Valaistus. Puvustus. Naamiointi. Tehosteet Tiettyä teatterimuotoa koskeva teatteritekniikka ja sen historia sijoitetaan ko. teatterimuodon luokkaan 77.12-77.15+ Yksittäistä lavastajaa, valaisijaa, puvustajaa tai naamioijaa koskevat teokset sijoitetaan luokkaan 77.19+ Jos teos koskee sekä teatteri- että elokuvatekniikkaa, annetaan etusija luokalle 77.111 Muotoluokkaa 09 ei käytetä luokkien 70-77.4985 yhteydessä
scope note: Scenografi. Belysning. Kostymering. Maskering. Effekter Teaterteknik inom en viss form av teater och dess historia förs till klassen för ifrågavarande teaterform 77.12-77.15 Verk om enskilda scenografer, belysningsmästare, kostymerare eller maskörer förs till klass 77.19+ Om verket behandlar både teater- och filmteknik, ges företräde åt klass 77.111 Formtillägget 09 används inte i samband med klasserna 70-77.4985 @sv

Harrastajateatteri
type: Concept
References: Lastenteatteri
type: YKL-luokka
alternative label: Amatörscen (77.12) @sv
alternative label: Amatörteater (77.12) @sv
alternative label: Amatörteaterarbete (77.12) @sv
alternative label: Amatööriteatterityö (77.12)
alternative label: Harrastajateatterityö (77.12)
alternative label: Seuranäyttämötyö (77.12)
broader: Teatteritaide
in scheme: YKL - Yleisten kirjastojen luokitusjärjestelmä
notation: 77.12
preferred label: Amateur theatre @en
preferred label: Amatörteater @sv
scope note: Hit oavsett land amatörteaterarbete och sällskapsteaterarbete Hit både praktiska handböcker och amatörteaterns historia Formtillägget 09 används inte i samband med klasserna 70-77.4985 @sv
scope note: Tähän maasta riippumatta harrastajateatteri- ja seuranäyttämötyö Tähän sekä käytännön oppaat että harrastajateatterin historia Muotoluokkaa 09 ei käytetä luokkien 70-77.4985 yhteydessä

Lastenteatteri
type: Concept
References: Harrastajateatteri
type: YKL-luokka
alternative label: Barnkultur, teater (77.14) @sv
alternative label: Barnteaterarbete (77.14) @sv
alternative label: Kouluteatterityö (77.14)
alternative label: Lastenkulttuuri, teatteri (77.14)
alternative label: Lastenteatterityö (77.14)
alternative label: Skolteaterarbete (77.14) @sv
broader: Teatteritaide
in scheme: YKL - Yleisten kirjastojen luokitusjärjestelmä
notation: 77.14
preferred label: Barnteater @sv
preferred label: Children's theatre @en
scope note: Hit oavsett land barn- och skolteaterarbete Hit både praktiska handböcker och barn- och skolteaterns historia Formtillägget 09 används inte i samband med klasserna 70-77.4985 @sv
scope note: Tähän maasta riippumatta lasten- ja kouluteatterityö Tähän sekä käytännön oppaat että lasten- ja kouluteatterin historia Muotoluokkaa 09 ei käytetä luokkien 70-77.4985 yhteydessä

Teatterimuodot
type: Concept
References: Harrastajateatteri
References: Lastenteatteri
References: Tanssitaide
type: YKL-luokka
alternative label: Burlesker (77.15) @sv
alternative label: Burleskit (77.15)
alternative label: Commedia dell'arte (77.15)
alternative label: Drag konstform (77.15) @sv
alternative label: Drag-taidemuoto (77.15)
alternative label: Imitation (77.15) @sv
alternative label: Imitointi (77.15
alternative label: Kabuki-teatteri (77.15)
alternative label: Kabukiteater (77.15) @sv
alternative label: Kirkkonäytelmät, teatterimuodot (77.15)
alternative label: Kyrkospel, teaterformer (77.15) @sv
alternative label: No-teater (77.15) @sv
alternative label: No-teatteri (77.15)
alternative label: Skuggspel (77.15) @sv
alternative label: Stand up -esitykset (77.15)
alternative label: Stand up -komiikka (77.15)
alternative label: Stå-upp-komik (77.15) @sv
alternative label: Stå-upp-shower (77.15) @sv
alternative label: Teaterformer (77.15+) @sv
alternative label: Teaterformer, historia (77.15+) @sv
alternative label: Teaterformer, teknik (77.15+) @sv
alternative label: Teatterimuodot (77.15+)
alternative label: Teatterimuodot, historia (77.15+)
alternative label: Teatterimuodot, tekniikka (77.15+)
alternative label: Varietee (77.15)
alternative label: Varieté (77.15) @sv
alternative label: Varjoteatteri (77.15)
broader: Teatteritaide
in scheme: YKL - Yleisten kirjastojen luokitusjärjestelmä
narrower: Nukketeatteri
narrower: Pantomiimi
narrower: Radio- ja tv-teatteri
narrower: Musiikkiteatteri
notation: 77.15
preferred label: Teaterformer @sv
preferred label: Theatre forms @en
scope note: Hit och till underklasserna oavsett land verk om enskilda teaterformer, deras teknik eller historia Kabukiteater. No-teater Skuggteater. Commedia dell'arte. Burlesker. Stå-upp-komik Formtillägget 09 används inte i samband med klasserna 70-77.4985 @sv
scope note: Tähän ja alaluokkiin maasta riippumatta tiettyä teatterimuotoa, sen tekniikkaa tai historiaa koskevat teokset Kabuki-teatteri. No-teatteri Varjoteatteri. Commedia dell'arte. Burleskit. Stand up -komiikka Muotoluokkaa 09 ei käytetä luokkien 70-77.4985 yhteydessä

Nukketeatteri
type: Concept
References: Leikkikalut
type: YKL-luokka
alternative label: Dockor, dockteater (77.153) @sv
alternative label: Dockteater (77.153) @sv
alternative label: Dockteaterpjäser (77.153) @sv
alternative label: Handdockor, dockteater (77.153) @sv
alternative label: Käsinuket, nukketeatteri (77.153)
alternative label: Marionetteater (77.153) @sv
alternative label: Marionettiteatteri (77.153)
alternative label: Nuket, nukketeatteri (77.153)
alternative label: Nukketeatteri (77.153)
alternative label: Nukketeatterinäytelmät (77.153)
broader: Teatterimuodot
in scheme: YKL - Yleisten kirjastojen luokitusjärjestelmä
notation: 77.153
preferred label: Dockteater @sv
preferred label: Puppet theatre @en
scope note: Dockteaterteknik och dockteaterns historia Dockteaterhandböcker Hit också dockteaterskådespel Formtillägget 09 används inte i samband med klasserna 70-77.4985 @sv
scope note: Nukketeatterin tekniikka ja historia Nukketeatterioppaat Tähän myös nukketeatterinäytelmät Muotoluokkaa 09 ei käytetä luokkien 70-77.4985 yhteydessä

Pantomiimi
type: Concept
type: YKL-luokka
alternative label: Koreografi, pantomim (77.155) @sv
alternative label: Koreografia, pantomiimi (77.155)
alternative label: Pantomiimiteatteri (77.155)
alternative label: Pantomimteater (77.155) @sv
broader: Teatterimuodot
in scheme: YKL - Yleisten kirjastojen luokitusjärjestelmä
notation: 77.155
preferred label: Pantomim @sv
preferred label: Pantomime @en
scope note: Pantomiimin tekniikka, koreografia ja historia Pantomiimimusiikki luokitetaan soitinnuksen mukaiseen luokkaan 78+ Muotoluokkaa 09 ei käytetä luokkien 70-77.4985 yhteydessä
scope note: Pantomimens teknik, koreografi och historia Pantomimmusik klassificeras enligt instrumenteringens klass 78+ Formtillägget 09 används inte i samband med klasserna 70-77.4985 @sv

Radio- ja tv-teatteri
type: Concept
References: Näyttämömusiikki
References: NÄYTELMÄT
type: YKL-luokka
alternative label: Hörspel, radioteater (77.156) @sv
alternative label: Hörspelskonst (77.156) @sv
alternative label: Kuunnelmat, radioteatteri (77.156)
alternative label: Kuunnelmataide (77.156)
alternative label: Radio-ohjelmat, kuunnelmataiteen tutkimus (77.156)
alternative label: Radioprogram, forskning i hörspel (77.156) @sv
alternative label: Radioteater (77.156) @sv
alternative label: Radioteatteri (77.156)
alternative label: TV-teater (77.156) @sv
alternative label: Televisioteatteri (77.156)
broader: Teatterimuodot
in scheme: YKL - Yleisten kirjastojen luokitusjärjestelmä
notation: 77.156
preferred label: Radio and television theatre @en
preferred label: Radio- och TV-teater @sv
scope note: Radio- ja tv-teatterin tekniikka ja historia Kuunnelmataide Muotoluokkaa 09 ei käytetä luokkien 70-77.4985 yhteydessä
scope note: Radio- och TV-teaterns teknik och historia Hörspelskonst Formtillägget 09 används inte i samband med klasserna 70-77.4985 @sv

Musiikkiteatteri
type: Concept
References: Tanssitaide
References: Oopperat
References: Operetit. Musikaalit. Musiikkinäytelmät
References: Kabaree. Revyy
References: Julkiset huvit
type: YKL-luokka
alternative label: Musiikkiteatteri (77.157)
alternative label: Musikteater (77.157) @sv
broader: Teatterimuodot
in scheme: YKL - Yleisten kirjastojen luokitusjärjestelmä
notation: 77.157
preferred label: Music theatre @en
preferred label: Musikteater @sv
scope note: Musiikkiteatteri, sen tekniikka ja historia teatteritaiteen kannalta Muotoluokkaa 09 ei käytetä luokkien 70-77.4985 yhteydessä
scope note: Musikteater, musikteaterteknik och musikteaterhistoria ur scenkonstens synvinkel Formtillägget 09 används inte i samband med klasserna 70-77.4985 @sv

Teatteri- ja näyttämötaiteen historia
type: Concept
References: Ilmaisutaito. Puhetaito. Lausuntataide
References: Tanssitaide
References: Elokuvan historia. Televisio-ohjelmien historia
type: YKL-luokka
alternative label: Antiikki, teatteri (77.19)
alternative label: Antiken, teater (77.19) @sv
alternative label: Drag-artistit, muistelmat (77.19+)
alternative label: Drag-queenit, muistelmat (77.19+)
alternative label: Drag-taiteilijat, muistelmat (77.19+)
alternative label: Dragartister, memoarer (77.19+) @sv
alternative label: Dragdrottningar, memoarer (77.19+) @sv
alternative label: Dragqueens, memoarer (77.19+) @sv
alternative label: Dragshowartister, memoarer (77.19+) @sv
alternative label: Näyttelijät, teatteritaide, henkilöhistoria (77.19+)
alternative label: Näyttämötaide, historia (77.19+)
alternative label: Ohjaajat, teatteritaide, henkilöhistoria (77.19+)
alternative label: Regissörer, teaterkonst, personhistoria (77.19+) @sv
alternative label: Scenkonst, historia (77.19+) @sv
alternative label: Skådespelare, teaterkonst, personhistoria (77.19+) @sv
alternative label: Stand up –koomikot, muistelmat (77.19+)
alternative label: Ståuppkomiker, memoarer (77.19) @sv
alternative label: Teaterhistoria (77.19+) @sv
alternative label: Teaterhus, teaterhistoria (77.19+) @sv
alternative label: Teaterkonst, historia (77.19+) @sv
alternative label: Teaterproducenter, biografier och memoarer (77.19+) @sv
alternative label: Teaterregissörer, biografier och memoarer (77.19+) @sv
alternative label: Teaterskådespelare, biografier och memoarer (77.19+) @sv
alternative label: Teatterihistoria (77.19+)
alternative label: Teatterinäyttelijät, elämäkerrat ja muistelmat (77.19+)
alternative label: Teatteriohjaajat, elämäkerrat ja muistelmat (77.19+)
alternative label: Teatteritaide, historia (77.19+)
alternative label: Teatteritalot, teatterihistoria (77.19+)
alternative label: Teatterituottajat, elämäkerrat ja muistelmat (77.19+)
broader: Teatteritaide
in scheme: YKL - Yleisten kirjastojen luokitusjärjestelmä
narrower: Teatteri- ja näyttämötaiteen historia, Suomi
narrower: Teatteri- ja näyttämötaiteen historia, Pohjoismaat
narrower: Teatteri- ja näyttämötaiteen historia, Keski-Eurooppa
narrower: Teatteri- ja näyttämötaiteen historia, Iso-Britannia. Irlanti
narrower: Teatteri- ja näyttämötaiteen historia, Etelä-Eurooppa
narrower: Teatteri- ja näyttämötaiteen historia, Itä-Eurooppa
narrower: Teatteri- ja näyttämötaiteen historia, Aasia
narrower: Teatteri- ja näyttämötaiteen historia, Afrikka
narrower: Teatteri- ja näyttämötaiteen historia, Amerikka
narrower: Teatteri- ja näyttämötaiteen historia, Australia ja Oseania
notation: 77.19
preferred label: History of theatre and dramatic art @en
preferred label: Teater- och scenkonstens historia @sv
scope note: Hit allmänna verk om teater- och scenkonstens historia Hit också allmänna verk om teaterhistoria Hit och till underklasserna också verk som behandlar teater- och scenkonsten eller dess historia i olika världsdelar eller länder Hit allmänna verk om den europeiska teater- och scenkonstens historia Hit och till underklasserna också verk om enskilda teaterkonstnärer eller deras arbete Konstnärens land bestäms enligt det land där han eller hon haft sin huvudsakliga konstnärsbana Om personen är lika känd för sin verksamhet både inom teater och film, ges företräde åt klass 77.49+ Teaterkonstens historia inom olika teaterformer 77.12-77.15+ Formtillägget 09 används inte i samband med klasserna 70-77.4985 @sv
scope note: Tähän teatteri- ja näyttämötaiteen historian yleisteokset Tähän myös teatterihistorian yleisteokset Tähän ja alaluokkiin myös teokset, jotka koskevat eri maanosien tai maiden teatteri- ja näyttämötaidetta tai sen historiaa Tähän Euroopan teatteri- ja näyttämötaiteen historian yleisteokset Tähän ja alaluokkiin myös teokset, jotka koskevat yksittäisiä teatteritaiteen edustajia tai heidän työtään Taiteilijan maa määräytyy sen mukaan, missä hän on tehnyt keskeisen uransa Jos henkilö on yhtä tunnettu toiminnastaan sekä teatterissa että elokuvassa, annetaan etusija luokalle 77.49+ Teatteritaiteen eri alojen historia sijoitetaan luokkiin 77.12-77.15+ Muotoluokkaa 09 ei käytetä luokkien 70-77.4985 yhteydessä

Teatteri- ja näyttämötaiteen historia, Suomi
type: Concept
type: YKL-luokka
alternative label: Näyttämötaide, historia, Suomi (77.192)
alternative label: Scenkonst, historia, Finland (77.192) @sv
alternative label: Teaterhistoria, Finland (77.192) @sv
alternative label: Teaterkonst, historia, Finland (77.192) @sv
alternative label: Teatterihistoria, Suomi (77.192)
alternative label: Teatteritaide, historia, Suomi (77.192)
broader: Teatteri- ja näyttämötaiteen historia
in scheme: YKL - Yleisten kirjastojen luokitusjärjestelmä
notation: 77.192
preferred label: History of theatre and dramatic art, Finland @en
preferred label: Teater- och scenkonstens historia, Finland @sv

Teatteri- ja näyttämötaiteen historia, Pohjoismaat
type: Concept
type: YKL-luokka
broader: Teatteri- ja näyttämötaiteen historia
in scheme: YKL - Yleisten kirjastojen luokitusjärjestelmä
notation: 77.193
preferred label: History of theatre and dramatic art, Nordic countries @en
preferred label: Teater- och scenkonstens historia, Norden @sv
scope note: Danmark. Island. Norge. Sverige Hit också Färöarna och Grönland Hit också verk som behandlar flera nordiska länder, även Finland @sv
scope note: Islanti. Norja. Ruotsi. Tanska Tähän myös Fär-saaret ja Grönlanti Tähän myös teokset, jotka koskevat useampia Pohjoismaita, myös Suomea

Teatteri- ja näyttämötaiteen historia, Keski-Eurooppa
type: Concept
type: YKL-luokka
broader: Teatteri- ja näyttämötaiteen historia
in scheme: YKL - Yleisten kirjastojen luokitusjärjestelmä
narrower: Teatteri- ja näyttämötaiteen historia, Saksa
notation: 77.194
preferred label: History of theatre and dramatic art, Central Europe @en
preferred label: Teater- och scenkonstens historia, Mellaneuropa @sv
scope note: Alankomaat. Belgia. Itävalta. Liechtenstein. Luxemburg. Slovakia. Sveitsi. Tsekki. Unkari
scope note: Belgien. Liechtenstein. Luxemburg. Nederländerna. Schweiz. Slovakien. Tjeckien. Ungern. Österrike @sv

Teatteri- ja näyttämötaiteen historia, Saksa
type: Concept
type: YKL-luokka
broader: Teatteri- ja näyttämötaiteen historia, Keski-Eurooppa
in scheme: YKL - Yleisten kirjastojen luokitusjärjestelmä
notation: 77.1941
preferred label: History of theatre and dramatic art, Germany @en
preferred label: Teater- och scenkonstens historia, Tyskland @sv

Teatteri- ja näyttämötaiteen historia, Iso-Britannia. Irlanti
type: Concept
type: YKL-luokka
broader: Teatteri- ja näyttämötaiteen historia
in scheme: YKL - Yleisten kirjastojen luokitusjärjestelmä
notation: 77.195
preferred label: History of theatre and dramatic art, Storbritannien. Irland @en
preferred label: Teater- och scenkonstens historia, Great Britain. Ireland @sv

Teatteri- ja näyttämötaiteen historia, Etelä-Eurooppa
type: Concept
type: YKL-luokka
broader: Teatteri- ja näyttämötaiteen historia
in scheme: YKL - Yleisten kirjastojen luokitusjärjestelmä
narrower: Teatteri- ja näyttämötaiteen historia, Ranska
narrower: Teatteri- ja näyttämötaiteen historia, Italia
narrower: Teatteri- ja näyttämötaiteen historia, Espanja
notation: 77.196
preferred label: History of theatre and dramatic art, Southern Europe @en
preferred label: Teater- och scenkonstens historia, Sydeuropa @sv
scope note: Albania. Bosnia ja Hertsegovina. Bulgaria. Kreikka. Kroatia. Makedonia. Malta. Portugali. Romania. Serbia ja Montenegro. Slovenia
scope note: Albanien. Bosnien-Hercegovina. Bulgarien. Grekland. Kroatien. Makedonien. Malta. Portugal. Rumänien. Serbien och Montenegro. Slovenien @sv

Teatteri- ja näyttämötaiteen historia, Ranska
type: Concept
type: YKL-luokka
broader: Teatteri- ja näyttämötaiteen historia, Etelä-Eurooppa
in scheme: YKL - Yleisten kirjastojen luokitusjärjestelmä
notation: 77.1961
preferred label: History of theatre and dramatic art,France @en
preferred label: Teater- och scenkonstens historia, Frankrike @sv
scope note: Hit också Monaco @sv
scope note: Tähän myös Monaco

Teatteri- ja näyttämötaiteen historia, Italia
type: Concept
type: YKL-luokka
broader: Teatteri- ja näyttämötaiteen historia, Etelä-Eurooppa
in scheme: YKL - Yleisten kirjastojen luokitusjärjestelmä
notation: 77.1962
preferred label: History of theatre and dramatic art, Italy @en
preferred label: Teater- och scenkonstens historia, Italien @sv
scope note: Hit också San Marino och Vatikanstaten @sv
scope note: Tähän myös San Marino ja Vatikaanivaltio

Teatteri- ja näyttämötaiteen historia, Espanja
type: Concept
type: YKL-luokka
broader: Teatteri- ja näyttämötaiteen historia, Etelä-Eurooppa
in scheme: YKL - Yleisten kirjastojen luokitusjärjestelmä
notation: 77.1963
preferred label: History of theatre and dramatic art, Spain @en
preferred label: Teater- och scenkonstens historia, Spanien @sv
scope note: Hit också Andorra @sv
scope note: Tähän myös Andorra

Teatteri- ja näyttämötaiteen historia, Itä-Eurooppa
type: Concept
type: YKL-luokka
broader: Teatteri- ja näyttämötaiteen historia
in scheme: YKL - Yleisten kirjastojen luokitusjärjestelmä
narrower: Teatteri- ja näyttämötaiteen historia, Venäjä. Ukraina. Valko-Venäjä. Moldova
notation: 77.197
preferred label: History of theatre and dramatic art, Eastern Europe @en
preferred label: Teater- och scenkonstens historia, Östeuropa @sv
scope note: Estland. Lettland. Litauen. Polen @sv
scope note: Latvia. Liettua. Puola. Viro

Teatteri- ja näyttämötaiteen historia, Venäjä. Ukraina. Valko-Venäjä. Moldova
type: Concept
type: YKL-luokka
broader: Teatteri- ja näyttämötaiteen historia, Itä-Eurooppa
in scheme: YKL - Yleisten kirjastojen luokitusjärjestelmä
notation: 77.1971
preferred label: History of theatre and dramatic art, Russia. Ukraine. Belarus. Moldova @en
preferred label: Teater- och scenkonstens historia, Ryssland. Ukraina. Vitryssland. Moldova @sv

Teatteri- ja näyttämötaiteen historia, Aasia
type: Concept
References: Teatterimuodot
type: YKL-luokka
broader: Teatteri- ja näyttämötaiteen historia
in scheme: YKL - Yleisten kirjastojen luokitusjärjestelmä
notation: 77.1981
preferred label: History of theatre and dramatic art, Asia @en
preferred label: Teater- och scenkonstens historia, Asien @sv
scope note: Hit också österländsk teater- och scenkonst @sv
scope note: Tähän myös itämainen teatteri- ja näyttämötaide

Teatteri- ja näyttämötaiteen historia, Afrikka
type: Concept
type: YKL-luokka
broader: Teatteri- ja näyttämötaiteen historia
in scheme: YKL - Yleisten kirjastojen luokitusjärjestelmä
notation: 77.1982
preferred label: History of theatre and dramatic art, Africa @en
preferred label: Teater- och scenkonstens historia, Afrika @sv

Teatteri- ja näyttämötaiteen historia, Amerikka
type: Concept
type: YKL-luokka
broader: Teatteri- ja näyttämötaiteen historia
in scheme: YKL - Yleisten kirjastojen luokitusjärjestelmä
notation: 77.1983
preferred label: History of theatre and dramatic art, America @en
preferred label: Teater- och scenkonstens historia, Amerika @sv

Teatteri- ja näyttämötaiteen historia, Australia ja Oseania
type: Concept
type: YKL-luokka
broader: Teatteri- ja näyttämötaiteen historia
in scheme: YKL - Yleisten kirjastojen luokitusjärjestelmä
notation: 77.1985
preferred label: History of theatre and dramatic art, Australia and Oceania @en
preferred label: Teater- och scenkonstens historia, Australien och Oceanien @sv

Ilmaisutaito. Puhetaito. Lausuntataide
type: Concept
References: Radio- ja televisiotoiminta
References: Kansalaistoiminta ja –aktivismi. Järjestötoiminta. Kokoustekniikka.
References: Erityisopetus. Erityiskasvatus, luku-, kirjoitus- ja puhehäiriöiset
References: Teatterityö
References: Tanssi
References: Elokuvatekniikka
type: YKL-luokka
alternative label: Debatt, talarkonst (77.2) @sv
alternative label: Esiintymistaito (77.2)
alternative label: Eurytmi (77.2) @sv
alternative label: Eurytmia (77.2)
alternative label: Framställningskonst (77.2) @sv
alternative label: Fysisk framställning (77.2) @sv
alternative label: Ilmaisutaito (77.2)
alternative label: Improvisaatio, ilmaisu- ja puhetaito (77.2)
alternative label: Improvisation, framställningskonst och retorik (77.2) @sv
alternative label: Konsten att uppträda (77.2) @sv
alternative label: Kuorolausunta (77.2)
alternative label: Körrecitation (77.2) @sv
alternative label: Lausuntataide (77.2)
alternative label: Liikunnallinen ilmaisutaito (77.2)
alternative label: Logonomi (77.2) @sv
alternative label: Logonomia (77.2)
alternative label: Muntlig framställning (77.2) @sv
alternative label: Näyttämötaide, lausuntataide (77.2)
alternative label: Puheet, puhetaito (77.2)
alternative label: Puheoppi (77.2)
alternative label: Puhetaito ja -tekniikka (77.2)
alternative label: Puheviestintä (77.2)
alternative label: Recitation (77.2) @sv
alternative label: Recitationskonst (77.2) @sv
alternative label: Retoriikka (77.2)
alternative label: Retorik (77.2) @sv
alternative label: Runonlausunta (77.2)
alternative label: Röstteknik (77.2) @sv
alternative label: Röstteknik, talarkonst (77.2) @sv
alternative label: Röstvård (77.2) @sv
alternative label: Röstvård, talarkonst (77.2) @sv
alternative label: Scenkonst, recitationskonst (77.2) @sv
alternative label: Suullinen esitystaito (77.2)
alternative label: Tal, talarkonst (77.2) @sv
alternative label: Talarkonst och talteknik (77.2) @sv
alternative label: Talkommunikation (77.2) @sv
alternative label: Talteknik (77.2) @sv
alternative label: Tonbildning, talarkonst (77.2) @sv
alternative label: Väittely, puhetaito (77.2)
alternative label: Äänenhuolto (77.2)
alternative label: Äänenhuolto, puhetaito (77.2)
alternative label: Äänenkäyttö (77.2)
alternative label: Äänenkäyttö, puhetaito (77.2)
alternative label: Äänenmuodostus, puhetaito (77.2)
broader: NÄYTTÄMÖTAIDE. ELOKUVATAIDE
in scheme: YKL - Yleisten kirjastojen luokitusjärjestelmä
notation: 77.2
preferred label: Art of expression. Rhetoric. Elocution @en
preferred label: Talarkonst. Retorik. Recitation @sv
scope note: Hit muntlig och fysisk framställning i allmänhet Hit också allmänna verk om logopedi och muntlig kommunikation Röstteknik i allmänhet Improvisationsövningar i talarkonst, retorik och konsten att uppträda Hit också eurytmi Om verket innehåller både muntlig framställning och förhandlingskonst, ges företräde åt klass 30.7 Formtillägget 09 används inte i samband med klasserna 70-77.4985 @sv
scope note: Tähän suullinen ja liikunnallinen ilmaisu- ja esiintymistaito yleensä Tähän myös puheopin ja puheviestinnän yleisteokset Äänenkäyttö yleensä Ilmaisu-, esiintymis- ja puhetaitoon liittyvät improvisaatioharjoitukset Tähän myös eurytmia Jos teoksessa on sekä puhe- että neuvottelutaitoa, annetaan etusija luokalle 30.7 Muotoluokkaa 09 ei käytetä luokkien 70-77.4985 yhteydessä

Tanssi
type: Concept
References: MUSIIKKI
type: YKL-luokka
alternative label: Dans (77.3+) @sv
alternative label: Dansare, biografier och memoarer (77.3+) @sv
alternative label: Danshandböcker (77.3+) @sv
alternative label: Esittävät taiteet, tanssi (77.3+)
alternative label: Esitykset, tanssi (77.3+)
alternative label: Framställningskonst, dans (77.3+) @sv
alternative label: Fysisk framställning, dans (77.3+) @sv
alternative label: Föreställande konst, dans (77.3+) @sv
alternative label: Föreställningar, dans (77.3+) @sv
alternative label: Ilmaisutaito, tanssi (77.3+)
alternative label: Improvisaatio, tanssi (77.3+)
alternative label: Improvisation, dans (77.3+) @sv
alternative label: Liikunnallinen ilmaisutaito, tanssi (77.3+)
alternative label: Musiikkiliikunta, tanssi (77.3+)
alternative label: Musikgymnastik, dans (77.3+) @sv
alternative label: Tanssi (77.3+)
alternative label: Tanssijat, elämäkerrat ja muistelmat (77.3+)
alternative label: Tanssioppaat (77.3+)
broader: NÄYTTÄMÖTAIDE. ELOKUVATAIDE
in scheme: YKL - Yleisten kirjastojen luokitusjärjestelmä
narrower: Tanssitaide
narrower: Seuratanssit. Tanssiurheilu
narrower: Kansantanssit. Kansantanhut
notation: 77.3
preferred label: Dance @en
preferred label: Dans @sv
scope note: Hit allmänna verk om dans Hit och till underklasserna också upptagningar av dansföreställningar som innehåller både ljud och bild Musik till dansföreställningar klassificeras efter instrumenteringens klass 78+ Formtillägget 09 används inte i samband med klasserna 70-77.4985 @sv
scope note: Tähän tanssin yleisteokset Tähän ja alaluokkiin myös tanssiesitysten tallenteet, jotka sisältävät sekä kuvan että äänen Tanssiesityksiin liittyvä musiikki luokitetaan soitinnuksen mukaiseen luokkaan 78+ Muotoluokkaa 09 ei käytetä luokkien 70-77.4985 yhteydessä

Tanssitaide
type: Concept
References: Pantomiimi
type: YKL-luokka
alternative label: Balett, danskonst (77.32) @sv
alternative label: Balett, som danskonst och allkonstverk (77.32) @sv
alternative label: Balettföreställningar, inspelningar (77.32) @sv
alternative label: Baletti, tanssitaide (77.32)
alternative label: Baletti, tanssitaiteena ja kokonaistaideteoksena (77.32)
alternative label: Balettiesitykset, taltioinnit (77.32)
alternative label: Break dance, tanssitaide (77.32)
alternative label: Breakdance, danskonst (77.32) @sv
alternative label: Buto, danskonst (77.32) @sv
alternative label: Buto, tanssitaide (77.32)
alternative label: Dans, balett (77.32) @sv
alternative label: Danskonst (77.32) @sv
alternative label: Danskonst, historia (77.32) @sv
alternative label: Danskonst, teknik och koreografi (77.32) @sv
alternative label: Dansstudior, danskonst (77.32) @sv
alternative label: Dansteater (77.32) @sv
alternative label: Experimentell dans (77.32) @sv
alternative label: Gatudans, danskonst (77.32) @sv
alternative label: Hip hop, tanssitaide (77.32)
alternative label: Hiphop, danskonst (77.32) @sv
alternative label: Jazzbalett (77.32) @sv
alternative label: Jazzbaletti (77.32)
alternative label: Katutanssi, tanssitaide (77.32)
alternative label: Klassinen baletti (77.32)
alternative label: Klassisk balett (77.32) @sv
alternative label: Kokeellinen tanssi (77.32)
alternative label: Koreografi (77.32) @sv
alternative label: Koreografi, danskonst (77.32) @sv
alternative label: Koreografia (77.32)
alternative label: Koreografia, tanssitaide (77.32)
alternative label: Magsdans, danskonst (77.32) @sv
alternative label: Modern dans (77.32) @sv
alternative label: Moderni tanssi (77.32)
alternative label: Näyttämötaide, tanssitaide (77.32)
alternative label: Orientalisk dans, danskonst (77.32) @sv
alternative label: Scenkonst, danskonst (77.32) @sv
alternative label: Streetdance, danskonst (77.32) @sv
alternative label: Tanssi, baletti (77.32)
alternative label: Tanssistudiot, tanssitaide (77.32)
alternative label: Tanssitaide (77.32)
alternative label: Tanssitaide, historia (77.32)
alternative label: Tanssitaide, tekniikka ja koreografia (77.32)
alternative label: Tanssiteatteri (77.32)
alternative label: Vatsatanssi, tanssitaide (77.32)
broader: Tanssi
in scheme: YKL - Yleisten kirjastojen luokitusjärjestelmä
notation: 77.32
preferred label: Dance as an art @en
preferred label: Danskonst @sv
scope note: Klassinen baletti. Jazzbaletti. Moderni tanssi. Tanssiteatteri. Buto Tanssitaiteen tekniikka, koreografia, historia ja henkilöhistoria Tähän myös koreografian yleisteokset Balettimusiikki luokitetaan soitinnuksen mukaiseen luokkaan 78+ Muotoluokkaa 09 ei käytetä luokkien 70-77.4985 yhteydessä
scope note: Klassisk balett. Jazzbalett. Modern dans. Dansteater. Buto Dansteaterns teknik, koreografi, historia och personhistoria Hit också allmänna verk om koreografi Musik till dansföreställningar klassificeras efter instrumenteringens klass 78+ Formtillägget 09 används inte i samband med klasserna 70-77.4985 @sv

Seuratanssit. Tanssiurheilu
type: Concept
References: Musiikkikulttuurien sulautumat. Populaarimusiikki
References: Talviurheilu
type: YKL-luokka
alternative label: Break dance, tanssiurheilu (77.37)
alternative label: Breakdance, danssport (77.37) @sv
alternative label: Dans, motion (77.37) @sv
alternative label: Dans, sällskapsdanser (77.37) @sv
alternative label: Dansbanor,dans (77.37) @sv
alternative label: Danssport (77.37) @sv
alternative label: Diskodanser (77.37) @sv
alternative label: Diskon, danskultur (77.37) @sv
alternative label: Diskot, tanssikulttuuri (77.37)
alternative label: Diskotanssit (77.37)
alternative label: Flamenco (77.37)
alternative label: Gamla danser (77.37) @sv
alternative label: Gatudans, danssport (77.37) @sv
alternative label: Hip hop, tanssiurheilu (77.37)
alternative label: Hiphop, danssport (77.37) @sv
alternative label: Itämainen tanssi (77.37)
alternative label: Jive (77.37)
alternative label: Katutanssi, tanssiurheilu (77.37)
alternative label: Koreografi, danssport (77.37) @sv
alternative label: Koreografi, sällskapsdanser (77.37) @sv
alternative label: Koreografia, seuratanssit (77.37)
alternative label: Koreografia, tanssiurheilu (77.37)
alternative label: Latinalaiset tanssit (77.37)
alternative label: Latinamerikanska danser (77.37) @sv
alternative label: Magdanser (77.37) @sv
alternative label: Napatanssit (77.37)
alternative label: Orientalisk dans (77.37) @sv
alternative label: Rumba (77.37)
alternative label: Salongsdanser (77.37) @sv
alternative label: Salonkitanssit (77.37)
alternative label: Samba, dans (77.37) @sv
alternative label: Samba, tanssi (77.37)
alternative label: Seuratanssit (77.37)
alternative label: Standarddanser (77.37) @sv
alternative label: Steppaus (77.37)
alternative label: Steppning (77.37) @sv
alternative label: Streetdance, danssport (77.37) @sv
alternative label: Sällskapsdanser (77.37) @sv
alternative label: Tango (77.37)
alternative label: Tanssi, kuntourheilu (77.37)
alternative label: Tanssi, seuratanssit (77.37)
alternative label: Tanssilavat, tanssi (77.37)
alternative label: Tanssiurheilu (77.37)
alternative label: Vakiotanssit (77.37)
alternative label: Vals, dans (77.37) @sv
alternative label: Valssi (77.37)
alternative label: Vanhat tanssit (77.37)
alternative label: Vatsatanssit (77.37)
broader: Tanssi
in scheme: YKL - Yleisten kirjastojen luokitusjärjestelmä
notation: 77.37
preferred label: Ballroom dances. Dancing @en
preferred label: Sällskapsdans. Danssport @sv
scope note: Seuratanssien ja tanssiurheilun koreografia, historia ja henkilöhistoria Seuratansseja koskevat tanssioppaat Salonkitanssit. Vanhat tanssit Vakiotanssit. Latinalaiset tanssit Discotanssit. Flamenco. Itämainen tanssi. Vatsatanssit Tanssi liikunnan ja urheilun kannalta Muotoluokkaa 09 ei käytetä luokkien 70-77.4985 yhteydessä
scope note: Sällskapsdansernas och danssportens koreografi, historia och personhistoria Handböcker om sällskapsdans Salongsdans. Gamla danser Standarddans. Latinsk dans Discodans. Flamenco. Orientalisk dans. Magdans Dans som motion och sport Formtillägget 09 används inte i samband med klasserna 70-77.4985 @sv

Kansantanssit. Kansantanhut
type: Concept
References: KANSATIEDE. KULTTUURIANTROPOLOGIA
References: Etnomusiikki. Kansanmusiikki
type: YKL-luokka
alternative label: Dans, folkdanser (77.38) @sv
alternative label: Folkdanser (77.38) @sv
alternative label: Folkdanser, som danskonst (77.38) @sv
alternative label: Kansantanhut (77.38)
alternative label: Kansantanhut, tanssitaiteena (77.38)
alternative label: Kansantanssit (77.38)
alternative label: Kansantanssit, tanssitaiteena (77.38)
alternative label: Koreografi, folkdanser (77.38) @sv
alternative label: Koreografia, kansantanssit ja -tanhut (77.38)
alternative label: Piiritanssit, kansantanssit ja -tanhut (77.38)
alternative label: Ringdanser, folkdanser (77.38) @sv
alternative label: Tanssi, kansantanssit ja -tanhut (77.38)
broader: Tanssi
in scheme: YKL - Yleisten kirjastojen luokitusjärjestelmä
notation: 77.38
preferred label: Folk dances. Folk dances @en
preferred label: Folkdans @sv
scope note: Folkdansens koreografi, historia och personhistoria Handböcker om folkdans Formtillägget 09 används inte i samband med klasserna 70-77.4985 @sv
scope note: Kansantanssin koreografia, historia ja henkilöhistoria Kansantansseja ja -tanhuja koskevat tanssioppaat Muotoluokkaa 09 ei käytetä luokkien 70-77.4985 yhteydessä

Elokuva. Elokuvataide
type: Concept
References: Televisiotoiminta
References: UUDET TAIDEMUODOT
References: Elokuva-, televisio- ja videomusiikki
References: KERTOMAKIRJALLISUUS
type: YKL-luokka
alternative label: Arvostelu, elokuva (77.4)
alternative label: Biobesök (77.4) @sv
alternative label: Biografer, filmbranschen (77.4) @sv
alternative label: Elokuva, tuottaminen (77.4)
alternative label: Elokuva-ala (77.4)
alternative label: Elokuva-arvostelu (77.4)
alternative label: Elokuvakasvatus (77.4+)
alternative label: Elokuvataide (77.4+)
alternative label: Elokuvateatterit, elokuva-ala (77.4)
alternative label: Elokuvateollisuus (77.4)
alternative label: Elokuvissakäynti (77.4)
alternative label: Film, produktion (77.4) @sv
alternative label: Filmbranschen (77.4) @sv
alternative label: Filmfostran (77.4+) @sv
alternative label: Filmindustrin (77.4) @sv
alternative label: Filmkonsten (77.4+) @sv
alternative label: Filmrecension (77.4) @sv
alternative label: Kritik, film (77.4) @sv
alternative label: Ohjelmistonsuunnittelu, elokuvateatterit (77.4)
alternative label: Programplanering, biografer (77.4) @sv
alternative label: TV-film, filmkonst (77.4+) @sv
alternative label: TV-film, produktion (77.4) @sv
alternative label: TV-program, forskning i filmkonst (77.4+) @sv
alternative label: Televisio-ohjelmat, elokuvataiteen tutkimus (77.4+)
alternative label: Televisioelokuva, elokuvataide (77.4+)
alternative label: Televisioelokuva, tuottaminen (77.4)
alternative label: Televisiosarjat (77.4+)
alternative label: Tv-serier (77.4+) @sv
broader: NÄYTTÄMÖTAIDE. ELOKUVATAIDE
in scheme: YKL - Yleisten kirjastojen luokitusjärjestelmä
narrower: Elokuvatekniikka
narrower: Elokuvan lajit. Televisiosarjojen lajit
narrower: Elokuvan historia. Televisio-ohjelmien historia
notation: 77.4
preferred label: Cinema. Cinematic art @en
preferred label: Film. Filmkonst @sv
scope note: Hit allmänna verk om filmkonst. Filmproduktion. Filmindustri. Biografverksamhet. Verk om enskilda producenter eller representanter för filmindustrin förs till klass 77.49+. Verk om enskilda filmer eller TV-program förs till klass 77.49+. Film- och videoupptagningar samt upptagningar av TV-program klassificeras enligt område. Filmarkiv 77.4064. Formtillägget 09 används inte i samband med klasserna 70-77.4985 @sv
scope note: Tähän elokuvataiteen yleisteokset. Elokuvan tuottaminen. Elokuvateollisuus. Elokuvateatteritoiminta. Yksittäistä tuottajaa tai elokuvateollisuuden edustajaa koskevat teokset sijoitetaan luokkaan 77.49+. Yksittäistä elokuvaa tai televisio-ohjelmaa koskevat teokset sijoitetaan luokkaan 77.49+. Elokuva- ja videotallenteet sekä televisio-ohjelmatallenteet luokitetaan alan mukaan. Elokuva-arkistot 77.4064. Muotoluokkaa 09 ei käytetä luokkien 70-77.4985 yhteydessä

Elokuvatekniikka
type: Concept
References: Kuvantoistotekniikka. Televisiotekniikka
References: Optiset ja lääketieteelliset laitteet
References: Valokuvauksen tekniikka. Valokuvausoppaat
References: Teatterityö
References: Animaatioelokuva
References: Elokuvan historia. Televisio-ohjelmien historia
alternative label: Belysning, filmkonst (77.41+) @sv
alternative label: Dokumenttielokuva, elokuvatekniikka (77.41+)
alternative label: Dokumentärfilm, filmteknik (77.41+) @sv
alternative label: Dubbning, filmteknik (77.41+) @sv
alternative label: Editointi, elokuvataide (77.41+)
alternative label: Effekter, filmteknik (77.41+) @sv
alternative label: Elokuva, tekniikka (77.41+)
alternative label: Elokuvaesitykset, tekniikka (77.41+)
alternative label: Elokuvakäsikirjoitukset, laatiminen (77.41+)
alternative label: Elokuvanäyttelijän työ (77.41+)
alternative label: Elokuvaohjaajan työ (77.41+)
alternative label: Elokuvatekniikka (77.41+)
alternative label: Elokuvaus, tekniikka (77.41+)
alternative label: Erikoistehosteet, elokuvatekniikka (77.41+)
alternative label: Film, teknik (77.41+) @sv
alternative label: Filmer, filmningens teknik (77.41+) @sv
alternative label: Filmförevisningar, teknik (77.41+) @sv
alternative label: Filmit, elokuvauksen tekniikka (77.41+)
alternative label: Filmmanuskript, författande (77.41+) @sv
alternative label: Filmning, teknik (77.41+) @sv
alternative label: Filmregissörens arbete (77.41+) @sv
alternative label: Filmskådespelarens arbete (77.41+) @sv
alternative label: Filmteknik (77.41+) @sv
alternative label: Framställningskonst, filmskådespelarens arbete (77.41+) @sv
alternative label: Fysisk framställning, filmskådespelarens arbete (77.41+) @sv
alternative label: Ilmaisutaito, elokuvanäyttelijän työ (77.41+)
alternative label: Improvisaatio, elokuvanäyttelijän työ (77.41+)
alternative label: Improvisation, filmskådespelarens arbete (77.41+) @sv
alternative label: Jälkiäänitys, elokuvatekniikka (77.41+)
alternative label: Kameranauhurit, elokuvatekniikka (77.41+)
alternative label: Kameraspelare, filmteknik (77.41+) @sv
alternative label: Kamerat, elokuvauksen tekniikka (77.41+)
alternative label: Kamerat, televisiokuvauksen tekniikka (77.41)
alternative label: Kameror, TV-fotograferingens teknik (77.41) @sv
alternative label: Kameror, filmningens teknik (77.41+) @sv
alternative label: Kläddesign, filmkostymering (77.41) @sv
alternative label: Konservering, filmkonst (77.41+) @sv
alternative label: Konservointi, elokuvataide (77.41+)
alternative label: Kortfilm, teknik (77.41+) @sv
alternative label: Kostymering, filmkonst (77.41+) @sv
alternative label: Kuvanauhat, elokuvatekniikka (77.41+)
alternative label: Käsikirjoitukset, elokuvataide, laadinta (77.41+)
alternative label: Lavastus, elokuvataide (77.41+)
alternative label: Liikunnallinen ilmaisutaito, elokuvanäytt. työ (77.41+)
alternative label: Ljudfilmsteknik (77.41+) @sv
alternative label: Ljudupptagning, filmteknik (77.41+) @sv
alternative label: Lyhytelokuva, tekniikka (77.41+)
alternative label: Maskeeraus, elokuvataide (77.41+)
alternative label: Naamiointi, elokuvataide (77.41+)
alternative label: Näyttelijän työ, elokuvataide (77.41+)
alternative label: Ohjaus, elokuvataide (77.41+)
alternative label: Puhetaito ja -tekniikka, elokuvanäyttelijän työ (77.41+)
alternative label: Puvustus, elokuvataide (77.41+)
alternative label: Sijaisnäyttelijän työ (77.41+)
alternative label: Studiot, elokuvatekniikka (77.41+)
alternative label: Stuntman, elokuvanäyttelijän työ (77.41+)
alternative label: Suullinen esitystaito, elokuvanäyttelijän työ (77.41+)
alternative label: Tehosteet, elokuvatekniikka (77.41+)
alternative label: Tekstitys, elokuvatekniikka (77.41+)
alternative label: Televisioelokuva, tekniikka (77.41)
alternative label: Televisiokamerat, elokuvatekniikka (77.41)
alternative label: Televisiokuvaus, tekniikka (77.41)
alternative label: Trikkikuvaus, elokuvatekniikka (77.41+)
alternative label: Vaatesuunnittelu, elokuvapuvustus (77.41)
alternative label: Valaistus, elokuvataide (77.41+)
alternative label: Äänielokuvatekniikka (77.41+)
alternative label: Äänitys, elokuvatekniikka (77.41+)
broader: Elokuva. Elokuvataide
in scheme: YKL - Yleisten kirjastojen luokitusjärjestelmä
narrower: Video- ja kaitafilmauksen tekniikka
notation: 77.41
scope note: Hit filmteknik och TV-filmteknik Manusförfattande. Regi Filmskådespelarens arbete. Stuntmannens arbete Scenografi. Belysning. Kostymering. Maskering. Tagning. Klippning. Redigering Kameror. Filmer. Specialeffekter. Trickfilmning Filmförevisningsteknik Verk om enskilda manusförfattare, regissörer, skådespelare, scenografer, belysningsmästare, kostymerare, maskerare, fotografer, filmklippare och redigerare förs till klass 77.49+ Om verket innehåller både film- och teaterteknik, ges företräde åt klass 77.111 Formtillägget 09 används inte i samband med klasserna 70-77.4985 @sv
scope note: Tähän elokuvan ja televisioelokuvan tekniikka Käsikirjoituksen laadinta. Ohjaus Elokuvanäyttelijän työ. Sijaisnäyttelijän työ Lavastus. Valaistus. Puvustus. Naamiointi. Kuvaus. Leikkaus. Editointi Kamerat. Filmit. Erikoistehosteet. Trikkikuvaus Elokuvan esitystekniikka Yksittäistä käsikirjoittajaa, ohjaajaa, näyttelijää, lavastajaa, valaisijaa, puvustajaa, naamioijaa, kuvaajaa, leikkaajaa tai editoijaa koskevat teokset sijoitetaan luokkaan 77.49+ Jos teoksessa on sekä elokuva- että teatteritekniikkaa, annetaan etusija luokalle 77.111 Muotoluokkaa 09 ei käytetä luokkien 70-77.4985 yhteydessä

Video- ja kaitafilmauksen tekniikka
type: Concept
References: Kuvantoistotekniikka. Televisiotekniikka
References: UUDET TAIDEMUODOT
References: Elokuvan lajit. Televisiosarjojen lajit
References: Elokuvan historia. Televisio-ohjelmien historia
type: YKL-luokka
alternative label: Editointi, videokuvaus (77.411)
alternative label: Kaitafilmaus, tekniikka ja oppaat (77.411)
alternative label: Kamerat, kaitafilmauksen tekniikka (77.411)
alternative label: Kamerat, videokuvauksen tekniikka (77.411)
alternative label: Kameror, smalfilmningens teknik (77.411) @sv
alternative label: Kameror, videofilmningens teknik (77.411) @sv
alternative label: Mykkäelokuva, tekniikka (77.411)
alternative label: Redigering, videoinspelning (77.411) @sv
alternative label: Smalfilmning, teknik och handböcker (77.411) @sv
alternative label: Stumfilm, teknik (77.411) @sv
alternative label: Videoelokuva, tuottaminen ja tekniikka (77.411)
alternative label: Videofilm, produktion och teknik (77.411) @sv
alternative label: Videofilmning, teknik och handböcker (77.411) @sv
alternative label: Videokamerat, videokuvaus (77.411)
alternative label: Videokameror, videofilmning (77.411) @sv
alternative label: Videokuvaus, tekniikka ja oppaat (77.411)
broader: Elokuvatekniikka
in scheme: YKL - Yleisten kirjastojen luokitusjärjestelmä
notation: 77.411
preferred label: Video and film recording technique @en
preferred label: Video- och smalfilmningsteknik @sv
scope note: Video- ja kaitafilmausoppaat Käsikirjoituksen laadinta, ohjaus, näyttelijän työ, lavastus, valaistus, puvustus, naamiointi, kuvaus, editointi ja leikkaus video- ja kaitafilmauksen kannalta Kamerat, nauhat, filmit, tehosteet ja trikkikuvaus video- ja kaitafilmauksen kannalta Video- ja kaitafilmitallenteet luokitetaan alan mukaan Muotoluokkaa 09 ei käytetä luokkien 70-77.4985 yhteydessä
scope note: Video- och smalfilmningshandböcker Manusförfattande, regi, skådespelarens arbete, scenografi, belysning, kostymering, maskering, tagning, redigering och klippning ur video- och smalfilmningens synvinkel Video- och smalfilmsupptagningar klassificeras enligt område Formtillägget 09 används inte i samband med klasserna 70-77.4985 @sv

Elokuvan lajit. Televisiosarjojen lajit
type: Concept
References: Elokuvatekniikka
References: KERTOMAKIRJALLISUUS
alternative label: Actionfilmer, forskning (77.43+) @sv
alternative label: Barnfilmer, historia och forskning (77.43+) @sv
alternative label: Biografiska filmer, forskning (77.43+) @sv
alternative label: Detektivfilmer, forskning (77.43+) @sv
alternative label: Dokumenttielokuva (77.43)
alternative label: Dokumenttielokuva, historia (77.43)
alternative label: Dokumentärfilm (77.43) @sv
alternative label: Dokumentärfilm, historia (77.43) @sv
alternative label: Elokuva, historia, elokuvalajit (77.43+)
alternative label: Elokuva, lajit (77.43+)
alternative label: Elokuvat, lajit, historia ja tutkimus (77.43+)
alternative label: Elokuvataide, historia, elokuvalajit (77.43+)
alternative label: Elämäkertaelokuvat, tutkimus (77.43+)
alternative label: Eroottiset elokuvat, tutkimus (77.43+)
alternative label: Erotiska filmer, forskning (77.43+) @sv
alternative label: Fantasiaelokuvat, historia ja tutkimus (77.43+)
alternative label: Fantasyfilmer, historia och forskning (77.43+) @sv
alternative label: Film, genrer (77.43+) @sv
alternative label: Film, historia, filmgenrer (77.43+) @sv
alternative label: Filmer, genrer, historia och forskning (77.43+) @sv
alternative label: Filmkonst, historia, filmgenrer (77.43+) @sv
alternative label: Genreforskning, forskning i filmkonst (77.43+) @sv
alternative label: Genretutkimus, elokuvatutkimus (77.43+)
alternative label: Historialliset elokuvat, tutkimus (77.43+)
alternative label: Historiska filmer, forskning (77.43+) @sv
alternative label: Jännityselokuvat, tutkimus (77.43+)
alternative label: Kauhuelokuvat, tutkimus (77.43+)
alternative label: Komediat, elokuvataiteen tutkimus (77.43+)
alternative label: Komedier, forskning i filmkonst (77.43+) @sv
alternative label: Kortfilm, forskning (77.43+) @sv
alternative label: Krigsfilmer, forskning (77.43+) @sv
alternative label: Kriminalfilmer, forskning (77.43+) @sv
alternative label: Kärleksfilmer, forskning (77.43+) @sv
alternative label: Lastenelokuvat, historia ja tutkimus (77.43+)
alternative label: Lyhytelokuva, tutkimus (77.43+)
alternative label: Lännenelokuvat, tutkimus (77.43+)
alternative label: Musiikkielokuvat, fiktiiviset, historia ja tutkimus (77.43+)
alternative label: Musikfilmer, fiktiva, historia och forskning (77.43+) @sv
alternative label: Mykkäelokuva, historia (77.43+)
alternative label: Nuortenelokuvat, historia ja tutkimus (77.43+)
alternative label: Poliisielokuvat, tutkimus (77.43+)
alternative label: Polisfilmer, forskning (77.43+) @sv
alternative label: Pornografi, filmforskning (77.43+) @sv
alternative label: Pornografia, elokuvatutkimus (77.43+)
alternative label: Psykedeelinen elokuva, tutkimus (77.43+)
alternative label: Psykedelisk film, forskning (77.43+) @sv
alternative label: Rakkauselokuvat, tutkimus (77.43+)
alternative label: Religiösa filmer, forskning (77.43+) @sv
alternative label: Rikoselokuvat, tutkimus (77.43+)
alternative label: Romantiska filmer, forskning (77.43+) @sv
alternative label: Romanttiset elokuvat, tutkimus (77.43+)
alternative label: Rysare, filmer, forskning (77.43+) @sv
alternative label: Sagofilmer, forskning (77.43+) @sv
alternative label: Salapoliisielokuvat, tutkimus (77.43+)
alternative label: Satuelokuvat, tutkimus (77.43+)
alternative label: Science fiction, filmforskning (77.43+) @sv
alternative label: Scifi, elokuvatutkimus (77.43+)
alternative label: Scifi, filmforskning (77.43+) @sv
alternative label: Seikkailuelokuvat, tutkimus (77.43+)
alternative label: Seksielokuvat, tutkimus (77.43+)
alternative label: Sexfilmer, forskning (77.43+) @sv
alternative label: Skräckfilmer, forskning (77.43+) @sv
alternative label: Socialt inriktade filmer, forskning (77.43+) @sv
alternative label: Sotaelokuvat, tutkimus (77.43+)
alternative label: Tieteiselokuvat, tutkimus (77.43+)
alternative label: Toimintaelokuvat, tutkimus (77.43+)
alternative label: Underground-elokuva, tutkimus (77.43+)
alternative label: Uskonnolliset elokuvat, tutkimus (77.43+)
alternative label: Viihde-elokuvat, tutkimus (77.43+)
alternative label: Villi länsi, elokuvat, tutkimus (77.43+)
alternative label: Yhteiskunnalliset elokuvat, tutkimus (77.43+)
broader: Elokuva. Elokuvataide
in scheme: YKL - Yleisten kirjastojen luokitusjärjestelmä
narrower: Animaatioelokuva
notation: 77.43
scope note: Hit oavsett land verk som rör en bestämd filmgenre eller dess historia Hit verk om t.ex. skräckfilmer, västernfilmer, krigsfilmer eller science fiction-filmer Hit också verk om t.ex. dramaserier, fantasyserier, historiska TV-serier eller science fiction-serier Hit också verk om t.ex. stumfilmer, kortfilmer eller dokumentärfilmer Verk om enskilda filmproducenter förs till klass 77.49+ Verk om enskilda filmer eller TV-program förs till klass 77.49+ Film- och videoupptagningar klassificeras enligt område Formtillägget 09 används inte i samband med klasserna 70-77.4985 @sv
scope note: Tähän maasta riippumatta teokset, jotka koskevat tiettyä elokuvan tai televisiosarjan lajia tai sen historiaa Tähän esim. kauhuelokuvaa, lännenelokuvaa, sotaelokuvaa tai tieteiselokuvaa koskevat teokset Tähän myös esim. draamasarjoja, fantasiasarjoja, historiallisia televisiosarjoja tai tieteissarjoja koskevat teokset Tähän myös teokset, jotka koskevat esim. mykkäelokuvaa, lyhytelokuvaa tai dokumenttielokuvaa Yksittäistä elokuvantekijää koskevat teokset sijoitetaan luokkaan 77.49+ Yksittäistä elokuvaa tai televisio-ohjelmaa koskevat teokset sijoitetaan luokkaan 77.49+ Elokuva- ja videotallenteet luokitetaan alan mukaan Muotoluokkaa 09 ei käytetä luokkien 70-77.4985 yhteydessä

Animaatioelokuva
type: Concept
References: Piirustuksen tekniikka
References: SARJAKUVAT
References: Sarjakuvien historia ja tutkimus
type: YKL-luokka
alternative label: Animaatioelokuva, historia ja tekniikka (77.433)
alternative label: Animationsfilm, historia och teknik (77.433) @sv
alternative label: Barnfilmer, animationsfilmer, historia och teknik (77.433) @sv
alternative label: Dockfilm, historia och teknik (77.433) @sv
alternative label: Elokuvat, animaatioelokuvat, historia ja tekniikka (77.433)
alternative label: Fantasiaelokuvat, animaatioelokuvat, historia ja tutkimus (77.433)
alternative label: Fantasyfilmer, animationsfilmer, historia och forskning (77.433) @sv
alternative label: Filmer, animationsfilmer, historia och teknik (77.433) @sv
alternative label: Lastenelokuvat, animaatioelokuvat, historia ja tekniikka (77.433)
alternative label: Musiikkielokuvat, animaatioelokuvat, historia ja teknikka (77.433)
alternative label: Musikfilmer, animationsfilmer, historia och teknik (77.433) @sv
alternative label: Nukke-elokuva, historia ja tekniikka (77.433)
alternative label: Nuortenelokuvat, animaatioelokuvat, historia ja tekniikka (77.433)
alternative label: Piirretty elokuva, historia ja tekniikka (77.433)
alternative label: Tecknad film, historia och teknik (77.433) @sv
alternative label: Ungdomsfilmer, animationsfilmer, historia och teknik (77.433) @sv
broader: Elokuvan lajit. Televisiosarjojen lajit
in scheme: YKL - Yleisten kirjastojen luokitusjärjestelmä
notation: 77.433
preferred label: Animation film @en
preferred label: Animationsfilm @sv
scope note: Hit oavsett land animationsfilmens, den tecknade filmens och dockfilmens teknik och historia Verk om enskilda filmproducenter förs till klass 77.49+ Verk om enskilda filmer eller TV-program förs till klass 77.49+ Animationsfilmer samt tecknade filmer och dockfilmer klassificeras enligt område Formtillägget 09 används inte i samband med klasserna 70-77.4985 @sv
scope note: Tähän maasta riippumatta animaatioelokuvan, piirretyn elokuvan ja nukke-elokuvan tekniikka ja historia Animaatioelokuvat sekä piirretyt ja nukke-elokuvat luokitetaan aiheen mukaan Yksittäistä elokuvantekijää koskevat teokset sijoitetaan luokkaan 77.49+ Yksittäistä elokuvaa tai televisio-ohjelmaa koskevat teokset sijoitetaan luokkaan 77.49+ Muotoluokkaa 09 ei käytetä luokkien 70-77.4985 yhteydessä

Elokuvan historia. Televisio-ohjelmien historia
type: Concept
References: Elokuvan lajit. Televisiosarjojen lajit
type: YKL-luokka
alternative label: Dokumenttidraamat, historia ja tutkimus (77.49+)
alternative label: Ekspressionismi, elokuvataide (77.49+)
alternative label: Elokuva, historia (77.49+)
alternative label: Elokuvanäyttelijät, elämäkerrat ja muistelmat (77.49+)
alternative label: Elokuvaohjaajat, elämäkerrat ja muistelmat (77.49+)
alternative label: Elokuvat, historia ja tutkimus (77.49+)
alternative label: Elokuvataide, historia (77.49+)
alternative label: Elokuvatuottajat (77.49+)
alternative label: Elokuvatuottajat, elämäkerrat ja muistelmat (77.49+)
alternative label: Expressionism, filmkonst (77.49+) @sv
alternative label: Fiktiva dokumentärer, historia och forskning (77.49+) @sv
alternative label: Film, historia (77.49+) @sv
alternative label: Filmer, historia och forskning (77.49+) @sv
alternative label: Filmfotografer, personhistoria (77.49+) @sv
alternative label: Filmkonst, historia (77.49+) @sv
alternative label: Filmproducenter (77.49+) @sv
alternative label: Filmproducenter, biografier och memoarer (77.49+) @sv
alternative label: Filmregissörer, biografier och memoarer (77.49+) @sv
alternative label: Filmskådespelare, biografier och memoarer (77.49+) @sv
alternative label: Futurism, filmkonst (77.49+) @sv
alternative label: Futurismi, elokuvataide (77.49+)
alternative label: Kaitafilmit, historia (77.49+)
alternative label: Kuvaajat, elokuva, henkilöhistoria (77.49+)
alternative label: Kuvaajat, televisio, henkilöhistoria (77.49+)
alternative label: Modernism, filmkonst (77.49+) @sv
alternative label: Modernismi, elokuvataide (77.49+)
alternative label: Näytelmäelokuvat, historia (77.49+)
alternative label: Näyttelijät, aikuisviihde (77.49+)
alternative label: Näyttelijät, elokuvataide, henkilöhistoria (77.49+)
alternative label: Näyttelijät, pornografia (77.49+)
alternative label: Näyttelijät, seksielokuvat (77.49+)
alternative label: Näyttelijät, televisioteatteri (77.49+)
alternative label: Ohjaajat, elokuvataide, henkilöhistoria (77.49+)
alternative label: Postmodernism, filmkonst (77.49+) @sv
alternative label: Postmodernismi, elokuvataide (77.49+)
alternative label: Realism, filmkonst (77.49+) @sv
alternative label: Realismi, elokuvataide (77.49+)
alternative label: Regissörer, filmkonst, personhistoria (77.49+) @sv
alternative label: Sijaisnäyttelijät, elämäkerrat ja muistelmat (77.49+)
alternative label: Skådespelare, TV-teater (77.49+) @sv
alternative label: Skådespelare, filmkonst, personhistoria (77.49+) @sv
alternative label: Skådespelare, pornografi (77.49+) @sv
alternative label: Skådespelare, sexfilmer (77.49+) @sv
alternative label: Smalfilmer, historia (77.49+) @sv
alternative label: Socialistisk realism, filmkonst (77.49+) @sv
alternative label: Sosialistinen realismi, elokuvataide (77.49+)
alternative label: Spelfilmer, historia (77.49+) @sv
alternative label: Stand-ins, biografier och memoarer (77.49+) @sv
alternative label: Surrealism, filmkonst (77.49+) @sv
alternative label: Surrealismi, elokuvataide (77.49+)
alternative label: TV-film, historia (77.49+) @sv
alternative label: TV-fotografer, personhistoria (77.49+) @sv
alternative label: TV-program, historia (77.49+) @sv
alternative label: Televisio-ohjelmat, historia (77.49+)
alternative label: Televisioelokuva, historia (77.49+)
alternative label: Videoelokuva, historia (77.49+)
alternative label: Videofilm, historia (77.49+) @sv
broader: Elokuva. Elokuvataide
in scheme: YKL - Yleisten kirjastojen luokitusjärjestelmä
narrower: Elokuvan ja televisio-ohjelmien historia, Suomi
narrower: Elokuvan ja televisio-ohjelmien historia, Pohjoismaat
narrower: Elokuvan ja televisio-ohjelmien historia, Keski-Eurooppa
narrower: Elokuvan ja televisio-ohjelmien historia, Iso-Britannia. Irlanti
narrower: Elokuvan ja televisio-ohjelmien historia, Etelä-Eurooppa
narrower: Elokuvan ja televisio-ohjelmien historia, Itä-Eurooppa
narrower: Elokuvan ja televisio-ohjelmien historia, Aasia
narrower: Elokuvan ja televisio-ohjelmien historia, Afrikka
narrower: Elokuvan ja televisio-ohjelmien historia, Amerikka
narrower: Elokuvan ja televisio-ohjelmien historia, Australia ja Oseania
notation: 77.49
preferred label: Filmens historia. TV-programmens historia @sv
preferred label: History of cinema. History of TV programmes @en
scope note: Hit och till underklasserna allmänna verk om film, filmkonst och TV-program Hit och till underklasserna också verk om filmkonst eller dess historia i olika världsdelar eller länder samt verk om enskilda filmproducenter eller deras produktion Filmkonstnärens (t.ex. regissörens eller manusförfattarens) land bestäms enligt det land där han eller hon haft sin huvudsakliga konstnärsbana Hit och till underklasserna också verk om enskilda filmer eller TV-program Om personen är lika känd för sin verksamhet både inom teater och film och TV, ges företräde åt klass 77.49+ Hit allmänna verk om filmens, filmkonstens och TV-programens historia i Europa Formtillägget 09 används inte i samband med klasserna 70-77.4985 @sv
scope note: Tähän ja alaluokkiin elokuvan, elokuvataiteen ja televisio-ohjelmien historian yleisteokset Tähän ja alaluokkiin myös teokset, jotka koskevat eri maanosien tai maiden elokuvataidetta tai sen historiaa sekä teokset, jotka koskevat yksittäisiä elokuvantekijöitä tai heidän tuotantoaan Elokuvantekijän (esim. ohjaajan tai käsikirjoittajan) maa määräytyy sen mukaan, missä hän on tehnyt keskeisen uransa Tähän ja alaluokkin myös teokset, jotka koskevat yksittäistä elokuvaa tai televisio-ohjelmaa Jos henkilö on yhtä tunnettu toiminnastaan sekä teatterissa että elokuvassa ja televisiossa, annetaan etusija luokalle 77.49+ Tähän Euroopan elokuvan, elokuvataiteen ja TV-ohjelmien historian yleisteokset Muotoluokkaa 09 ei käytetä luokkien 70-77.4985 yhteydessä

Elokuvan ja televisio-ohjelmien historia, Suomi
type: Concept
type: YKL-luokka
alternative label: Elokuva, historia, Suomi (77.492)
alternative label: Elokuvataide, historia, Suomi (77.492)
alternative label: Film, historia, Finland (77.492) @sv
alternative label: Filmkonst, historia, Finland (77.492) @sv
alternative label: TV-film, historia, Finland (77.492) @sv
alternative label: Televisioelokuva, historia, Suomi (77.492)
broader: Elokuvan historia. Televisio-ohjelmien historia
in scheme: YKL - Yleisten kirjastojen luokitusjärjestelmä
notation: 77.492
preferred label: Filmens och TV-programmens historia, Finland @sv
preferred label: History of cinema and TV programmes, Finland @en

Elokuvan ja televisio-ohjelmien historia, Pohjoismaat
type: Concept
type: YKL-luokka
broader: Elokuvan historia. Televisio-ohjelmien historia
in scheme: YKL - Yleisten kirjastojen luokitusjärjestelmä
notation: 77.493
preferred label: Filmens och TV-programmens historia, Norden @sv
preferred label: History of cinema and TV programmes, Nordic countries @en
scope note: Danmark. Island. Norge. Sverige Hit också Färöarna och Grönland Hit också verk som behandlar flera nordiska länder, även Finland @sv
scope note: Islanti. Norja. Ruotsi. Tanska Tähän myös Fär-saaret ja Grönlanti Tähän myös teokset, jotka koskevat useampia Pohjoismaita, myös Suomea

Elokuvan ja televisio-ohjelmien historia, Keski-Eurooppa
type: Concept
type: YKL-luokka
broader: Elokuvan historia. Televisio-ohjelmien historia
in scheme: YKL - Yleisten kirjastojen luokitusjärjestelmä
narrower: Elokuvan ja televisio-ohjelmien historia, Saksa
notation: 77.494
preferred label: Filmens och TV-programmens historia, Mellaneuropa @sv
preferred label: History of cinema and TV programmes, Central Europe @en
scope note: Alankomaat. Belgia. Itävalta. Liechtenstein. Luxemburg. Slovakia. Sveitsi. Tsekki. Unkari
scope note: Belgien. Liechtenstein. Luxemburg. Nederländerna. Schweiz. Slovakien. Tjeckien. Ungern. Österrike @sv

Elokuvan ja televisio-ohjelmien historia, Saksa
type: Concept
type: YKL-luokka
broader: Elokuvan ja televisio-ohjelmien historia, Keski-Eurooppa
in scheme: YKL - Yleisten kirjastojen luokitusjärjestelmä
notation: 77.4941
preferred label: Filmens och TV-programmens historia, Tyskland @sv
preferred label: History of cinema and TV programmes, Germany @en

Elokuvan ja televisio-ohjelmien historia, Iso-Britannia. Irlanti
type: Concept
type: YKL-luokka
broader: Elokuvan historia. Televisio-ohjelmien historia
in scheme: YKL - Yleisten kirjastojen luokitusjärjestelmä
notation: 77.495
preferred label: Filmens och TV-programmens historia, Storbritannien. Irland @sv
preferred label: History of cinema and TV programmes, Great Britain. Ireland @en

Elokuvan ja televisio-ohjelmien historia, Etelä-Eurooppa
type: Concept
type: YKL-luokka
broader: Elokuvan historia. Televisio-ohjelmien historia
in scheme: YKL - Yleisten kirjastojen luokitusjärjestelmä
narrower: Elokuvan ja televisio-ohjelmien historia, Ranska
narrower: Elokuvan ja televisio-ohjelmien historia, Italia
narrower: Elokuvan ja televisio-ohjelmien historia, Espanja
notation: 77.496
preferred label: Filmens och TV-programmens historia, Sydeuropa @sv
preferred label: History of cinema and TV programmes, Southern Europe @en
scope note: Albania. Bosnia ja Hertsegovina. Bulgaria. Kreikka. Kroatia. Makedonia. Malta. Portugali. Romania. Serbia ja Montenegro. Slovenia
scope note: Albanien. Bosnien-Hercegovina. Bulgarien. Grekland. Kroatien. Makedonien. Malta. Portugal. Rumänien. Serbien och Montenegro. Slovenien @sv

Elokuvan ja televisio-ohjelmien historia, Ranska
type: Concept
type: YKL-luokka
broader: Elokuvan ja televisio-ohjelmien historia, Etelä-Eurooppa
in scheme: YKL - Yleisten kirjastojen luokitusjärjestelmä
notation: 77.4961
preferred label: Filmens och TV-programmens historia, Frankrike @sv
preferred label: History of cinema and TV programmes, France @en
scope note: Hit också Monaco @sv
scope note: Tähän myös Monaco

Elokuvan ja televisio-ohjelmien historia, Italia
type: Concept
type: YKL-luokka
broader: Elokuvan ja televisio-ohjelmien historia, Etelä-Eurooppa
in scheme: YKL - Yleisten kirjastojen luokitusjärjestelmä
notation: 77.4962
preferred label: Filmens och TV-programmens historia, Italien @sv
preferred label: History of cinema and TV programmes, Italy @en
scope note: Hit också San Marino och Vatikanstaten @sv
scope note: Tähän myös San Marino ja Vatikaanivaltio

Elokuvan ja televisio-ohjelmien historia, Espanja
type: Concept
type: YKL-luokka
broader: Elokuvan ja televisio-ohjelmien historia, Etelä-Eurooppa
in scheme: YKL - Yleisten kirjastojen luokitusjärjestelmä
notation: 77.4963
preferred label: Filmens och TV-programmens historia, Spanien @sv
preferred label: History of cinema and TV programmes, Spain @en
scope note: Hit också Andorra @sv
scope note: Tähän myös Andorra

Elokuvan ja televisio-ohjelmien historia, Itä-Eurooppa
type: Concept
type: YKL-luokka
broader: Elokuvan historia. Televisio-ohjelmien historia
in scheme: YKL - Yleisten kirjastojen luokitusjärjestelmä
narrower: Elokuvan ja televisio-ohjelmien historia, Venäjä. Ukraina. Valko-Venäjä. Moldova
notation: 77.497
preferred label: Filmens och TV-programmens historia, Östeuropa @sv
preferred label: History of cinema and TV programmes, Eastern Europe @en
scope note: Estland. Lettland. Litauen. Polen @sv
scope note: Latvia. Liettua. Puola. Viro

Elokuvan ja televisio-ohjelmien historia, Venäjä. Ukraina. Valko-Venäjä. Moldova
type: Concept
type: YKL-luokka
broader: Elokuvan ja televisio-ohjelmien historia, Itä-Eurooppa
in scheme: YKL - Yleisten kirjastojen luokitusjärjestelmä
notation: 77.4971
preferred label: Filmens och TV-programmens historia, Ryssland. Ukraina. Vitryssland. Moldova @sv
preferred label: History of cinema and TV programmes, Russia. Ukraine. Belarus. Moldova @en

Elokuvan ja televisio-ohjelmien historia, Aasia
type: Concept
type: YKL-luokka
broader: Elokuvan historia. Televisio-ohjelmien historia
in scheme: YKL - Yleisten kirjastojen luokitusjärjestelmä
notation: 77.4981
preferred label: Filmens och TV-programmens historia, Asien @sv
preferred label: History of cinema and TV programmes, Asia @en

Elokuvan ja televisio-ohjelmien historia, Afrikka
type: Concept
type: YKL-luokka
broader: Elokuvan historia. Televisio-ohjelmien historia
in scheme: YKL - Yleisten kirjastojen luokitusjärjestelmä
notation: 77.4982
preferred label: Filmens och TV-programmens historia, Afrika @sv
preferred label: History of cinema and TV programmes, Africa @en

Elokuvan ja televisio-ohjelmien historia, Amerikka
type: Concept
type: YKL-luokka
alternative label: Hollywood, elokuvan historia (77.4983)
alternative label: Hollywood, filmhistoria (77.4983) @sv
broader: Elokuvan historia. Televisio-ohjelmien historia
in scheme: YKL - Yleisten kirjastojen luokitusjärjestelmä
notation: 77.4983
preferred label: Filmens och TV-programmens historia, Amerika @sv
preferred label: History of cinema and TV programmes, America @en

Elokuvan ja televisio-ohjelmien historia, Australia ja Oseania
type: Concept
type: YKL-luokka
broader: Elokuvan historia. Televisio-ohjelmien historia
in scheme: YKL - Yleisten kirjastojen luokitusjärjestelmä
notation: 77.4985
preferred label: Filmens och TV-programmens historia, Australien och Oceanien @sv
preferred label: History of cinema and TV programmes, Australia and Oceania @en

MUSIIKKI
type: Concept
type: YKL-luokka
alternative label: Esittävät taiteet, musiikki (78+)
alternative label: Esitykset, musiikki (78+)
alternative label: Föreställande konst, musik (78+) @sv
alternative label: Förestälningar, musik (78+) @sv
alternative label: Konst (70 ... 78+) @sv
alternative label: Konst, olika konstformer (70 ... 78+) @sv
alternative label: Konstformer (70 ... 78+) @sv
alternative label: Musiikki (78+)
alternative label: Musiikkiaineisto (78+)
alternative label: Musik (78+) @sv
alternative label: Musikinstrument, allmänna verk (78) @sv
alternative label: Musikmedier (78+) @sv
alternative label: Soittimet, yleisteokset (78)
alternative label: Taide, eri taidemuodot (70 ... 78+)
alternative label: Taidemuodot (70 ... 78+)
alternative label: Taiteet (70 ... 78+)
broader: TAITEET. LIIKUNTA
in scheme: YKL - Yleisten kirjastojen luokitusjärjestelmä
narrower: Musiikin tutkimus
narrower: Musiikin teoria
narrower: Laulumusiikki. Näyttämömusiikki. Liturginen musiikki
narrower: Etnomusiikki. Kansanmusiikki
narrower: Yhtye- ja orkesterimusiikki
narrower: Kosketinsoitinmusiikki. Näppäilysoitinmusiikki
narrower: Jousisoitinmusiikki
narrower: Puhallinsoitinmusiikki. Lyömäsoitinmusiikki. Muilla soittimilla esitetty musiikki. Elektroakustinen musiikki. Musiikkikulttuurien sulautumat. Populaarimusiikki
narrower: Musiikin historia
notation: 78
preferred label: MUSIC @en
preferred label: MUSIK @sv
scope note: Hit sådana omfattande allmänna verk om musik som inte kan klassificeras exaktare (t.ex. allmänna verk om musikinstrument) Allmänna uppslagsverk om musik, även verk om instrument till 78.03, men uppslagsverk inom specialområden till sina egna klasser (t.ex. uppslagsverk om popmusik till klassen 78.89103) En enskild kompositörs produktion som musikalier eller ljudupptagningar till 78.04 Allmänna läromedel i musik till 78.07 @sv
scope note: Tähän sellaiset musiikkia laajasti käsittelevät yleisteokset, joita ei voi sijoittaa täsmällisempään luokkaan (esim. soittimia käsittelevät yleisteokset) Musiikin yleiset hakuteokset, myös soittimia käsittelevät 78.03, mutta erikoisalojen hakuteokset omiin luokkiinsa (esim. popmusiikin hakuteokset luokkaan 78.89103) Yksittäisen säveltäjän tuotanto nuottijulkaisuna tai äänitteenä 78.04 Musiikin yleiset oppimateriaalit 78.07

Musiikin tutkimus
type: Concept
type: YKL-luokka
alternative label: Allmän musikvetenskap (78.1+) @sv
alternative label: Ikonografi, musik (78.1+) @sv
alternative label: Ikonografia, musiikki (78.1+)
alternative label: Instrumenttypologi (78.1) @sv
alternative label: Musiikin arvostelu (78.1+)
alternative label: Musiikin kuuntelu (78.1+)
alternative label: Musiikin tutkimus (78.1+)
alternative label: Musiikkielämän tutkimus (78.1+)
alternative label: Musiikkitiede, yleinen (78.1+)
alternative label: Musik, lyssnande (78.1+) @sv
alternative label: Musikforskning (78.1+) @sv
alternative label: Musikinstrumentsystematik (78.1) @sv
alternative label: Musikkritik (78.1+) @sv
alternative label: Musiklivet, forskning (78.1+) @sv
alternative label: Musikvetenskap, allmän (78.1+) @sv
alternative label: Soitinluokitukset (78.1)
alternative label: Soitintypologia (78.1)
alternative label: Yleinen musiikkitiede (78.1+)
broader: MUSIIKKI
in scheme: YKL - Yleisten kirjastojen luokitusjärjestelmä
narrower: Musiikin filosofia
narrower: Liturgisen musiikin tutkimus
narrower: Musiikin sosiologia
narrower: Etnomusikologia
narrower: Musiikin fysiologian tutkimus
narrower: Musiikkiteollisuus. Musiikkiteknologia
narrower: Musiikin estetiikka
narrower: Populaarimusiikin tutkimus
narrower: Musiikinhistorian tutkimus
notation: 78.1
preferred label: Music research @en
preferred label: Musikforskning @sv
scope note: Allmän musikvetenskap. Klangtypologi (instrumentklassifikation) Hit och till underklasserna forskningar som behandlar musikaliska fenomen med vetenskapliga metoder med undantag av musikens teori 78.2+, musikhistoria 78.9+ och forskningar i en enskild musikform vilka förs till respektive klass (t.ex. forskning i en enskild tonsättares symfonier till 78.54101, men forskning som behandlar tonsättaren som symfoniker till 78.1) Hit och till underklasserna också material som handlar om musiklivet och -organisationer samt musikaliska yrken @sv
scope note: Yleinen musiikkitiede. Sointitypologia (soittimien luokitus) Tähän ja alaluokkiin musiikillisia ilmiöitä tieteellisin menetelmin käsittelevät tutkimukset, paitsi musiikin teoria 78.2+, musiikin historia 78.9+ ja yhtä rajattua musiikin lajia käsittelevät tutkimukset, jotka sijoitetaan ko. luokkaan (esim. tietyn säveltäjän sinfonioita käsittelevä tutkimus 78.54101, mutta ko. säveltäjää sinfonioiden säveltäjänä käsittelevä tutkimus 78.1) Tähän ja alaluokkiin myös musiikkielämää ja -järjestöjä sekä musiikkiammatteja käsittelevä aineisto

Musiikin filosofia
type: Concept
type: YKL-luokka
alternative label: Filosofi, musik (78.11) @sv
alternative label: Filosofia, musiikki (78.11)
alternative label: Musiikin filosofia (78.11)
alternative label: Musiikkifilosofia (78.11)
alternative label: Musikens filosofi (78.11) @sv
alternative label: Musikfilosofi (78.11) @sv
broader: Musiikin tutkimus
in scheme: YKL - Yleisten kirjastojen luokitusjärjestelmä
narrower: Musiikin psykologia
notation: 78.11
preferred label: Musikfilosofi @sv
preferred label: Philosophy of music @en

Musiikin psykologia
type: Concept
type: YKL-luokka
alternative label: Musiikin psykologia (78.114)
alternative label: Musiikkipsykologia (78.114)
alternative label: Musikaalisuus (78.114)
alternative label: Musikalitet (78.114) @sv
alternative label: Musikens psykologi (78.114) @sv
alternative label: Musikpsykologi (78.114) @sv
broader: Musiikin filosofia
in scheme: YKL - Yleisten kirjastojen luokitusjärjestelmä
notation: 78.114
preferred label: Musikpsykologi @sv
preferred label: Psychology of music @en

Liturgisen musiikin tutkimus
type: Concept
type: YKL-luokka
alternative label: Liturginen musiikki, tutkimus (78.12)
alternative label: Liturgisk musik, forskning (78.12) @sv
broader: Musiikin tutkimus
in scheme: YKL - Yleisten kirjastojen luokitusjärjestelmä
notation: 78.12
preferred label: Forskning i liturgisk musik @sv
preferred label: Research on liturgical music @en

Musiikin sosiologia
type: Concept
type: YKL-luokka
alternative label: Musiikin sosiologia (78.13)
alternative label: Musiikkisosiologia (78.13)
alternative label: Musikens sociologi (78.13) @sv
alternative label: Musiksociologi (78.13) @sv
broader: Musiikin tutkimus
in scheme: YKL - Yleisten kirjastojen luokitusjärjestelmä
notation: 78.13
preferred label: Musiksociologi @sv
preferred label: Sociology of music @en

Etnomusikologia
type: Concept
type: YKL-luokka
alternative label: Etnomusikologi (78.14) @sv
alternative label: Etnomusikologia (78.14)
broader: Musiikin tutkimus
in scheme: YKL - Yleisten kirjastojen luokitusjärjestelmä
notation: 78.14
preferred label: Ethnomusicology @en
preferred label: Etnomusikologi @sv

Musiikin fysiologian tutkimus
type: Concept
type: YKL-luokka
alternative label: Musiikin fysiologinen tutkimus (78.15)
alternative label: Musiikki, aistimellisena ilmiönä (78.15)
alternative label: Musiikki, fysikaalisena ilmiönä (78.15)
alternative label: Musik, som fyskaliskt fenomen (78.15) @sv
alternative label: Musik, som sinnesfenomen (78.15) @sv
alternative label: Musikfysiologi, forskning (78.15) @sv
broader: Musiikin tutkimus
in scheme: YKL - Yleisten kirjastojen luokitusjärjestelmä
notation: 78.15
preferred label: Forskning i musikfysiologi @sv
preferred label: Research on musical physiology @en
scope note: Musiikki fysikaalisena ilmiönä. Musiikki aistimellisena ilmiönä
scope note: Musik som fysikaliskt fenomen. Musik som sinnesfenomen @sv

Musiikkiteollisuus. Musiikkiteknologia
type: Concept
References: Kustannustoiminta. Kirjakauppa
References: Äänitekniikka. Radiotekniikka
References: Soitinrakennus
type: YKL-luokka
alternative label: Musiikkiteknologia (78.16)
alternative label: Musiikkiteollisuus (78.16)
alternative label: Musikindustri (78.16) @sv
alternative label: Musikteknologi (78.16) @sv
broader: Musiikin tutkimus
in scheme: YKL - Yleisten kirjastojen luokitusjärjestelmä
notation: 78.16
preferred label: Musical industry. Musical technology @en
preferred label: Musikindustri. Musikteknologi @sv

Musiikin estetiikka
type: Concept
type: YKL-luokka
alternative label: Estetiikka, musiikki (78.17)
alternative label: Estetik, musik (78.17) @sv
alternative label: Musiikin estetiikka (78.17)
alternative label: Musikens estetik (78.17) @sv
broader: Musiikin tutkimus
in scheme: YKL - Yleisten kirjastojen luokitusjärjestelmä
notation: 78.17
preferred label: Aesthetics of music @en
preferred label: Musikestetik @sv

Populaarimusiikin tutkimus
type: Concept
References: Musiikkikulttuurien sulautumat. Populaarimusiikki
type: YKL-luokka
alternative label: Populaarimusiikki, tieteellinen tutkimus (78.18)
alternative label: Populärmusik, vetenskaplig forskning (78.18) @sv
broader: Musiikin tutkimus
in scheme: YKL - Yleisten kirjastojen luokitusjärjestelmä
notation: 78.18
preferred label: Forskning i populärmusik @sv
preferred label: Research on popular music @en
scope note: Hit bara vetenskplig forskning i populärmusik @sv
scope note: Tähän vain poplaarimusiikin tieteellinen tutkimus

Musiikinhistorian tutkimus
type: Concept
References: Musiikin historia
type: YKL-luokka
alternative label: Musiikin historian tutkimus (78.19)
alternative label: Musikhistoria, forskning (78.19) @sv
broader: Musiikin tutkimus
in scheme: YKL - Yleisten kirjastojen luokitusjärjestelmä
notation: 78.19
preferred label: Musikhistorisk forskning @sv
preferred label: Research on the history of music @en

Musiikin teoria
type: Concept
type: YKL-luokka
alternative label: Musiikin teoria (78.2+)
alternative label: Musikteori (78.2+) @sv
alternative label: Teori, musikteori (78.2+) @sv
alternative label: Teoria, musiikin (78.2+)
broader: MUSIIKKI
in scheme: YKL - Yleisten kirjastojen luokitusjärjestelmä
narrower: Rytmioppi
narrower: Säveloppi
narrower: Sointuoppi
narrower: Sävellysoppi
narrower: Muoto-oppi
narrower: Soitinnusoppi
narrower: Notaatio
narrower: Säveltapailu
narrower: Musiikin tulkinta
notation: 78.2
preferred label: Music theory @en
preferred label: Musikteori @sv
scope note: Allmänna verk och verk som behandlar minst två delområden inom teorin Allmänna lärokurser i musikens teori 78.207 @sv
scope note: Yleisteokset ja vähintään kahta teorian osa-aluetta käsittelevät Musiikin teorian yleiset oppimäärät 78.207

Rytmioppi
type: Concept
type: YKL-luokka
alternative label: Rytmioppi (78.21)
alternative label: Rytmlära (78.21) @sv
broader: Musiikin teoria
in scheme: YKL - Yleisten kirjastojen luokitusjärjestelmä
notation: 78.21
preferred label: Rhytmics @en
preferred label: Rytmlära @sv

Säveloppi
type: Concept
type: YKL-luokka
alternative label: Stämningssystem (78.22) @sv
alternative label: Säveljärjestelmät (78.22)
alternative label: Säveloppi (78.22)
alternative label: Tonlära (78.22) @sv
alternative label: Tonsystem (78.22) @sv
alternative label: Viritysjärjestelmät (78.22)
broader: Musiikin teoria
in scheme: YKL - Yleisten kirjastojen luokitusjärjestelmä
notation: 78.22
preferred label: Melodics @en
preferred label: Melodik @sv
scope note: Säveljärjestelmät. Viritysjärjestelmät
scope note: Tonsystem. Stämsystem @sv

Sointuoppi
type: Concept
type: YKL-luokka
alternative label: Harmonianalys (78.23) @sv
alternative label: Harmonilära (78.23) @sv
alternative label: Harmonisering (78.23) @sv
alternative label: Soinnutus (78.23)
alternative label: Sointuanalyysi (78.23)
alternative label: Sointuoppi (78.23)
broader: Musiikin teoria
in scheme: YKL - Yleisten kirjastojen luokitusjärjestelmä
notation: 78.23
preferred label: Harmonics @en
preferred label: Harmonilära @sv
scope note: Harmonisering. Ackordanalys @sv
scope note: Soinnutus. Sointuanalyysi

Sävellysoppi
type: Concept
type: YKL-luokka
alternative label: Affektioppi (78.24)
alternative label: Affektlära (78.24) @sv
alternative label: Datorstödd komposition (78.24) @sv
alternative label: Homofoni (78.24) @sv
alternative label: Homofonia (78.24)
alternative label: Kompositionslära (78.24) @sv
alternative label: Kontrapunkt (78.24) @sv
alternative label: Kontrapunkti (78.24)
alternative label: Polyfoni (78.24) @sv
alternative label: Polyfonia (78.24)
alternative label: Stillära, komposition (78.24) @sv
alternative label: Sävellysoppi (78.24)
alternative label: Tietokoneavusteinen säveltäminen (78.24)
alternative label: Tyylioppi, säveltäminen (78.24)
broader: Musiikin teoria
in scheme: YKL - Yleisten kirjastojen luokitusjärjestelmä
notation: 78.24
preferred label: Composition @en
preferred label: Kompositionslära @sv

Muoto-oppi
type: Concept
type: YKL-luokka
alternative label: Formlära, musikens (78.25) @sv
alternative label: Muoto-oppi, musiikin (78.25)
broader: Musiikin teoria
in scheme: YKL - Yleisten kirjastojen luokitusjärjestelmä
notation: 78.25
preferred label: Formlära @sv
preferred label: Morphology @en

Soitinnusoppi
type: Concept
References: Soitinrakennus
References: Musiikin tutkimus
type: YKL-luokka
alternative label: Arrangemang (78.26) @sv
alternative label: Instrumenteringslära (78.26) @sv
alternative label: Orkestrering (78.26) @sv
alternative label: Orkestrointi (78.26)
alternative label: Soitinnusoppi (78.26)
alternative label: Sovittaminen (78.26)
broader: Musiikin teoria
in scheme: YKL - Yleisten kirjastojen luokitusjärjestelmä
notation: 78.26
preferred label: Instrumentation @en
preferred label: Instrumentationslära @sv
scope note: Arrangering. Orkestrering Medier som handlar om instrument, spelning och instrumentalmusik till respektive klasser av instrument 78.6-78.879 med undantag av allmänna verk 78 och allmänna uppslagsverk 78.03 @sv
scope note: Sovittaminen. Orkestrointi Soittimia, soittamista ja soitinmusiikkia käsittelevä aineisto ko. soitinluokkiin 78.6-78.879, paitsi yleisteokset 78 ja yleiset hakuteokset 78.03

Notaatio
type: Concept
References: Säveltapailu
type: YKL-luokka
alternative label: Neumer (78.27) @sv
alternative label: Neumit (78.27)
alternative label: Notaatio (78.27)
alternative label: Notation (78.27) @sv
alternative label: Notskrift (78.27) @sv
alternative label: Nuottikirjoitus (78.27)
alternative label: Paleografi (78.27) @sv
alternative label: Paleografia (78.27)
broader: Musiikin teoria
in scheme: YKL - Yleisten kirjastojen luokitusjärjestelmä
notation: 78.27
preferred label: Notation @en
scope note: Notskrift. Notskriftens allmänna historia. Paleografi @sv
scope note: Nuottikirjoitus. Nuottikirjoituksen yleinen historia. Paleografia

Säveltapailu
type: Concept
type: YKL-luokka
alternative label: Diktaatti (78.28)
alternative label: Diktat (78.28) @sv
alternative label: Notläsning (78.28) @sv
alternative label: Nuotinluku (78.28)
alternative label: Solmisaatio (78.28)
alternative label: Solmisation (78.28) @sv
alternative label: Säveltapailu (78.28)
alternative label: Tonträffning (78.28) @sv
alternative label: Transkribointi, musiikissa (78.28)
alternative label: Transkription, inom musiken (78.28) @sv
alternative label: Transponering (78.28) @sv
alternative label: Transponointi (78.28)
broader: Musiikin teoria
in scheme: YKL - Yleisten kirjastojen luokitusjärjestelmä
notation: 78.28
preferred label: Ear training @en
preferred label: Tonträffning @sv
scope note: Diktaatti. Nuotinluku. Solmisaatio. Transponointi
scope note: Diktat. Notläsning. Solmisation. Transponering. @sv

Musiikin tulkinta
type: Concept
References: Sävellysoppi
References: Länsimaisen taidemusiikin historia
type: YKL-luokka
alternative label: Agogiikka (78.29)
alternative label: Agogik (78.29) @sv
alternative label: Artikulaatio (78.29)
alternative label: Artikulation (78.29) @sv
alternative label: Dirigering, musik (78.29) @sv
alternative label: Dynamiikka, musiikin tulkinta (78.29)
alternative label: Dynamik, tolkning av musiken (78.29) @sv
alternative label: Fraseeraus (78.29)
alternative label: Frasering (78.29) @sv
alternative label: Fritt ackompanjemang (78.29) @sv
alternative label: Improvisation, tolkning av musik (78.29) @sv
alternative label: Improvisointi, musiikin tulkinta (78.29)
alternative label: Intonaatio (78.29)
alternative label: Intonation (78.29) @sv
alternative label: Johtaminen, musiikki (78.29)
alternative label: Musiikin tulkinta (78.29)
alternative label: Ornamentiikka (78.29)
alternative label: Ornamentik (78.29) @sv
alternative label: Stillära, tolkning av musik (78.29) @sv
alternative label: Tolkning av musik (78.29) @sv
alternative label: Tyylioppi, musiikin tulkinta (78.29)
alternative label: Vapaa säestys (78.29)
broader: Musiikin teoria
in scheme: YKL - Yleisten kirjastojen luokitusjärjestelmä
notation: 78.29
preferred label: Musical interpretation @en
preferred label: Tolkning av musik @sv
scope note: Agogiikka. Artikulaatio. Dynamiikka. Fraseeraus Intonaatio. Improvisointi. Johtaminen. Ornamentiikka. Tyylioppi. Vapaa säestys
scope note: Agogik. Artikulation. Dynamik. Frasering. Intonation. Improvisation. Dirigering. Ornamentik. Stillära. Fritt ackompanjemang @sv

Laulumusiikki. Näyttämömusiikki. Liturginen musiikki
type: Concept
References: Musiikkikulttuurien sulautumat. Populaarimusiikki
type: YKL-luokka
alternative label: Laululyriikka, nuottijulkaisut, laulumusiikki (78.3+)
alternative label: Laulumusiikki, länsimainen taidemusiikki (78.3)
alternative label: Röster, sång (78.3+) @sv
alternative label: Sånglyrik, notpublikationer, vokalmusik (78.3+) @sv
alternative label: Vokalmusik, västerländsk konstmusik (78.3) @sv
alternative label: Äänet, laulu (78.3+)
broader: MUSIIKKI
in scheme: YKL - Yleisten kirjastojen luokitusjärjestelmä
narrower: Laulukokoelmat
narrower: Yksinlaulu
narrower: Lauluyhtyeet (2-9 laulajaa)
narrower: Kuorot (yli 9 laulajaa)
narrower: Näyttämömusiikki
narrower: Oratoriot. Passiot. Messut. Kantaatit. Motetit
narrower: Liturginen musiikki
narrower: Melodraamat
notation: 78.3
preferred label: Vocal music. Stage music. Liturgical music @en
preferred label: Vokalmusik. Scenmusik. Liturgisk musik @sv
scope note: Allmänna verk och verk som behandlar eller presenterar de nämnda musikgenrerna tillsammans @sv
scope note: Yleisteokset ja mainittuja musiikin lajeja yhdessä käsittelevät tai esittelevät teokset

Laulukokoelmat
type: Concept
References: URN:NBN:fi:au:ykl:78.07
References: Suomenkieliset sekasisältöiset laulukokoelmat
References: Ruotsinkieliset sekasisältöiset laulukokoelmat
References: Saksankieliset sekasisältöiset laulukokoelmat
References: Englanninkieliset sekasisältöiset laulukokoelmat
References: Ranskan-, italian-, espanjan- ja portugalinkieliset sekasisältöiset laulukokoelmat
References: Venäjänkieliset sekasisältöiset laulukokoelmat
References: Muunkieliset sekasisältöiset laulukokoelmat
type: YKL-luokka
alternative label: Laulukirjat, joita ei voi luokittaa tarkemmin (78.31)
alternative label: Laulukirjat, monikieliset, sekasisältöiset (78.31)
alternative label: Laulukokoelmat (78.31+)
alternative label: Sångböcker, flerspråkiga med blandat innehåll (78.31) @sv
alternative label: Sångböcker, som man inte kan klassificera till en snävare klass (78.31) @sv
alternative label: Sångsamlingar (78.31+) @sv
broader: Laulumusiikki. Näyttämömusiikki. Liturginen musiikki
in scheme: YKL - Yleisten kirjastojen luokitusjärjestelmä
narrower: Lastenlaulut. Lastenmusiikki
narrower: Suomenkieliset sekasisältöiset laulukokoelmat
narrower: Ruotsinkieliset sekasisältöiset laulukokoelmat
narrower: Saksankieliset sekasisältöiset laulukokoelmat
narrower: Englanninkieliset sekasisältöiset laulukokoelmat
narrower: Ranskan-, italian-, espanjan- ja portugalinkieliset sekasisältöiset laulukokoelmat
narrower: Venäjänkieliset sekasisältöiset laulukokoelmat
narrower: Muunkieliset sekasisältöiset laulukokoelmat
notation: 78.31
preferred label: Samlingar av sånger @sv
preferred label: Song collections @en
scope note: Hit sångböcker och -samlingar med blandat innehåll vilka inte kan klassificeras exaktare efter innehåll Hit även flerspråkiga samlingar med blandat innehåll @sv
scope note: Tähän sekasisältöiset laulukirjat ja -kokoelmat, joita ei voida sisällöllisesti luokittaa tarkemmin Tähän myös monikieliset sekasisältöiset kokoelmat

Lastenlaulut. Lastenmusiikki
type: Concept
References: Leikit
type: YKL-luokka
alternative label: Barnvisor (78.311+) @sv
alternative label: Lastenlaulut (78.311+)
alternative label: Lastenmusiikki, tekstitetty (78.311+)
alternative label: Laulukirjat, lastenlaulut (78.311+)
alternative label: Laululeikit, nuotit tai musiikkiäänite (78.311+)
alternative label: Musiikkileikit (78.311+)
alternative label: Musiikkiliikunta, lastenmusiikki (78.311+)
alternative label: Musik för barn, med text (78.311+) @sv
alternative label: Musikgymnastik, barnmusik (78.311+) @sv
alternative label: Musiklekar (78.311+) @sv
alternative label: Sångböcker, barnvisor (78.311+) @sv
alternative label: Sånglekar, med noter eller musikinspelning (78.311+) @sv
broader: Laulukokoelmat
in scheme: YKL - Yleisten kirjastojen luokitusjärjestelmä
narrower: Suomenkieliset lastenlaulut
narrower: Ruotsinkieliset lastenlaulut
narrower: Saksankieliset lastenlaulut
narrower: Englanninkieliset lastenlaulut
narrower: Ranskan-, italian-, espanjan- ja portugalinkieliset lastenlaulut
narrower: Venäjänkieliset lastenlaulut
narrower: Muunkieliset lastenlaulut
notation: 78.311
preferred label: Barnvisor. Musik för barn @sv
preferred label: Children's songs. Children's music @en
scope note: Allmänna verk och flerspråkiga samlingar av barnvisor Hit och till undergrupperna all musik med ord som är riktad till barn oberoende av instrumentering och stilart. Instrumentala verk i klass enligt instrumentering och stilart (t.ex. en handbok i pianospel för barn 78.6107) Hit även musiklekmaterial som publicerats som noter och musikinspelningar @sv
scope note: Yleisteokset ja monikieliset lastenlaulukokoelmat Tähän ja alaluokkiin kaikki lapsille suunnattu sanoitettu musiikki soitinnuksesta ja tyylilajista riippumatta. Instrumentaaliset teokset soitinnuksen tai tyylilajin mukaiseen luokkaan (esim. lapsille tarkoitettu pianonsoitonopas 78.6107) Tähän myös nuotteina ja musiikkiäänitteinä julkaistu musiikkileikkiaineisto

Suomenkieliset lastenlaulut
type: Concept
type: YKL-luokka
broader: Lastenlaulut. Lastenmusiikki
in scheme: YKL - Yleisten kirjastojen luokitusjärjestelmä
notation: 78.3112
preferred label: Children's songs in Finnish @en
preferred label: Finska barnvisor @sv

Ruotsinkieliset lastenlaulut
type: Concept
type: YKL-luokka
broader: Lastenlaulut. Lastenmusiikki
in scheme: YKL - Yleisten kirjastojen luokitusjärjestelmä
notation: 78.3113
preferred label: Children's songs in Swedish @en
preferred label: Svenska barnvisor @sv

Saksankieliset lastenlaulut
type: Concept
type: YKL-luokka
broader: Lastenlaulut. Lastenmusiikki
in scheme: YKL - Yleisten kirjastojen luokitusjärjestelmä
notation: 78.3114
preferred label: Children's songs in German @en
preferred label: Tyska barnvisor @sv

Englanninkieliset lastenlaulut
type: Concept
type: YKL-luokka
broader: Lastenlaulut. Lastenmusiikki
in scheme: YKL - Yleisten kirjastojen luokitusjärjestelmä
notation: 78.3115
preferred label: Children's songs in English @en
preferred label: Engelska barnvisor @sv

Ranskan-, italian-, espanjan- ja portugalinkieliset lastenlaulut
type: Concept
type: YKL-luokka
broader: Lastenlaulut. Lastenmusiikki
in scheme: YKL - Yleisten kirjastojen luokitusjärjestelmä
notation: 78.3116
preferred label: Children's songs in Italian, Spanish and Portuguese @en
preferred label: Franska, italienska, spanska och portugisiska barnvisor @sv

Venäjänkieliset lastenlaulut
type: Concept
type: YKL-luokka
broader: Lastenlaulut. Lastenmusiikki
in scheme: YKL - Yleisten kirjastojen luokitusjärjestelmä
notation: 78.3117
preferred label: Children's songs in Russian @en
preferred label: Ryska barnvisor @sv

Muunkieliset lastenlaulut
type: Concept
type: YKL-luokka
broader: Lastenlaulut. Lastenmusiikki
in scheme: YKL - Yleisten kirjastojen luokitusjärjestelmä
notation: 78.3118
preferred label: Barnvisor på andra språk @sv
preferred label: Children's songs in other languages @en

Suomenkieliset sekasisältöiset laulukokoelmat
type: Concept
type: YKL-luokka
alternative label: Laulukirjat, erikieliset (78.312 ... 78.318)
alternative label: Sångböcker, på olika språk (78.312 ... 78.318) @sv
broader: Laulukokoelmat
in scheme: YKL - Yleisten kirjastojen luokitusjärjestelmä
notation: 78.312
preferred label: Finska sångsamlingar med blandat innehåll @sv
preferred label: Song collections of varied contents in Finnish @en

Ruotsinkieliset sekasisältöiset laulukokoelmat
type: Concept
type: YKL-luokka
alternative label: Laulukirjat, erikieliset (78.312 ... 78.318)
alternative label: Sångböcker, på olika språk (78.312 ... 78.318) @sv
broader: Laulukokoelmat
in scheme: YKL - Yleisten kirjastojen luokitusjärjestelmä
notation: 78.313
preferred label: Song collections of varied contents in Swedish @en
preferred label: Svenska sångsamlingar med blandat innehåll @sv

Saksankieliset sekasisältöiset laulukokoelmat
type: Concept
type: YKL-luokka
alternative label: Laulukirjat, erikieliset (78.312 ... 78.318)
alternative label: Sångböcker, på olika språk (78.312 ... 78.318) @sv
broader: Laulukokoelmat
in scheme: YKL - Yleisten kirjastojen luokitusjärjestelmä
notation: 78.314
preferred label: Song collections of varied contents in German @en
preferred label: Tyska sångsamlingar med blandat innehåll @sv

Englanninkieliset sekasisältöiset laulukokoelmat
type: Concept
type: YKL-luokka
alternative label: Laulukirjat, erikieliset (78.312 ... 78.318)
alternative label: Sångböcker, på olika språk (78.312 ... 78.318) @sv
broader: Laulukokoelmat
in scheme: YKL - Yleisten kirjastojen luokitusjärjestelmä
notation: 78.315
preferred label: Engelska sångsamlingar med blandat innehåll @sv
preferred label: Song collections of varied contents in English @en

Ranskan-, italian-, espanjan- ja portugalinkieliset sekasisältöiset laulukokoelmat
type: Concept
type: YKL-luokka
alternative label: Laulukirjat, erikieliset (78.312 ... 78.318)
alternative label: Sångböcker, på olika språk (78.312 ... 78.318) @sv
broader: Laulukokoelmat
in scheme: YKL - Yleisten kirjastojen luokitusjärjestelmä
notation: 78.316
preferred label: Franska, italienska, spanska och portugisiska sångsamlingar med blandat innehåll @sv
preferred label: Song collections of varied contents in Italian, Spanish and Portuguese @en

Venäjänkieliset sekasisältöiset laulukokoelmat
type: Concept
type: YKL-luokka
alternative label: Laulukirjat, erikieliset (78.312 ... 78.318)
alternative label: Sångböcker, på olika språk (78.312 ... 78.318) @sv
broader: Laulukokoelmat
in scheme: YKL - Yleisten kirjastojen luokitusjärjestelmä
notation: 78.317
preferred label: Ryska sångsamlingar med blandat innehåll @sv
preferred label: Song collections of varied contents in Russian @en

Muunkieliset sekasisältöiset laulukokoelmat
type: Concept
type: YKL-luokka
alternative label: Laulukirjat, erikieliset (78.312 ... 78.318)
alternative label: Sångböcker, på olika språk (78.312 ... 78.318) @sv
broader: Laulukokoelmat
in scheme: YKL - Yleisten kirjastojen luokitusjärjestelmä
notation: 78.318
preferred label: Song collections of varied contents in other languages @en
preferred label: Sångsamlingar med blandat innehåll på andra språk @sv

Yksinlaulu
type: Concept
type: YKL-luokka
alternative label: Joddling, tonbildning (78.32) @sv
alternative label: Jodlaus, äänenmuodostus (78.32)
alternative label: Joikaus, äänenmuodostus (78.32)
alternative label: Joiku, äänenmuodostus (78.32)
alternative label: Jojk, tonbildning (78.32) @sv
alternative label: Jojkning, tonbildning (78.32) @sv
alternative label: Solosång, konstmusik (78.32+) @sv
alternative label: Yksinlaulu, taidemusiikki (78.32+)
broader: Laulumusiikki. Näyttämömusiikki. Liturginen musiikki
in scheme: YKL - Yleisten kirjastojen luokitusjärjestelmä
narrower: Yksinlaulu ilman säestystä
narrower: Yksinlaulu pianon tai muun sointusoittimen säestyksellä
narrower: Yksinlaulu jonkin muun soittimen tai soitinyhtyeen säestyksellä
narrower: Yksinlaulu orkesterin säestyksellä
notation: 78.32
preferred label: Solo song @en
preferred label: Solosång @sv
scope note: Allmänna verk och till sitt ackompanjemang varierande samlingar Solosånghandböcker och vokaliser 78.3207 @sv
scope note: Yleisteokset ja säestykseltään vaihtelevat kokoelmat Yksinlaulunoppaat ja vokaliisit 78.3207

Yksinlaulu ilman säestystä
type: Concept
type: YKL-luokka
broader: Yksinlaulu
in scheme: YKL - Yleisten kirjastojen luokitusjärjestelmä
notation: 78.321
preferred label: A cappella solo song @en
preferred label: Solosång utan ackompanjemang @sv

Yksinlaulu pianon tai muun sointusoittimen säestyksellä
type: Concept
type: YKL-luokka
alternative label: Lied (78.322)
broader: Yksinlaulu
in scheme: YKL - Yleisten kirjastojen luokitusjärjestelmä
notation: 78.322
preferred label: Solo song with the accompaniment of piano or some other chord instrument @en
preferred label: Solosång till ackompanjemang av piano eller annat ackordinstrument @sv

Yksinlaulu jonkin muun soittimen tai soitinyhtyeen säestyksellä
type: Concept
type: YKL-luokka
broader: Yksinlaulu
in scheme: YKL - Yleisten kirjastojen luokitusjärjestelmä
notation: 78.323
preferred label: Solo song with the accompaniment of some other instrument or instrumental ensemble @en
preferred label: Solosång till ackompanjemang av något annat musikinstrument eller en instrumentalensemble @sv

Yksinlaulu orkesterin säestyksellä
type: Concept
type: YKL-luokka
broader: Yksinlaulu
in scheme: YKL - Yleisten kirjastojen luokitusjärjestelmä
notation: 78.324
preferred label: Solo song with the accompaniment of an orchestra @en
preferred label: Solosång till ackompanjemang av orkester @sv

Lauluyhtyeet (2-9 laulajaa)
type: Concept
type: YKL-luokka
alternative label: Anthemit (78.33+)
alternative label: Anthems (78.33+) @sv
alternative label: Duo, lauluyhtye (78.33+)
alternative label: Duo, sånggrupp (78.33+) @sv
alternative label: Kvartett, sångensemble, konstmusik (78.33+) @sv
alternative label: Kvartetti, taidemusiikin lauluyhtye (78.33+)
alternative label: Kvintett, sångensemble, konstmusik (78.33+) @sv
alternative label: Kvintetti, taidemusiikin lauluyhtye (78.33+)
alternative label: Lamentaatio (78.33 ... 78.34+)
alternative label: Lamentation (78.33 ... 78.34+) @sv
alternative label: Lauluyhtyeet (78.33+)
alternative label: Nonett, sångensemble, konstmusik (78.33+) @sv
alternative label: Nonetti, taidemusiikin lauluyhtye (78.33+)
alternative label: Oktett, sångensemble, konstmusik (78.33+) @sv
alternative label: Oktetti, taidemusiikin lauluyhtye (78.33+)
alternative label: Sekstetti, taidemusiikin lauluyhtye (78.33+)
alternative label: Septett, sångensemble, konstmusik (78.33+) @sv
alternative label: Septetti, taidemusiikin lauluyhtye (78.33+)
alternative label: Sextett, sångensemble, konstmusik (78.33+) @sv
alternative label: Sångensembler (78.33+) @sv
alternative label: Tersett, sångensemble, konstmusik (78.33+) @sv
alternative label: Tertsetti, taidemusiikin lauluyhtye (78.33+)
broader: Laulumusiikki. Näyttämömusiikki. Liturginen musiikki
in scheme: YKL - Yleisten kirjastojen luokitusjärjestelmä
narrower: Lauluyhtyeet ilman säestystä
narrower: Lauluyhtyeet pianon tai muun sointusoittimen säestyksellä
narrower: Lauluyhtyeet jonkin muun soittimen tai soitinyhtyeen säestyksellä
narrower: Lauluyhtyeet orkesterin säestyksellä
notation: 78.33
preferred label: Sångensembler (2-9 sångare) @sv
preferred label: Vocal groups (2-9 singers) @en
scope note: Allmänna verk och samlingar med varierande ackompanjemang Som sånggrupp tolkas också sångensembler med 2-9 solister, även om det inte särskilt hade kallats för en orkester Sångarnas antal uttrycks vid behov med ämnesord (duo, tersett, kvartett o.s.v.) Sånggruppshandböcker 78.3307 @sv
scope note: Yleisteokset ja säestykseltään vaihtelevat kokoelmat Lauluyhtyeeksi tulkitaan myös 2-9 solistisen laulajan ryhmä, vaikkei sitä olisikaan erikseen nimetty yhtyeeksi Laulajien määrä ilmaistaan tarvittaessa asiasanalla (duo, tertsetti, kvartetti jne.) Yhtyelaulunoppaat 78.3307

Lauluyhtyeet ilman säestystä
type: Concept
type: YKL-luokka
broader: Lauluyhtyeet (2-9 laulajaa)
in scheme: YKL - Yleisten kirjastojen luokitusjärjestelmä
notation: 78.331
preferred label: A cappella vocal groups @en
preferred label: Sångensembler utan ackompanjemang @sv

Lauluyhtyeet pianon tai muun sointusoittimen säestyksellä
type: Concept
type: YKL-luokka
broader: Lauluyhtyeet (2-9 laulajaa)
in scheme: YKL - Yleisten kirjastojen luokitusjärjestelmä
notation: 78.332
preferred label: Sångensembler till ackompanjemang av piano eller annat instrument @sv
preferred label: Vocal groups with the accompaniment of piano or some other chord instrument @en

Lauluyhtyeet jonkin muun soittimen tai soitinyhtyeen säestyksellä
type: Concept
type: YKL-luokka
broader: Lauluyhtyeet (2-9 laulajaa)
in scheme: YKL - Yleisten kirjastojen luokitusjärjestelmä
notation: 78.333
preferred label: Sångensembler till ackompanjemang av något annat instrument eller någon annan instrumental ensemble @sv
preferred label: Vocal groups with the accompaniment of some other instrument or instrumental ensemble @en

Lauluyhtyeet orkesterin säestyksellä
type: Concept
type: YKL-luokka
broader: Lauluyhtyeet (2-9 laulajaa)
in scheme: YKL - Yleisten kirjastojen luokitusjärjestelmä
notation: 78.334
preferred label: Sångensembler till ackompanjemang av orkester @sv
preferred label: Vocal groups with the accompaniment of an orchestra @en

Kuorot (yli 9 laulajaa)
type: Concept
References: Oratoriot. Passiot. Messut. Kantaatit. Motetit
type: YKL-luokka
alternative label: Kuoro (78.34+)
alternative label: Kör (78.34+) @sv
alternative label: Lamentaatio (78.33 ... 78.34+)
alternative label: Lamentation (78.33 ... 78.34+) @sv
broader: Laulumusiikki. Näyttämömusiikki. Liturginen musiikki
in scheme: YKL - Yleisten kirjastojen luokitusjärjestelmä
narrower: Kuorot ilman säestystä
narrower: Kuorot pianon tai muun sointusoittimen säestyksellä
narrower: Kuorot jonkin muun soittimen tai soitinyhtyeen säestyksellä
narrower: Kuorot orkesterin säestyksellä
notation: 78.34
preferred label: Choirs (over 9 singers) @en
preferred label: Körer (fler än 9 sjungare) @sv
scope note: Allmänna verk och samlingar med varierande ackompanjemang Hit och till undergrupperna även verk i vilka det förutom kören finns vokala och/eller instrumentala solopartier. Körens sammansättning kan vid behov anges med ämnesord (t.ex. manskör), dock inte i klassen 78.341 Körsånghandböcker 78.3407 @sv
scope note: Yleisteokset ja säestykseltään vaihtelevat kokoelmat Tähän ja alaluokkiin myös teokset, joissa on kuoron lisäksi solistisia vokaali- ja/tai soitinosuuksia. Kuoron koostumus voidaan ilmaista muualla kuin luokassa 78.341 tarvittaessa asiasanalla (esim. mieskuoro) Kuorolaulunoppaat 78.3407

Kuorot ilman säestystä
type: Concept
type: YKL-luokka
alternative label: Kamarikuoro (78.341)
alternative label: Kammarkör (78.341) @sv
alternative label: Kuoro, a capella (78.341+)
alternative label: Kör, a capella (78.341+) @sv
broader: Kuorot (yli 9 laulajaa)
in scheme: YKL - Yleisten kirjastojen luokitusjärjestelmä
narrower: Sekakuorot
narrower: Mieskuorot
narrower: Naiskuorot
narrower: Lapsi- ja nuorisokuorot
notation: 78.341
preferred label: A cappella choirs @en
preferred label: Körer utan ackompanjemang @sv
scope note: Hit allmänna verk och samlingar som innehåller olika slag av körmusik utan ackompanjemang @sv
scope note: Tähän säestyksettömän kuoromusiikin eri lajeja sisältävät yleisteokset ja kokoelmat

Sekakuorot
type: Concept
type: YKL-luokka
alternative label: Blandad kör (78.3411) @sv
alternative label: Sekakuoro (78.3411)
broader: Kuorot ilman säestystä
in scheme: YKL - Yleisten kirjastojen luokitusjärjestelmä
notation: 78.3411
preferred label: Blandade körer @sv
preferred label: Mixed voice choirs @en

Mieskuorot
type: Concept
type: YKL-luokka
alternative label: Manskör (78.3412) @sv
alternative label: Mieskuoro (78.3412)
broader: Kuorot ilman säestystä
in scheme: YKL - Yleisten kirjastojen luokitusjärjestelmä
notation: 78.3412
preferred label: Male voice choirs @en
preferred label: Manskörer @sv

Naiskuorot
type: Concept
type: YKL-luokka
alternative label: Damkör (78.3413) @sv
alternative label: Naiskuoro (78.3413)
broader: Kuorot ilman säestystä
in scheme: YKL - Yleisten kirjastojen luokitusjärjestelmä
notation: 78.3413
preferred label: Damkörer @sv
preferred label: Women's choirs @en

Lapsi- ja nuorisokuorot
type: Concept
type: YKL-luokka
alternative label: Barnkör (78.3414) @sv
alternative label: Lapsikuoro (78.3414)
alternative label: Nuorisokuoro (78.3414)
alternative label: Ungdomskör (78.3414) @sv
broader: Kuorot ilman säestystä
in scheme: YKL - Yleisten kirjastojen luokitusjärjestelmä
notation: 78.3414
preferred label: Barn- och ungdomskörer @sv
preferred label: Children's and young people's choirs @en

Kuorot pianon tai muun sointusoittimen säestyksellä
type: Concept
type: YKL-luokka
broader: Kuorot (yli 9 laulajaa)
in scheme: YKL - Yleisten kirjastojen luokitusjärjestelmä
notation: 78.342
preferred label: Choirs with the accompaniment of piano or some other chord instrument @en
preferred label: Körer till ackompanjemang av piano eller annat ackordinstrument @sv

Kuorot jonkin muun soittimen tai soitinyhtyeen säestyksellä
type: Concept
type: YKL-luokka
broader: Kuorot (yli 9 laulajaa)
in scheme: YKL - Yleisten kirjastojen luokitusjärjestelmä
notation: 78.343
preferred label: Choirs with the accompaniment of some other instrument or instrumental ensemble @en
preferred label: Körer till ackompanjemang av något annat instrument eller någon annan instrumentalensemble @sv

Kuorot orkesterin säestyksellä
type: Concept
type: YKL-luokka
broader: Kuorot (yli 9 laulajaa)
in scheme: YKL - Yleisten kirjastojen luokitusjärjestelmä
notation: 78.344
preferred label: Choirs with the accompaniment of an orchestra @en
preferred label: Körer till ackompanjemang av orkester @sv

Näyttämömusiikki
type: Concept
References: Tanssitaide
type: YKL-luokka
alternative label: Hörspelsmusik (78.35) @sv
alternative label: Kuunnelmamusiikki (78.35)
alternative label: Näyttämömusiikki (78.35)
alternative label: Scenmusik (78.35) @sv
broader: Laulumusiikki. Näyttämömusiikki. Liturginen musiikki
in scheme: YKL - Yleisten kirjastojen luokitusjärjestelmä
narrower: Oopperat
narrower: Operetit. Musikaalit. Musiikkinäytelmät
narrower: Elokuva-, televisio- ja videomusiikki
narrower: Pelimusiikki
notation: 78.35
preferred label: Scenmusik @sv
preferred label: Stage music @en
scope note: Allmänna verk och samlingar som presenterar olika slag av scenmusik Balettmusik förs till klassen för dess instrumentering eller musikstil @sv
scope note: Yleisteokset ja eri näyttämömusiikin lajeja esittelevät kokoelmat Balettimusiikki soitinnuksen tai musiikkityylin mukaiseen luokkaan

Oopperat
type: Concept
type: YKL-luokka
alternative label: Ooppera (78.351)
alternative label: Opera (78.351) @sv
broader: Näyttämömusiikki
in scheme: YKL - Yleisten kirjastojen luokitusjärjestelmä
narrower: Oopperoiden soitinosat
narrower: Oopperoiden solistiset lauluosat
narrower: Oopperoiden kuoro-osat
notation: 78.351
preferred label: Operas @en
preferred label: Operor @sv
scope note: Hit också operalibretton, när huvudordet är kompositörens namn, annars till klassen för genre @sv
scope note: Tähän myös oopperalibretot silloin, kun pääsanana on säveltäjän nimi, muuten ko. kirjallisuuden lajin mukaiseen luokkaan

Oopperoiden soitinosat
type: Concept
type: YKL-luokka
alternative label: Ooppera, alkusoitto (78.3511)
alternative label: Opera, uvertyr (78.3511) @sv
broader: Oopperat
in scheme: YKL - Yleisten kirjastojen luokitusjärjestelmä
notation: 78.3511
preferred label: Instrumental parts from operas @en
preferred label: Instrumentalpartier i operor @sv

Oopperoiden solistiset lauluosat
type: Concept
type: YKL-luokka
alternative label: Aariat, ooppera- (78.3512)
alternative label: Arior, operaarior (78.3512) @sv
alternative label: Ooppera-aaria (78.3512)
alternative label: Operaaria (78.3512) @sv
broader: Oopperat
in scheme: YKL - Yleisten kirjastojen luokitusjärjestelmä
notation: 78.3512
preferred label: Parts from operas for vocal soloists @en
preferred label: Solistiska vokalpartier i operor @sv

Oopperoiden kuoro-osat
type: Concept
type: YKL-luokka
broader: Oopperat
in scheme: YKL - Yleisten kirjastojen luokitusjärjestelmä
notation: 78.3513
preferred label: Choral parts from operas. @en
preferred label: Körpartier i operor @sv

Operetit. Musikaalit. Musiikkinäytelmät
type: Concept
type: YKL-luokka
alternative label: Balladiooppera (78.352)
alternative label: Balladopera (78.352) @sv
alternative label: Läsnings- och deklamationsföreställningar till ackompanjemang (78.352) @sv
alternative label: Musiikkinäytelmä (78.352)
alternative label: Musikaali (78.352)
alternative label: Musikal (78.352) @sv
alternative label: Musikskådespel (78.352) @sv
alternative label: Näytelmämusiikki (78.352)
alternative label: Operett (78.352) @sv
alternative label: Operetti (78.352)
alternative label: Skådespelsmusik (78.352) @sv
alternative label: Säestykselliset luenta- ja lausuntaesitykset (78.352)
broader: Näyttämömusiikki
in scheme: YKL - Yleisten kirjastojen luokitusjärjestelmä
notation: 78.352
preferred label: Operettas. Musicals. Musical plays @en
preferred label: Operetter. Musikaler. Musikskådespel @sv
scope note: Hit även övriga sådana scenmusikverk som inte anses vara operor eller film-, TV- eller videomusik. Urval som gjorts genom arrangemang av enskilda sånger eller andra partier av en operett eller dylik kan också föras till musikformens klass (t.ex. 78.893+) @sv
scope note: Tähän myös muut sellaiset näyttämömusiikkiteokset, joita ei pidetä oopperoina tai elokuva-, televisio- ja videomusiikkina. Operetin tms. yksittäisistä lauluista tai muista osista sovitetut valikoimat voi sijoittaa myös musiikin lajin mukaiseen luokkaan (esim. 78.893+)

Elokuva-, televisio- ja videomusiikki
type: Concept
References: Operetit. Musikaalit. Musiikkinäytelmät
type: YKL-luokka
alternative label: Elokuvamusiikki (78.355)
alternative label: Filmmusik (78.355) @sv
alternative label: Televisiomusiikki (78.355)
alternative label: Televisionsmusik (78.355) @sv
alternative label: Videomusiikki (78.355)
alternative label: Videomusik (78.355) @sv
broader: Näyttämömusiikki
in scheme: YKL - Yleisten kirjastojen luokitusjärjestelmä
notation: 78.355
preferred label: Film, television and video music @en
preferred label: Filmmusik. TV-musik. Videomusik @sv
scope note: Hit enbart sådan musik som komponerats eller bearbetats för visuell kommunikation, annars till klassen för musikformen (t.ex. 78.8911) Hit även musikaler som ursprungligen komponerats som film @sv
scope note: Tähän vain kuvallisen viestinnän yhteyteen sävelletty tai muokattu musiikki, muuten soitinnuksen tai musiikin lajin mukaiseen luokkaan (esim. 78.8911) Tähän myös alun perin elokuvaksi tarkoitetut musikaalit

Pelimusiikki
type: Concept
References: Pelit
type: YKL-luokka
alternative label: Datorspelmusik (78.356) @sv
alternative label: Konsolipelimusiikki (78.356)
alternative label: Konsolspelmusik (78.356) @sv
alternative label: Pelimusiikki (78.356)
alternative label: Spelmusik (78.356) @sv
alternative label: Tietokonepelimusiikki (78.356)
alternative label: Videopelimusiikki (78.356)
alternative label: Videospelmusik (78.356) @sv
broader: Näyttämömusiikki
in scheme: YKL - Yleisten kirjastojen luokitusjärjestelmä
notation: 78.356
preferred label: Game music @en
preferred label: Spelmusik @sv
scope note: Musik som komponerats eller anpassats för alla slags spel och som är avsedd att spelas eller lyssnas på då man spelar eller ser på spelandet @sv
scope note: Tähän kaikenlaisten pelien yhteyteen sävelletty tai muokattu ja niiden pelaamisen tai seuraamisen aikana soitettavaksi ja kuultavaksi tarkoitettu musiikki

Oratoriot. Passiot. Messut. Kantaatit. Motetit
type: Concept
type: YKL-luokka
broader: Laulumusiikki. Näyttämömusiikki. Liturginen musiikki
in scheme: YKL - Yleisten kirjastojen luokitusjärjestelmä
narrower: Oratoriot
narrower: Passiot
narrower: Messut. Requiemit
narrower: Kantaatit
narrower: Motetit
notation: 78.36
preferred label: Oratorier. Passioner. Mässor. Kantater. Motetter @sv
preferred label: Oratorios. Passions. Masses. Cantatas. Motets @en
scope note: Allmänna verk och samlingar som presenterar verk med ovannämnda namn Alla andra körverk oberoende av ackompanjemang och vokala solopartier till respektive klasser Om instrumentala partier (t.ex. uvertyrer) i verk som nämnts i denna grupp har publicerats separat, klassificeras de efter instrumenteringen (t.ex. 78.52+ eller 78.62) @sv
scope note: Yleisteokset ja mainitun nimisiä teoksia yhdessä esittelevät kokoelmat Kaikki muut kuoroteokset säestyksestä ja vokaalisista soolo-osuuksista riippumatta ko. kuoroluokkiin Tässä ryhmässä mainittuihin teoksiin sisältyvät soitinosat (esim. alkusoitot) luokitetaan erikseen julkaistuina soitinnuksen mukaan (esim. 78.52+ tai 78.62)

Oratoriot
type: Concept
type: YKL-luokka
alternative label: Oratoriot (78.361)
alternative label: Oratorium (78.361) @sv
broader: Oratoriot. Passiot. Messut. Kantaatit. Motetit
in scheme: YKL - Yleisten kirjastojen luokitusjärjestelmä
notation: 78.361
preferred label: Oratorier @sv
preferred label: Oratorios @en

Passiot
type: Concept
type: YKL-luokka
alternative label: Passio (78.362)
alternative label: Passion (78.362) @sv
broader: Oratoriot. Passiot. Messut. Kantaatit. Motetit
in scheme: YKL - Yleisten kirjastojen luokitusjärjestelmä
notation: 78.362
preferred label: Passioner @sv
preferred label: Passions @en

Messut. Requiemit
type: Concept
type: YKL-luokka
alternative label: Messu (78.363)
alternative label: Mässa (78.363) @sv
alternative label: Rekviem (78.363) @sv
alternative label: Requiem (78.363)
broader: Oratoriot. Passiot. Messut. Kantaatit. Motetit
in scheme: YKL - Yleisten kirjastojen luokitusjärjestelmä
notation: 78.363
preferred label: Masses. Requiems @en
preferred label: Mässor. Rekviem @sv

Kantaatit
type: Concept
type: YKL-luokka
alternative label: Kantaatti (78.364)
alternative label: Kantat (78.364) @sv
broader: Oratoriot. Passiot. Messut. Kantaatit. Motetit
in scheme: YKL - Yleisten kirjastojen luokitusjärjestelmä
notation: 78.364
preferred label: Cantatas @en
preferred label: Kantater @sv

Motetit
type: Concept
type: YKL-luokka
alternative label: Motett (78.365) @sv
alternative label: Motetti (78.365)
broader: Oratoriot. Passiot. Messut. Kantaatit. Motetit
in scheme: YKL - Yleisten kirjastojen luokitusjärjestelmä
notation: 78.365
preferred label: Motets @en
preferred label: Motetter @sv

Liturginen musiikki
type: Concept
References: Etnomusiikki. Kansanmusiikki
References: Hengellinen populaarimusiikki
type: YKL-luokka
alternative label: Andlig musik (78.37+) @sv
alternative label: Hengellinen musiikki (78.37+)
alternative label: Kirkkomusiikki (78.37+)
alternative label: Kyrkomusik (78.37+) @sv
alternative label: Liturginen musiikki (78.37+)
alternative label: Liturgisk musik (78.37+) @sv
alternative label: Psalmböcker, med noter (78.37+) @sv
alternative label: Psalmer, med noter (78.37+) @sv
alternative label: Psalmmusik, med noter (78.37+) @sv
alternative label: Virret, nuotilliset (78.37+)
alternative label: Virsikirjat, nuotilliset (78.37+)
alternative label: Virsimusiikki, nuotillinen (78.37+)
broader: Laulumusiikki. Näyttämömusiikki. Liturginen musiikki
in scheme: YKL - Yleisten kirjastojen luokitusjärjestelmä
narrower: Protestanttisten kirkkojen liturginen musiikki
narrower: Roomalaiskatolisen kirkon liturginen musiikki
narrower: Ortodoksisen kirkon ja itämaisten kirkkojen liturginen musiikki
narrower: Juutalainen musiikki
narrower: Islamilainen musiikki
narrower: Buddhalainen, hindulainen ja shintolainen musiikki
narrower: Muiden uskontokuntien liturginen musiikki
notation: 78.37
preferred label: Liturgical music @en
preferred label: Liturgisk musik @sv
scope note: Allmänna verk och samlingar som presenterar liturgisk musik av olika religioner Övrig andlig musik klassificeras efter instrumentering eller stil med undantag av andlig underhållningsmusik, gospelmusik och spirituals Beträffande de musikkulturer som är mera främmande för oss ges vid osäkra fall företräde åt traditionell musik @sv
scope note: Yleisteokset ja eri uskontokuntien liturgista musiikkia esittelevät kokoelmat Muu hengellinen musiikki luokitetaan soitinnuksen tai tyylin perusteella, paitsi hengellinen viihdemusiikki, gospelmusiikki ja spirituaalit. Meille vieraampien musiikkikulttuurien kohdalla annetaan epävarmoissa tapauksissa etusija etnomusiikilliselle

Protestanttisten kirkkojen liturginen musiikki
type: Concept
type: YKL-luokka
alternative label: Protestantisk liturgisk musik (78.371) @sv
alternative label: Protestanttinen liturginen musiikki (78.371)
broader: Liturginen musiikki
in scheme: YKL - Yleisten kirjastojen luokitusjärjestelmä
notation: 78.371
preferred label: Liturgical music of Protestant Churches @en
preferred label: Liturgisk musik av protestantiska kyrkor @sv

Roomalaiskatolisen kirkon liturginen musiikki
type: Concept
type: YKL-luokka
alternative label: Romerskkatolsk liturgisk musik (78.372) @sv
alternative label: Roomalaiskatolinen liturginen musiikki (78.372)
broader: Liturginen musiikki
in scheme: YKL - Yleisten kirjastojen luokitusjärjestelmä
notation: 78.372
preferred label: Liturgical music of the Roman Catholic Church @en
preferred label: Liturgisk musik av romersk-katolska kyrkan @sv
scope note: Ambrosiaaninen, armenialainen, gregoriaaninen ja mozarabinen laulu
scope note: Ambrosiansk, armenisk, gregoriansk och mozarabisk sång @sv

Ortodoksisen kirkon ja itämaisten kirkkojen liturginen musiikki
type: Concept
type: YKL-luokka
alternative label: Ortodoksinen liturginen musiikki (78.373)
alternative label: Ortodox liturgisk musik (78.373) @sv
broader: Liturginen musiikki
in scheme: YKL - Yleisten kirjastojen luokitusjärjestelmä
notation: 78.373
preferred label: Liturgical music of Eastern Orthodox Church and Oriental Orthodox Churches @en
preferred label: Liturgisk musik av ortodoxa kyrkan och österländska kyrkor @sv
scope note: Autokefaalisten ja autonomisten ortodoksisten kirkkojen liturginen musiikki. Vanhauskoisten liturginen musiikki. Armenian apostolisen kirkon liturginen musiikki. Koptilaisen kirkon liturginen musiikki. Unioitujen (kreikkalaiskatolisten) kirkkojen liturginen musiikki. Kaldealaisten (nestorilaisten) liturginen musiikki. Intian tuomaskristittyjen liturginen musiikki. Bysanttilainen kirkkomusiikki
scope note: Liturgisk musik av autokefaliska och autonomiska ortodoxa kyrkor. Liturgisk musik av gammal-ortodoxiska kyrkor. Liturgisk musik av armeniska apostoliska kyrkan. Liturgisk musik av koptisk-ortodoxa kyrkan. Liturgisk musik av unierade ortodoxa kyrkor. Liturgisk musik av kaldeiska (nestorianska) kristna. Liturgisk musik av tomaskristna kyrkan i Indien. Bysantisk kyrkomusik @sv

Juutalainen musiikki
type: Concept
type: YKL-luokka
alternative label: Judisk liturgisk musik (78.374) @sv
alternative label: Juutalainen liturginen musiikki (78.374)
broader: Liturginen musiikki
in scheme: YKL - Yleisten kirjastojen luokitusjärjestelmä
notation: 78.374
preferred label: Jewish music @en
preferred label: Judisk musik @sv

Islamilainen musiikki
type: Concept
type: YKL-luokka
alternative label: Islamilainen liturginen musiikki (78.375)
alternative label: Islamisk liturgisk musik (78.375) @sv
broader: Liturginen musiikki
in scheme: YKL - Yleisten kirjastojen luokitusjärjestelmä
notation: 78.375
preferred label: Islamic music @en
preferred label: Islamisk musik @sv

Buddhalainen, hindulainen ja shintolainen musiikki
type: Concept
type: YKL-luokka
alternative label: Buddhalainen rituaalinen musiikki (78.376)
alternative label: Buddhistisk rituell musik (78.376) @sv
alternative label: Hinduisk liturgisk musik (78.376) @sv
alternative label: Hindulainen liturginen musiikki (78.376)
alternative label: Shintoistisk liturgisk musik (78.376) @sv
alternative label: Shintolainen liturginen musiikki (78.376)
broader: Liturginen musiikki
in scheme: YKL - Yleisten kirjastojen luokitusjärjestelmä
notation: 78.376
preferred label: Buddhist, Hindu and Shinto music @en
preferred label: Buddhistisk, hinduisk och shintoistisk musik @sv

Muiden uskontokuntien liturginen musiikki
type: Concept
type: YKL-luokka
broader: Liturginen musiikki
in scheme: YKL - Yleisten kirjastojen luokitusjärjestelmä
notation: 78.379
preferred label: Liturgical music of other denominations @en
preferred label: Övriga religioners liturgiska musik @sv

Melodraamat
type: Concept
type: YKL-luokka
alternative label: Melodraamat (78.38)
alternative label: Melodramor (78.38) @sv
broader: Laulumusiikki. Näyttämömusiikki. Liturginen musiikki
in scheme: YKL - Yleisten kirjastojen luokitusjärjestelmä
notation: 78.38
preferred label: Melodramas @en
preferred label: Melodramor @sv

Etnomusiikki. Kansanmusiikki
type: Concept
References: Kansantanssit. Kansantanhut
References: Musiikin tutkimus
References: Musiikkikulttuurien sulautumat. Populaarimusiikki
References: Maailmanmusiikki
type: YKL-luokka
alternative label: Etnomusiikki (78.4+)
alternative label: Etnomusik (78.4+) @sv
alternative label: Folkdanser, som musik (78.4+) @sv
alternative label: Folkmusik (78.4+) @sv
alternative label: Folkvisor, etnomusik (78.4+) @sv
alternative label: Folkvisor, traditionell musik (78.4+) @sv
alternative label: Kansanlaulut, etnomusiikki (78.4+)
alternative label: Kansanlaulut, perinnemusiikki (78.4+)
alternative label: Kansanmusiikki (78.4+)
alternative label: Kansantanhut, musiikkina (78.4+)
alternative label: Kansantanssit, musiikkina (78.4+)
alternative label: Modern folkmusik, etnomusik (78.4+) @sv
alternative label: Modern folkmusik, traditionell musik (78.4+) @sv
alternative label: Nykykansanmusiikki, etnomusiikki (78.4+)
alternative label: Nykykansanmusiikki, perinnemusiikki (78.4+)
alternative label: Perinnemusiikki (78.4+)
alternative label: Perinnemusiikki, etnomusiikki (78.4+)
alternative label: Polkat, etnomusiikki (78.4+)
alternative label: Polkat, perinnemusiikki (78.4+)
alternative label: Polkor, etnomusik (78.4+) @sv
alternative label: Polkor, traditionell musik (78.4+) @sv
alternative label: Säckpipa, etnomusik (78.4+) @sv
alternative label: Säckpipa, traditionell musik (78.4+) @sv
alternative label: Säkkipilli, etnomusiikki (78.4+)
alternative label: Säkkipilli, perinnemusiikki (78.4+)
alternative label: Traditionell musik (78.4+) @sv
alternative label: Traditionell musik, etnomusik (78.4+) @sv
alternative label: World music, etnomusiikki (78.4+)
alternative label: World music, etnomusik (78.4+) @sv
broader: MUSIIKKI
in scheme: YKL - Yleisten kirjastojen luokitusjärjestelmä
narrower: Etnomusiikki. Kansanmusiikki, Eurooppa
narrower: Etnomusiikki. Kansanmusiikki, Suomi
narrower: Etnomusiikki. Kansanmusiikki, Pohjoismaat
narrower: Etnomusiikki. Kansanmusiikki, Keski-Eurooppa
narrower: Etnomusiikki. Kansanmusiikki, Britteinsaaret
narrower: Etnomusiikki. Kansanmusiikki, Etelä-Eurooppa
narrower: Etnomusiikki. Kansanmusiikki, Itä-Eurooppa
narrower: Etnomusiikki. Kansanmusiikki, Aasia. Afrikka. Amerikka. Australia
narrower: Useiden valtioiden alueelle ulottuvat etniset musiikkikulttuurit
notation: 78.4
preferred label: Ethnic music. Folk music @en
preferred label: Traditionell musik. Folkmusik @sv
scope note: Allmänna verk och samlingar med blandat innehåll som handlar om världens etniska musikkulturer (och även deras musikinstrument) Indelningen i undergrupper baserar sig i första hand på musikkulturisk, inte på geografisk eller landsmässig klassificering En undergruppering som är precisare än den som presenterats i tabellerna antyds vid behov med ämnesord @sv
scope note: Maailman etnisiä musiikkikulttuureita (myös niiden soittimia) käsittelevät yleisteokset ja sekasisältöiset kokoelmat Alaluokituksen jaottelu perustuu ensisijaisesti musiikkikulttuuriseen, ei maantieteelliseen tai valtiolliseen luokitukseen. Taulukoissa esitettyä luokitusta tarkempi alajaottelu ilmaistaan tarvittaessa asiasanoin

Etnomusiikki. Kansanmusiikki, Eurooppa
type: Concept
type: YKL-luokka
alternative label: Eurooppa, etnomusiikki (78.41)
alternative label: Eurooppa, perinnemusiikki (78.41)
alternative label: Europa, etnomusik (78.41) @sv
alternative label: Europa, traditionell musik (78.41) @sv
broader: Etnomusiikki. Kansanmusiikki
in scheme: YKL - Yleisten kirjastojen luokitusjärjestelmä
notation: 78.41
preferred label: Ethnic music. Folk music, Europe @en
preferred label: Traditionell musik. Folkmusik, Europa @sv
scope note: Allmänna verk och samlingar @sv
scope note: Yleisteokset ja kokoelmat

Etnomusiikki. Kansanmusiikki, Suomi
type: Concept
References: Venäjän alueella elävien suomensukuisten kansojen etnomusiikki
References: Etnomusiikki. Kansanmusiikki, Saamelaiset
References: Etnomusiikki. Kansanmusiikki, Romanit
type: YKL-luokka
alternative label: Finland, etnomusik (78.42+) @sv
alternative label: Finland, traditionell musik (78.42+) @sv
alternative label: Suomi, etnomusiikki (78.42+)
alternative label: Suomi, perinnemusiikki (78.42+)
broader: Etnomusiikki. Kansanmusiikki
in scheme: YKL - Yleisten kirjastojen luokitusjärjestelmä
narrower: Suomalainen etnomusiikki
narrower: Suomenruotsalainen etnomusiikki
notation: 78.42
preferred label: Ethnic music. Folk music, Finland @en
preferred label: Traditionell musik. Folkmusik, Finland @sv
scope note: Allmänna verk och samlingar En precisare regional indelning vid behov med ämnesord @sv
scope note: Yleisteokset ja kokoelmat Tarkempi alueellinen jaottelu tarvittaessa asiasanoin

Suomalainen etnomusiikki
type: Concept
type: YKL-luokka
broader: Etnomusiikki. Kansanmusiikki, Suomi
in scheme: YKL - Yleisten kirjastojen luokitusjärjestelmä
narrower: Suomenkieliset kansanlaulut
narrower: Suomenkielisten alueiden pelimannimusiikki
notation: 78.421
preferred label: Finnish ethnic music @en
preferred label: Finsk traditionell musik @sv

Suomenkieliset kansanlaulut
type: Concept
type: YKL-luokka
broader: Suomalainen etnomusiikki
in scheme: YKL - Yleisten kirjastojen luokitusjärjestelmä
notation: 78.4213
preferred label: Finska folkvisor @sv
preferred label: Folk songs in Finnish @en

Suomenkielisten alueiden pelimannimusiikki
type: Concept
type: YKL-luokka
alternative label: Pelimannimusiikki, suomalainen (78.4215)
alternative label: Spelmansmusik, finsk (78.4215) @sv
broader: Suomalainen etnomusiikki
in scheme: YKL - Yleisten kirjastojen luokitusjärjestelmä
notation: 78.4215
preferred label: De finskspråkiga regionernas spelmansmusik @sv
preferred label: Traditional instrumental music of the Finnish-speaking regions @en

Suomenruotsalainen etnomusiikki
type: Concept
type: YKL-luokka
alternative label: Ahvenanmaa, etnomusiikki (78.422)
alternative label: Ahvenanmaa, perinnemusiikki (78.422)
alternative label: Finlandssvensk etnomusik (78.422) @sv
alternative label: Finlandssvensk traditionell musik (78.422) @sv
alternative label: Suomenruotsalainen etnomusiikki (78.422)
alternative label: Suomenruotsalainen perinnemusiikki (78.422)
alternative label: Åland, etnomusik (78.422) @sv
alternative label: Åland, traditionell musik (78.422) @sv
broader: Etnomusiikki. Kansanmusiikki, Suomi
in scheme: YKL - Yleisten kirjastojen luokitusjärjestelmä
narrower: Suomen ruotsinkieliset kansanlaulut
narrower: Ruotsinkielisten alueiden pelimannimusiikki
notation: 78.422
preferred label: Ethnic music of the Swedish-speaking Finns @en
preferred label: Finlandssvensk traditionell musik @sv

Suomen ruotsinkieliset kansanlaulut
type: Concept
type: YKL-luokka
broader: Suomenruotsalainen etnomusiikki
in scheme: YKL - Yleisten kirjastojen luokitusjärjestelmä
notation: 78.4223
preferred label: Finlandssvenska folkvisor @sv
preferred label: Folk songs of the Swedish-speaking Finns @en

Ruotsinkielisten alueiden pelimannimusiikki
type: Concept
type: YKL-luokka
broader: Suomenruotsalainen etnomusiikki
in scheme: YKL - Yleisten kirjastojen luokitusjärjestelmä
notation: 78.4225
preferred label: De svenskspråkiga regionernas spelmansmusik @sv
preferred label: Traditional instrumental music of the Swedish-speaking regions @en

Etnomusiikki. Kansanmusiikki, Pohjoismaat
type: Concept
References: Etnomusiikki. Kansanmusiikki, Saamelaiset
References: Etnomusiikki. Kansanmusiikki, Inuitit
type: YKL-luokka
alternative label: Färsaaret, etnomusiikki (78.43)
alternative label: Färsaaret, perinnemusiikki (78.43)
alternative label: Färöarna, etnomusik (78.43) @sv
alternative label: Färöarna, traditionell musik (78.43) @sv
alternative label: Nordiska länderna, etnomusik (78.43+) @sv
alternative label: Nordiska länderna, traditionell musik (78.43+) @sv
alternative label: Pohjoismaat, etnomusiikki (78.43+)
alternative label: Pohjoismaat, perinnemusiikki (78.43+)
broader: Etnomusiikki. Kansanmusiikki
in scheme: YKL - Yleisten kirjastojen luokitusjärjestelmä
narrower: Etnomusiikki. Kansanmusiikki, Ruotsi
narrower: Etnomusiikki. Kansanmusiikki, Norja
narrower: Etnomusiikki. Kansanmusiikki, Tanska
narrower: Etnomusiikki. Kansanmusiikki, Islanti
notation: 78.43
preferred label: Ethnic music. Folk music, Nordic countries @en
preferred label: Traditionell musik. Folkmusik, Norden @sv
scope note: Allmänna verk och samlingar Hit även Färöarna @sv
scope note: Yleisteokset ja kokoelmat Tähän myös Färsaaret

Etnomusiikki. Kansanmusiikki, Ruotsi
type: Concept
type: YKL-luokka
alternative label: Ruotsi, etnomusiikki (78.431)
alternative label: Ruotsi, perinnemusiikki (78.431)
alternative label: Sverige, etnomusik (78.431) @sv
alternative label: Sverige, traditionell musik (78.431) @sv
broader: Etnomusiikki. Kansanmusiikki, Pohjoismaat
in scheme: YKL - Yleisten kirjastojen luokitusjärjestelmä
notation: 78.431
preferred label: Ethnic music. Folk music, Sweden @en
preferred label: Traditionell musik. Folkmusik, Sverige @sv

Etnomusiikki. Kansanmusiikki, Norja
type: Concept
type: YKL-luokka
alternative label: Norge, etnomusik (78.432) @sv
alternative label: Norge, traditionell musik (78.432) @sv
alternative label: Norja, etnomusiikki (78.432)
alternative label: Norja, perinnemusiikki (78.432)
broader: Etnomusiikki. Kansanmusiikki, Pohjoismaat
in scheme: YKL - Yleisten kirjastojen luokitusjärjestelmä
notation: 78.432
preferred label: Ethnic music. Folk music, Norway @en
preferred label: Traditionell musik. Folkmusik, Norge @sv

Etnomusiikki. Kansanmusiikki, Tanska
type: Concept
type: YKL-luokka
alternative label: Danmark, etnomusik (78.433) @sv
alternative label: Danmark, traditionell musik (78.433) @sv
alternative label: Tanska, etnomusiikki (78.433)
alternative label: Tanska, perinnemusiikki (78.433)
broader: Etnomusiikki. Kansanmusiikki, Pohjoismaat
in scheme: YKL - Yleisten kirjastojen luokitusjärjestelmä
notation: 78.433
preferred label: Ethnic music. Folk music, Denmark @en
preferred label: Traditionell musik. Folkmusik, Danmark @sv

Etnomusiikki. Kansanmusiikki, Islanti
type: Concept
type: YKL-luokka
alternative label: Island, etnomusik (78.434) @sv
alternative label: Island, traditionell musik (78.434) @sv
alternative label: Islanti, etnomusiikki (78.434)
alternative label: Islanti, perinnemusiikki (78.434)
broader: Etnomusiikki. Kansanmusiikki, Pohjoismaat
in scheme: YKL - Yleisten kirjastojen luokitusjärjestelmä
notation: 78.434
preferred label: Ethnic music. Folk music, Iceland @en
preferred label: Traditionell musik. Folkmusik, Island @sv

Etnomusiikki. Kansanmusiikki, Keski-Eurooppa
type: Concept
type: YKL-luokka
alternative label: Keski-Eurooppa, etnomusiikki (78.44+)
alternative label: Keski-Eurooppa, perinnemusiikki (78.44+)
alternative label: Mellaneuropa, etnomusik (78.44+) @sv
alternative label: Mellaneuropa, traditionell musik (78.44+) @sv
broader: Etnomusiikki. Kansanmusiikki
in scheme: YKL - Yleisten kirjastojen luokitusjärjestelmä
narrower: Etnomusiikki. Kansanmusiikki, Saksa
narrower: Etnomusiikki. Kansanmusiikki, Tsekki. Slovakia
narrower: Etnomusiikki. Kansanmusiikki, Itävalta
narrower: Etnomusiikki. Kansanmusiikki, Unkari
narrower: Etnomusiikki. Kansanmusiikki, Sveitsi. Liechtenstein
narrower: Etnomusiikki. Kansanmusiikki, Alankomaat. Belgia. Luxemburg
notation: 78.44
preferred label: Ethnic music. Folk music, Central Europe @en
preferred label: Traditionell musik. Folkmusik, Mellaneuropa @sv
scope note: Allmänna verk och samlingar Hit även traditionell musik av små kulturer som utvecklats i Mellaneuropa @sv
scope note: Yleisteokset ja kokoelmat Tähän myös erillisten Keski-Euroopassa kehittyneiden pienten kulttuurien etnomusiikki

Etnomusiikki. Kansanmusiikki, Saksa
type: Concept
type: YKL-luokka
alternative label: Saksa, etnomusiikki (78.441)
alternative label: Saksa, perinnemusiikki (78.441)
alternative label: Tyskland, etnomusik (78.441) @sv
alternative label: Tyskland, traditionell musik (78.441) @sv
broader: Etnomusiikki. Kansanmusiikki, Keski-Eurooppa
in scheme: YKL - Yleisten kirjastojen luokitusjärjestelmä
notation: 78.441
preferred label: Ethnic music. Folk music, Germany @en
preferred label: Traditionell musik. Folkmusik, Tyskland @sv

Etnomusiikki. Kansanmusiikki, Tsekki. Slovakia
type: Concept
type: YKL-luokka
alternative label: Slovakia, etnomusiikki (78.443)
alternative label: Slovakia, perinnemusiikki (78.443)
alternative label: Slovakien, etnomusik (78.443) @sv
alternative label: Slovakien, traditionell musik (78.443) @sv
alternative label: Tjeckien, etnomusik (78.443) @sv
alternative label: Tjeckien, traditionell musik (78.443) @sv
alternative label: Tšekki, etnomusiikki (78.443)
alternative label: Tšekki, perinnemusiikki (78.443)
broader: Etnomusiikki. Kansanmusiikki, Keski-Eurooppa
in scheme: YKL - Yleisten kirjastojen luokitusjärjestelmä
notation: 78.443
preferred label: Ethnic music. Folk music, Czech Republic. Slovakia @en
preferred label: Traditionell musik. Folkmusik, Tjeckien. Slovakien @sv

Etnomusiikki. Kansanmusiikki, Itävalta
type: Concept
type: YKL-luokka
alternative label: Itävalta, etnomusiikki (78.444)
alternative label: Itävalta, perinnemusiikki (78.444)
alternative label: Österrike, etnomusik (78.444) @sv
alternative label: Österrike, traditionell musik (78.444) @sv
broader: Etnomusiikki. Kansanmusiikki, Keski-Eurooppa
in scheme: YKL - Yleisten kirjastojen luokitusjärjestelmä
notation: 78.444
preferred label: Ethnic music. Folk music, Austria @en
preferred label: Traditionell musik. Folkmusik, Österrike @sv

Etnomusiikki. Kansanmusiikki, Unkari
type: Concept
type: YKL-luokka
alternative label: Ungern, etnomusik (78.445) @sv
alternative label: Ungern, traditionell musik (78.445) @sv
alternative label: Unkari, etnomusiikki (78.445)
alternative label: Unkari, perinnemusiikki (78.445)
broader: Etnomusiikki. Kansanmusiikki, Keski-Eurooppa
in scheme: YKL - Yleisten kirjastojen luokitusjärjestelmä
notation: 78.445
preferred label: Ethnic music. Folk music, Hungary @en
preferred label: Traditionell musik. Folkmusik, Ungern @sv

Etnomusiikki. Kansanmusiikki, Sveitsi. Liechtenstein
type: Concept
type: YKL-luokka
alternative label: Joddling, etnomusik (78.446) @sv
alternative label: Joddling, traditionell musik (78.446) @sv
alternative label: Jodlaus, etnomusiikki (78.446)
alternative label: Jodlaus, perinnemusiikki (78.446)
alternative label: Liechtenstein, etnomusiikki (78.446)
alternative label: Liechtenstein, etnomusik (78.446) @sv
alternative label: Liechtenstein, perinnemusiikki (78.446)
alternative label: Liechtenstein, traditionell musik (78.446) @sv
alternative label: Schweiz, etnomusik (78.446) @sv
alternative label: Schweiz, traditionell musik (78.446) @sv
alternative label: Sveitsi, etnomusiikki (78.446)
alternative label: Sveitsi, perinnemusiikki (78.446)
broader: Etnomusiikki. Kansanmusiikki, Keski-Eurooppa
in scheme: YKL - Yleisten kirjastojen luokitusjärjestelmä
notation: 78.446
preferred label: Ethnic music. Folk music, Switzerland. Liechtenstein @en
preferred label: Traditionell musik. Folkmusik, Schweiz. Liechtenstein @sv

Etnomusiikki. Kansanmusiikki, Alankomaat. Belgia. Luxemburg
type: Concept
type: YKL-luokka
alternative label: Alankomaat, etnomusiikki (78.448)
alternative label: Alankomaat, perinnemusiikki (78.448)
alternative label: Belgia, etnomusiikki (78.448)
alternative label: Belgia, perinnemusiikki (78.448)
alternative label: Belgien, etnomusik (78.448) @sv
alternative label: Belgien, traditionell musik (78.448) @sv
alternative label: Holland, etnomusik (78.448) @sv
alternative label: Holland, traditionell musik (78.448) @sv
alternative label: Hollanti, etnomusiikki (78.448)
alternative label: Hollanti, perinnemusiikki (78.448)
alternative label: Luxemburg, etnomusiikki (78.448)
alternative label: Luxemburg, etnomusik (78.448) @sv
alternative label: Luxemburg, perinnemusiikki (78.448)
alternative label: Luxemburg, traditionell musik (78.448) @sv
alternative label: Nederländerna, etnomusik (78.448) @sv
alternative label: Nederländerna, traditionell musik (78.448) @sv
broader: Etnomusiikki. Kansanmusiikki, Keski-Eurooppa
in scheme: YKL - Yleisten kirjastojen luokitusjärjestelmä
notation: 78.448
preferred label: Ethnic music. Folk music, Netherlands. Belgium. Luxembourg @en
preferred label: Traditionell musik. Folkmusik, Nederländerna. Belgien. Luxemburg @sv

Etnomusiikki. Kansanmusiikki, Britteinsaaret
type: Concept
type: YKL-luokka
alternative label: Britteinsaaret, etnomusiikki (78.45+)
alternative label: Britteinsaaret, perinnemusiikki (78.45+)
alternative label: Brittiska öarna, etnomusik (78.45+) @sv
alternative label: Brittiska öarna, traditionell musik (78.45+) @sv
alternative label: Englannin kanaalin saaret, etnomusiikki (78.45)
alternative label: Englannin kanaalin saaret, perinnemusiikki (78.45)
alternative label: Guernsey, etnomusiikki (78.45)
alternative label: Guernsey, etnomusik (78.45) @sv
alternative label: Guernsey, perinnemusiikki (78.45)
alternative label: Guernsey, traditionell musik (78.45) @sv
alternative label: Jersey, etnomusiikki (78.45)
alternative label: Jersey, etnomusik (78.45) @sv
alternative label: Jersey, perinnemusiikki (78.45)
alternative label: Jersey, traditionell musik (78.45) @sv
alternative label: Kanalöarna, etnomusik (78.45) @sv
alternative label: Kanalöarna, traditionell musik (78.45) @sv
alternative label: Keltisk etnomusik, Brittiska öarna (78.45+) @sv
alternative label: Keltisk folkmusik (78.45 ... 78.46) @sv
alternative label: Keltisk traditionell musik, Brittiska öarna (78.45+) @sv
alternative label: Kelttiläinen etnomusiikki, Brittein saaret (78.45+)
alternative label: Kelttiläinen kansanmusiikki (78.45 ... 78.46)
alternative label: Kelttiläinen perinnemusiikki, Brittein saaret (78.45+)
alternative label: Man, etnomusiikki (78.45)
alternative label: Man, etnomusik (78.45) @sv
alternative label: Man, perinnemusiikki (78.45)
alternative label: Man, traditionell musik (78.45) @sv
broader: Etnomusiikki. Kansanmusiikki
in scheme: YKL - Yleisten kirjastojen luokitusjärjestelmä
narrower: Etnomusiikki. Kansanmusiikki, Englanti
narrower: Etnomusiikki. Kansanmusiikki, Wales
narrower: Etnomusiikki. Kansanmusiikki, Skotlanti
narrower: Etnomusiikki. Kansanmusiikki, Irlanti
notation: 78.45
preferred label: Ethnic music. Folk music, British Isles @en
preferred label: Traditionell musik. Folkmusik, Brittiska öarna @sv
scope note: Allmänna verk och samlingar Hit även Kanalöarna och samlingar som innehåller Brittiska öarnas keltiska musik, för övrigt till respektive lands klass för traditionell musik @sv
scope note: Yleisteokset ja kokoelmat Tähän myös Englannin kanaalin saaret, samoin Britteinsaarten kelttiläistä musiikkia sisältävät kokoelmat, muuten ao.maan kohdalle

Etnomusiikki. Kansanmusiikki, Englanti
type: Concept
type: YKL-luokka
alternative label: England, etnomusik (78.451) @sv
alternative label: England, traditionell musik (78.451) @sv
alternative label: Englanti, etnomusiikki (78.451)
alternative label: Englanti, perinnemusiikki (78.451)
broader: Etnomusiikki. Kansanmusiikki, Britteinsaaret
in scheme: YKL - Yleisten kirjastojen luokitusjärjestelmä
notation: 78.451
preferred label: Ethnic music. Folk music, England @en
preferred label: Traditionell musik. Folkmusik, England @sv

Etnomusiikki. Kansanmusiikki, Wales
type: Concept
type: YKL-luokka
alternative label: Keltisk etnomusik, Wales (78.452) @sv
alternative label: Keltisk traditionell musik, Wales (78.452) @sv
alternative label: Kelttiläinen etnomusiikki, Wales (78.452)
alternative label: Kelttiläinen perinnemusiikki, Wales (78.452)
alternative label: Wales, etnomusiikki (78.452)
alternative label: Wales, etnomusik (78.452) @sv
alternative label: Wales, perinnemusiikki (78.452)
alternative label: Wales, traditionell musik (78.452) @sv
broader: Etnomusiikki. Kansanmusiikki, Britteinsaaret
in scheme: YKL - Yleisten kirjastojen luokitusjärjestelmä
notation: 78.452
preferred label: Ethnic music. Folk music, Wales @en
preferred label: Traditionell musik. Folkmusik, Wales @sv

Etnomusiikki. Kansanmusiikki, Skotlanti
type: Concept
type: YKL-luokka
alternative label: Keltisk etnomusik, Skotland (78.453) @sv
alternative label: Keltisk traditionell musik, Skotland (78.453) @sv
alternative label: Kelttiläinen etnomusiikki, Skotlanti (78.453)
alternative label: Kelttiläinen perinnemusiikki, Skotlanti (78.453)
alternative label: Skotlanti, etnomusiikki (78.453)
alternative label: Skotlanti, perinnemusiikki (78.453)
alternative label: Skottland, etnomusik (78.453) @sv
alternative label: Skottland, traditionell musik (78.453) @sv
broader: Etnomusiikki. Kansanmusiikki, Britteinsaaret
in scheme: YKL - Yleisten kirjastojen luokitusjärjestelmä
notation: 78.453
preferred label: Ethnic music. Folk music, Scotland @en
preferred label: Traditionell musik. Folkmusik, Skottland @sv

Etnomusiikki. Kansanmusiikki, Irlanti
type: Concept
type: YKL-luokka
alternative label: Irland, etnomusik (78.457) @sv
alternative label: Irland, traditionell musik (78.457) @sv
alternative label: Irlanti, etnomusiikki (78.457)
alternative label: Irlanti, perinnemusiikki (78.457)
alternative label: Keltisk etnomusik, Irland (78.457) @sv
alternative label: Keltisk traditionell musik, Irland (78.457) @sv
alternative label: Kelttiläinen etnomusiikki, Irlanti (78.457)
alternative label: Kelttiläinen perinnemusiikki, Irlanti (78.457)
broader: Etnomusiikki. Kansanmusiikki, Britteinsaaret
in scheme: YKL - Yleisten kirjastojen luokitusjärjestelmä
notation: 78.457
preferred label: Ethnic music. Folk music, Ireland @en
preferred label: Traditionell musik. Folkmusik, Irland @sv

Etnomusiikki. Kansanmusiikki, Etelä-Eurooppa
type: Concept
type: YKL-luokka
alternative label: Basker, etnomusik (78.46) @sv
alternative label: Basker, traditionell musik (78.46) @sv
alternative label: Baskit, etnomusiikki (78.46)
alternative label: Baskit, perinnemusiikki (78.46)
alternative label: Bretagne, etnomusiikki (78.46)
alternative label: Bretagne, etnomusik (78.46) @sv
alternative label: Bretagne, perinnemusiikki (78.46)
alternative label: Bretagne, traditionell musik (78.46) @sv
alternative label: Etelä-Eurooppa, etnomusiikki (78.46+)
alternative label: Etelä-Eurooppa, perinnemusiikki (78.46+)
alternative label: Galicia, etnomusiikki (78.46)
alternative label: Galicia, perinnemusiikki (78.46)
alternative label: Galizien, etnomusik (78.46) @sv
alternative label: Galizien, traditionell musik (78.46) @sv
alternative label: Keltisk etnomusik, Bretagne (78.46) @sv
alternative label: Keltisk folkmusik (78.45 ... 78.46) @sv
alternative label: Keltisk traditionell musik, Bretagne (78.46) @sv
alternative label: Kelttiläinen etnomusiikki, Bretagne (78.46)
alternative label: Kelttiläinen kansanmusiikki (78.45 ... 78.46)
alternative label: Kelttiläinen perinnemusiikki, Bretagne (78.46)
alternative label: Korsika, etnomusiikki (78.46)
alternative label: Korsika, etnomusik (78.46) @sv
alternative label: Korsika, perinnemusiikki (78.46)
alternative label: Korsika, traditionell musik (78.46) @sv
alternative label: Sardinia, etnomusiikki (78.46)
alternative label: Sardinia, perinnemusiikki (78.46)
alternative label: Sardinien, etnomusik (78.46) @sv
alternative label: Sardinien, traditionell musik (78.46) @sv
alternative label: Sydeuropa, etnomusik (78.46+) @sv
alternative label: Sydeuropa, traditionell musik (78.46+) @sv
broader: Etnomusiikki. Kansanmusiikki
in scheme: YKL - Yleisten kirjastojen luokitusjärjestelmä
narrower: Etnomusiikki. Kansanmusiikki, Ranska
narrower: Etnomusiikki. Kansanmusiikki, Italia
narrower: Etnomusiikki. Kansanmusiikki, Espanja
narrower: Etnomusiikki. Kansanmusiikki, Portugali
narrower: Etnomusiikki. Kansanmusiikki, Malta
narrower: Etnomusiikki. Kansanmusiikki, Balkanin alue
notation: 78.46
preferred label: Ethnic music. Folk music, Southern Europe @en
preferred label: Traditionell musik. Folkmusik, Sydeuropa @sv
scope note: Allmänna verk och samlingar Hit även Bretagnes och Galiziens keltiska traditionella musik samt baskernas och andra små sydeuropeiska kulturers traditionella musik @sv
scope note: Yleisteokset ja kokoelmat Tähän myös Bretagnen ja Galician kelttiläinen etnomusiikki sekä baskien ja muiden Etelä-Euroopan pienten kulttuurien etnomusiikki

Etnomusiikki. Kansanmusiikki, Ranska
type: Concept
type: YKL-luokka
alternative label: Frankrike, etnomusik (78.461) @sv
alternative label: Frankrike, traditionell musik (78.461) @sv
alternative label: Ranska, etnomusiikki (78.461)
alternative label: Ranska, perinnemusiikki (78.461)
broader: Etnomusiikki. Kansanmusiikki, Etelä-Eurooppa
in scheme: YKL - Yleisten kirjastojen luokitusjärjestelmä
notation: 78.461
preferred label: Ethnic music. Folk music, France @en
preferred label: Traditionell musik. Folkmusik, Frankrike @sv

Etnomusiikki. Kansanmusiikki, Italia
type: Concept
type: YKL-luokka
alternative label: Italia, etnomusiikki (78.462)
alternative label: Italia, perinnemusiikki (78.462)
alternative label: Italien, etnomusik (78.462) @sv
alternative label: Italien, traditionell musik (78.462) @sv
broader: Etnomusiikki. Kansanmusiikki, Etelä-Eurooppa
in scheme: YKL - Yleisten kirjastojen luokitusjärjestelmä
notation: 78.462
preferred label: Ethnic music. Folk music, Italy @en
preferred label: Traditionell musik. Folkmusik, Italien @sv

Etnomusiikki. Kansanmusiikki, Espanja
type: Concept
type: YKL-luokka
alternative label: Espanja, etnomusiikki (78.463)
alternative label: Espanja, perinnemusiikki (78.463)
alternative label: Flamenco, etnomusiikki (78.463)
alternative label: Flamenco, etnomusik (78.463) @sv
alternative label: Flamenco, perinnemusiikki (78.463)
alternative label: Flamenco, traditionell musik (78.463) @sv
alternative label: Spanien, etnomusik (78.463) @sv
alternative label: Spanien, traditionell musik (78.463) @sv
broader: Etnomusiikki. Kansanmusiikki, Etelä-Eurooppa
in scheme: YKL - Yleisten kirjastojen luokitusjärjestelmä
notation: 78.463
preferred label: Ethnic music. Folk music, Spain @en
preferred label: Traditionell musik. Folkmusik, Spanien @sv

Etnomusiikki. Kansanmusiikki, Portugali
type: Concept
type: YKL-luokka
alternative label: Fado-laulu, etnomusiikki (78.464)
alternative label: Fado-laulu, perinnemusiikki (78.464)
alternative label: Fado-sång, etnomusik (78.464) @sv
alternative label: Fado-sång, traditionell musik (78.464) @sv
alternative label: Portugal, etnomusik (78.464) @sv
alternative label: Portugal, traditionell musik (78.464) @sv
alternative label: Portugali, etnomusiikki (78.464)
alternative label: Portugali, perinnemusiikki (78.464)
broader: Etnomusiikki. Kansanmusiikki, Etelä-Eurooppa
in scheme: YKL - Yleisten kirjastojen luokitusjärjestelmä
notation: 78.464
preferred label: Ethnic music. Folk music, Portugal @en
preferred label: Traditionell musik. Folkmusik, Portugal @sv

Etnomusiikki. Kansanmusiikki, Malta
type: Concept
type: YKL-luokka
alternative label: Malta, etnomusiikki (78.465)
alternative label: Malta, etnomusik (78.465) @sv
alternative label: Malta, perinnemusiikki (78.465)
alternative label: Malta, traditionell musik (78.465) @sv
broader: Etnomusiikki. Kansanmusiikki, Etelä-Eurooppa
in scheme: YKL - Yleisten kirjastojen luokitusjärjestelmä
notation: 78.465
preferred label: Ethnic music. Folk music, Malta @en
preferred label: Traditionell musik. Folkmusik, Malta @sv

Etnomusiikki. Kansanmusiikki, Balkanin alue
type: Concept
type: YKL-luokka
alternative label: Balkanin maat, etnomusiikki (78.468)
alternative label: Balkanin maat, perinnemusiikki (78.468)
alternative label: Balkanländerna, etnomusik (78.468) @sv
alternative label: Balkanländerna, traditionell musik (78.468) @sv
broader: Etnomusiikki. Kansanmusiikki, Etelä-Eurooppa
in scheme: YKL - Yleisten kirjastojen luokitusjärjestelmä
narrower: Etnomusiikki. Kansanmusiikki, Bulgaria
narrower: Etnomusiikki. Kansanmusiikki, Romania
narrower: Etnomusiikki. Kansanmusiikki, entisen Jugoslavian alue
narrower: Etnomusiikki. Kansanmusiikki, Albania
narrower: Etnomusiikki. Kansanmusiikki, Kreikka
notation: 78.468
preferred label: Ethnic music. Folk music, Balkan area @en
preferred label: Traditionell musik. Folkmusik, Balkanregionen @sv

Etnomusiikki. Kansanmusiikki, Bulgaria
type: Concept
type: YKL-luokka
alternative label: Bulgaria, etnomusiikki (78.4681)
alternative label: Bulgaria, perinnemusiikki (78.4681)
alternative label: Bulgarien, etnomusik (78.4681) @sv
alternative label: Bulgarien, traditionell musik (78.4681) @sv
broader: Etnomusiikki. Kansanmusiikki, Balkanin alue
in scheme: YKL - Yleisten kirjastojen luokitusjärjestelmä
notation: 78.4681
preferred label: Ethnic music. Folk music, Bulgaria @en
preferred label: Traditionell musik. Folkmusik, Bulgarien @sv

Etnomusiikki. Kansanmusiikki, Romania
type: Concept
type: YKL-luokka
alternative label: Romania, etnomusiikki (78.4682)
alternative label: Romania, perinnemusiikki (78.4682)
alternative label: Rumänien, etnomusik (78.4682) @sv
alternative label: Rumänien, traditionell musik (78.4682) @sv
broader: Etnomusiikki. Kansanmusiikki, Balkanin alue
in scheme: YKL - Yleisten kirjastojen luokitusjärjestelmä
notation: 78.4682
preferred label: Ethnic music. Folk music, Romania @en
preferred label: Traditionell musik. Folkmusik, Rumänien @sv

Etnomusiikki. Kansanmusiikki, entisen Jugoslavian alue
type: Concept
type: YKL-luokka
alternative label: Jugoslavia, etnomusiikki (78.4683)
alternative label: Jugoslavia, perinnemusiikki (78.4683)
alternative label: Jugoslavien, etnomusik (78.4683) @sv
alternative label: Jugoslavien, traditionell musik (78.4683) @sv
broader: Etnomusiikki. Kansanmusiikki, Balkanin alue
in scheme: YKL - Yleisten kirjastojen luokitusjärjestelmä
notation: 78.4683
preferred label: Ethnic music. Folk music, the area of former Yogoslavia @en
preferred label: Traditionell musik. Folkmusik, före detta Jugoslavien @sv
scope note: Bosnia. Kosovo. Kroatia. Makedonia. Montenegro. Serbia. Slovenia. Vojvodina
scope note: Bosnien. Kosovo. Kroatien. Makedonien. Montenegro. Serbien. Slovenien. Vojvodina @sv

Etnomusiikki. Kansanmusiikki, Albania
type: Concept
type: YKL-luokka
alternative label: Albania, etnomusiikki (78.4684)
alternative label: Albania, perinnemusiikki (78.4684)
alternative label: Albanien, etnomusik (78.4684) @sv
alternative label: Albanien, traditionell musik (78.4684) @sv
broader: Etnomusiikki. Kansanmusiikki, Balkanin alue
in scheme: YKL - Yleisten kirjastojen luokitusjärjestelmä
notation: 78.4684
preferred label: Ethnic music. Folk music, Albania @en
preferred label: Traditionell musik. Folkmusik, Albanien @sv

Etnomusiikki. Kansanmusiikki, Kreikka
type: Concept
type: YKL-luokka
alternative label: Cyperngreker, etnomusik (78.4685) @sv
alternative label: Cyperngreker, traditionell musik (78.4685) @sv
alternative label: Grekland, etnomusik (78.4685) @sv
alternative label: Grekland, traditionell musik (78.4685) @sv
alternative label: Kreeta, etnomusiikki (78.4685)
alternative label: Kreeta, perinnemusiikki (78.4685)
alternative label: Kreikka, etnomusiikki (78.4685)
alternative label: Kreikka, perinnemusiikki (78.4685)
alternative label: Kreta, etnomusik (78.4685) @sv
alternative label: Kreta, traditionell musik (78.4685) @sv
alternative label: Kyproksen kreikkalaiset, etnomusiikki (78.4685)
alternative label: Kyproksen kreikkalaiset, perinnemusiikki (78.4685)
alternative label: Rebetika, etnomusiikki, Kreikka (78.4685)
alternative label: Rebetika, etnomusik, Grekland (78.4685) @sv
alternative label: Rebetika, perinnemusiikki, Kreikka (78.4685)
alternative label: Rebetika, traditionell musik, Grekland (78.4685) @sv
broader: Etnomusiikki. Kansanmusiikki, Balkanin alue
in scheme: YKL - Yleisten kirjastojen luokitusjärjestelmä
notation: 78.4685
preferred label: Ethnic music. Folk music, Greece @en
preferred label: Traditionell musik. Folkmusik, Grekland @sv
scope note: Hit även Cyperns grekiska traditionella musik @sv
scope note: Tähän myös Kyproksen kreikkalainen etnomusiikki

Etnomusiikki. Kansanmusiikki, Itä-Eurooppa
type: Concept
type: YKL-luokka
alternative label: Itä-Eurooppa, etnomusiikki (78.47+)
alternative label: Itä-Eurooppa, perinnemusiikki (78.47+)
alternative label: Östeuropa, etnomusik (78.47+) @sv
alternative label: Östeuropa, traditionell musik (78.47+) @sv
broader: Etnomusiikki. Kansanmusiikki
in scheme: YKL - Yleisten kirjastojen luokitusjärjestelmä
narrower: Etnomusiikki. Kansanmusiikki, Venäjä
narrower: Etnomusiikki. Kansanmusiikki, Baltian maat
narrower: Etnomusiikki. Kansanmusiikki, Puola
narrower: Etnomusiikki. Kansanmusiikki, Valko-Venäjä. Ukraina. Moldova
narrower: Etnomusiikki. Kansanmusiikki, Armenia. Azerbaidzan. Georgia
notation: 78.47
preferred label: Ethnic music. Folk music, Eastern Europe @en
preferred label: Traditionell musik. Folkmusik, Östeuropa @sv
scope note: Allmänna verk och samlingar @sv
scope note: Yleisteokset ja kokoelmat

Etnomusiikki. Kansanmusiikki, Venäjä
type: Concept
References: Etnomusiikki. Kansanmusiikki, Armenia. Azerbaidzan. Georgia
References: Etnomusiikki. Kansanmusiikki, Kazakstan. Kirgisia. Tadzikistan. Turkmenistan Uzbekistan
References: Etnomusiikki. Kansanmusiikki, Siperia
type: YKL-luokka
alternative label: Balalaikka, Venäjän etnomusiikki (78.471+)
alternative label: Balalaikka, Venäjän perinnemusiikki (78.471+)
alternative label: Balalajka, Rysslands etnomusik (78.471+) @sv
alternative label: Balalajka, Rysslands traditionella musik (78.471+) @sv
alternative label: Forna Sovjetunionens område, etnomusik (78.471) @sv
alternative label: Forna Sovjetunionens område, traditionell musik (78.471) @sv
alternative label: Neuvostoliiton entinen alue, etnomusiikki (78.471)
alternative label: Neuvostoliiton entinen alue, perinnemusiikki (78.471)
alternative label: Ryssland, etnomusik (78.471) @sv
alternative label: Ryssland, traditionell musik (78.471) @sv
alternative label: Venäjä, etnomusiikki (78.471)
alternative label: Venäjä, perinnemusiikki (78.471)
broader: Etnomusiikki. Kansanmusiikki, Itä-Eurooppa
in scheme: YKL - Yleisten kirjastojen luokitusjärjestelmä
narrower: Venäjän alueella elävien suomensukuisten kansojen etnomusiikki
notation: 78.471
preferred label: Ethnic music. Folk music, Russia @en
preferred label: Traditionell musik. Folkmusik, Ryssland @sv
scope note: Hit även material som behandlar traditionell musik inom den forna Sovjetunionens och OSS' område Hit även traditionell musik av separata små kulturer i Ryssland @sv
scope note: Tähän myös entisen Neuvostoliiton tai IVY:n alueen etnomusiikkia yleensä käsittelevä aineisto Tähän myös Venäjän alueella elävien erillisten pienten kulttuurien etnomusiikki

Venäjän alueella elävien suomensukuisten kansojen etnomusiikki
type: Concept
type: YKL-luokka
alternative label: Finskättade kulturer på Rysslands område, etnomusik (78.4711) @sv
alternative label: Finskättade kulturer på Rysslands område, traditionell musik (78.4711) @sv
alternative label: Suomensukuiset kulttuurit Venäjän alueella, etnomusiikki (78.4711)
alternative label: Suomensukuiset kulttuurit Venäjän alueella, perinnemusiikki (78.4711)
broader: Etnomusiikki. Kansanmusiikki, Venäjä
in scheme: YKL - Yleisten kirjastojen luokitusjärjestelmä
notation: 78.4711
preferred label: Ethnic music of the Finnic peoples in Russia @en
preferred label: Traditionell musik av de finskättade folken i Ryssland @sv

Etnomusiikki. Kansanmusiikki, Baltian maat
type: Concept
type: YKL-luokka
alternative label: Baltian alue, etnomusiikki (78.472)
alternative label: Baltian alue, perinnemusiikki (78.472)
alternative label: Baltikum, etnomusik (78.472) @sv
alternative label: Baltikum, traditionell musik (78.472) @sv
alternative label: Eesti, etnomusiikki (78.472)
alternative label: Eesti, perinnemusiikki (78.472)
alternative label: Estland, etnomusik (78.472) @sv
alternative label: Estland, traditionell musik (78.472) @sv
alternative label: Latvia, etnomusiikki (78.472)
alternative label: Latvia, perinnemusiikki (78.472)
alternative label: Lettland, etnomusik (78.472) @sv
alternative label: Lettland, traditionell musik (78.472) @sv
alternative label: Liettua, etnomusiikki (78.472)
alternative label: Liettua, perinnemusiikki (78.472)
alternative label: Litauen, etnomusik (78.472) @sv
alternative label: Litauen, traditionell musik (78.472) @sv
alternative label: Viro, etnomusiikki (78.472)
alternative label: Viro, perinnemusiikki (78.472)
broader: Etnomusiikki. Kansanmusiikki, Itä-Eurooppa
in scheme: YKL - Yleisten kirjastojen luokitusjärjestelmä
notation: 78.472
preferred label: Ethnic music. Folk music, Baltic countries @en
preferred label: Traditionell musik. Folkmusik, Baltikum @sv
scope note: Estland. Lettland. Litauen @sv
scope note: Viro. Latvia. Liettua

Etnomusiikki. Kansanmusiikki, Puola
type: Concept
type: YKL-luokka
alternative label: Polen, etnomusik (78.473) @sv
alternative label: Polen, traditionell musik (78.473) @sv
alternative label: Puola, etnomusiikki (78.473)
alternative label: Puola, perinnemusiikki (78.473)
broader: Etnomusiikki. Kansanmusiikki, Itä-Eurooppa
in scheme: YKL - Yleisten kirjastojen luokitusjärjestelmä
notation: 78.473
preferred label: Ethnic music. Folk music, Poland @en
preferred label: Traditionell musik. Folkmusik, Polen @sv

Etnomusiikki. Kansanmusiikki, Valko-Venäjä. Ukraina. Moldova
type: Concept
type: YKL-luokka
alternative label: Moldavia, etnomusiikki (78.474)
alternative label: Moldavia, perinnemusiikki (78.474)
alternative label: Moldavien, etnomusik (78.474) @sv
alternative label: Moldavien, traditionell musik (78.474) @sv
alternative label: Moldova, etnomusiikki (78.474)
alternative label: Moldova, etnomusik (78.474) @sv
alternative label: Moldova, perinnemusiikki (78.474)
alternative label: Moldova, traditionell musik (78.474) @sv
alternative label: Ukraina, etnomusiikki (78.474)
alternative label: Ukraina, etnomusik (78.474) @sv
alternative label: Ukraina, perinnemusiikki (78.474)
alternative label: Ukraina, traditionell musik (78.474) @sv
alternative label: Valko-Venäjä, etnomusiikki (78.474)
alternative label: Valko-Venäjä, perinnemusiikki (78.474)
alternative label: Vitryssland, etnomusik (78.474) @sv
alternative label: Vitryssland, traditionell musik (78.474) @sv
broader: Etnomusiikki. Kansanmusiikki, Itä-Eurooppa
in scheme: YKL - Yleisten kirjastojen luokitusjärjestelmä
notation: 78.474
preferred label: Ethnic music. Folk music, Belarus. Ukraine. Moldova @en
preferred label: Traditionell musik. Folkmusik, Vitryssland. Ukraina. Moldova @sv

Etnomusiikki. Kansanmusiikki, Armenia. Azerbaidzan. Georgia
type: Concept
type: YKL-luokka
alternative label: Armenia, etnomusiikki (78.475)
alternative label: Armenia, perinnemusiikki (78.475)
alternative label: Armenien, etnomusik (78.475) @sv
alternative label: Armenien, traditionell musik (78.475) @sv
alternative label: Azerbaidzan, etnomusiikki (78.475)
alternative label: Azerbaidzan, perinnemusiikki (78.475)
alternative label: Azerbajdzjan, etnomusik (78.475) @sv
alternative label: Azerbajdzjan, traditionell musik (78.475) @sv
alternative label: Georgia, etnomusiikki (78.475)
alternative label: Georgia, perinnemusiikki (78.475)
alternative label: Georgien, etnomusik (78.475) @sv
alternative label: Georgien, traditionell musik (78.475) @sv
alternative label: Grusien, etnomusik (78.475) @sv
alternative label: Grusien, traditionell musik (78.475) @sv
alternative label: Gruusia, etnomusiikki (78.475)
alternative label: Gruusia, perinnemusiikki (78.475)
broader: Etnomusiikki. Kansanmusiikki, Itä-Eurooppa
in scheme: YKL - Yleisten kirjastojen luokitusjärjestelmä
notation: 78.475
preferred label: Ethnic music. Folk music, Armenia. Azerbaijan. Georgia @en
preferred label: Traditionell musik. Folkmusik, Armenien. Azerbajdzjan. Georgien @sv

Etnomusiikki. Kansanmusiikki, Aasia. Afrikka. Amerikka. Australia
type: Concept
type: YKL-luokka
broader: Etnomusiikki. Kansanmusiikki
in scheme: YKL - Yleisten kirjastojen luokitusjärjestelmä
narrower: Etnomusiikki. Kansanmusiikki, Aasia
narrower: Etnomusiikki. Kansanmusiikki, Afrikka
narrower: Etnomusiikki. Kansanmusiikki, Amerikka
narrower: Etnomusiikki. Kansanmusiikki, Australia ja Oseania
notation: 78.48
preferred label: Ethnic music. Folk music, Asia. Africa. America. Australia @en
preferred label: Traditionell musik. Folkmusik, Asien. Afrika. Amerika. Australien @sv
scope note: Allmänna verk och samlingar som presenterar icke-europeisk traditionell musik @sv
scope note: Ei-eurooppalaista etnomusiikkia esittelevät yleisteokset ja kokoelmat

Etnomusiikki. Kansanmusiikki, Aasia
type: Concept
type: YKL-luokka
alternative label: Aasia, etnomusiikki (78.481+)
alternative label: Aasia, perinnemusiikki (78.481+)
alternative label: Asien, etnomusik (78.481+) @sv
alternative label: Asien, traditionell musik (78.481+) @sv
broader: Etnomusiikki. Kansanmusiikki, Aasia. Afrikka. Amerikka. Australia
in scheme: YKL - Yleisten kirjastojen luokitusjärjestelmä
narrower: Etnomusiikki. Kansanmusiikki, Etu-Aasia
narrower: Etnomusiikki. Kansanmusiikki, Etelä-Aasia
narrower: Etnomusiikki. Kansanmusiikki, Kaakkois-Aasia
narrower: Etnomusiikki. Kansanmusiikki, Keski-Aasia
narrower: Etnomusiikki. Kansanmusiikki, Siperia
narrower: Etnomusiikki. Kansanmusiikki, Itä-Aasia
notation: 78.481
preferred label: Ethnic music. Folk music, Asia @en
preferred label: Traditionell musik. Folkmusik, Asien @sv
scope note: Allmänna verk och samlingar @sv
scope note: Yleisteokset ja kokoelmat

Etnomusiikki. Kansanmusiikki, Etu-Aasia
type: Concept
type: YKL-luokka
alternative label: Arabialainen musiikki, Aasia (78.4811+)
alternative label: Arabisk musik, Asien (78.4811+) @sv
alternative label: Etu-Aasia, etnomusiikki (78.4811+)
alternative label: Etu-Aasia, perinnemusiikki (78.4811+)
alternative label: Främre Asien, etnomusik (78.4811+) @sv
alternative label: Främre Asien, traditionell musik (78.4811+) @sv
alternative label: Kurder, Främre Asiens etnomusik (78.4811+) @sv
alternative label: Kurder, Främre Asiens traditionella musik (78.4811+) @sv
alternative label: Kurdit, Etu-Aasian etnomusiikki (78.4811+)
alternative label: Kurdit, Etu-Aasian perinnemusiikki (78.4811+)
alternative label: Libanon, etnomusiikki (78.4811)
alternative label: Libanon, etnomusik (78.4811) @sv
alternative label: Libanon, perinnemusiikki (78.4811)
alternative label: Libanon, traditionell musik (78.4811) @sv
broader: Etnomusiikki. Kansanmusiikki, Aasia
in scheme: YKL - Yleisten kirjastojen luokitusjärjestelmä
narrower: Etnomusiikki. Kansanmusiikki, Turkki
narrower: Etnomusiikki. Kansanmusiikki, Israel
narrower: Etnomusiikki. Kansanmusiikki, Syyria. Jordania. Libanon. Irak. Kuwait
narrower: Etnomusiikki. Kansanmusiikki, Iran. Afganistan
narrower: Etnomusiikki. Kansanmusiikki, Saudi-Arabia. Bahrain. Jemen. Oman. Qatar
notation: 78.4811
preferred label: Ethnic music. Folk music, South-West Asia @en
preferred label: Traditionell musik. Folkmusik, Främre Asien @sv
scope note: Allmänna verk och samlingar @sv
scope note: Yleisteokset ja kokoelmat

Etnomusiikki. Kansanmusiikki, Turkki
type: Concept
type: YKL-luokka
alternative label: Cypernturkar, etnomusik (78.48111) @sv
alternative label: Cypernturkar, traditionell musik (78.48111) @sv
alternative label: Kyproksen turkkilaiset, etnomusiikki (78.48111)
alternative label: Kyproksen turkkilaiset, perinnemusiikki (78.48111)
alternative label: Turkiet, etnomusik (78.48111) @sv
alternative label: Turkiet, traditionell musik (78.48111) @sv
alternative label: Turkki, etnomusiikki (78.48111)
alternative label: Turkki, perinnemusiikki (78.48111)
broader: Etnomusiikki. Kansanmusiikki, Etu-Aasia
in scheme: YKL - Yleisten kirjastojen luokitusjärjestelmä
notation: 78.48111
preferred label: Ethnic music. Folk music, Turkey @en
preferred label: Traditionell musik. Folkmusik, Turkiet @sv
scope note: Hit även Cyperns turkiska traditionella musik @sv
scope note: Tähän myös Kyproksen turkkilainen etnomusiikki

Etnomusiikki. Kansanmusiikki, Israel
type: Concept
type: YKL-luokka
alternative label: Israel, etnomusiikki (78.48112)
alternative label: Israel, etnomusik (78.48112) @sv
alternative label: Israel, perinnemusiikki (78.48112)
alternative label: Israel, traditionell musik (78.48112) @sv
alternative label: Judar, etnomusik i Israel (78.48112) @sv
alternative label: Judar, traditionell musik i Israel (78.48112) @sv
alternative label: Juutalaiset, etnomusiikki Israelissa (78.48112)
alternative label: Juutalaiset, perinnemusiikki Israelissa (78.48112)
broader: Etnomusiikki. Kansanmusiikki, Etu-Aasia
in scheme: YKL - Yleisten kirjastojen luokitusjärjestelmä
notation: 78.48112
preferred label: Ethnic music. Folk music, Israel @en
preferred label: Traditionell musik. Folkmusik, Israel @sv

Etnomusiikki. Kansanmusiikki, Syyria. Jordania. Libanon. Irak. Kuwait
type: Concept
type: YKL-luokka
alternative label: Irak, etnomusiikki (78.48113)
alternative label: Irak, etnomusik (78.48113) @sv
alternative label: Irak, perinnemusiikki (78.48113)
alternative label: Irak, traditionell musik (78.48113) @sv
alternative label: Jordania, etnomusiikki (78.48113)
alternative label: Jordania, perinnemusiikki (78.48113)
alternative label: Jordanien, etnomusik (78.48113) @sv
alternative label: Jordanien, traditionell musik (78.48113) @sv
alternative label: Kuwait, etnomusiikki (78.48113)
alternative label: Kuwait, etnomusik (78.48113) @sv
alternative label: Kuwait, perinnemusiikki (78.48113)
alternative label: Kuwait, traditionell musik (78.48113) @sv
alternative label: Syrien, etnomusik (78.48113) @sv
alternative label: Syrien, traditionell musik (78.48113) @sv
alternative label: Syyria, etnomusiikki (78.48113)
alternative label: Syyria, perinnemusiikki (78.48113)
broader: Etnomusiikki. Kansanmusiikki, Etu-Aasia
in scheme: YKL - Yleisten kirjastojen luokitusjärjestelmä
notation: 78.48113
preferred label: Ethnic music. Folk music, Syria. Jordan. Lebanon. Iraq. Kuwait @en
preferred label: Traditionell musik. Folkmusik, Syrien. Jordanien. Libanon. Irak. Kuwait @sv

Etnomusiikki. Kansanmusiikki, Iran. Afganistan
type: Concept
type: YKL-luokka
alternative label: Afganistan, etnomusiikki (78.48114)
alternative label: Afganistan, perinnemusiikki (78.48114)
alternative label: Afghanistan, etnomusik (78.48114) @sv
alternative label: Afghanistan, traditionell musik (78.48114) @sv
alternative label: Iran, etnomusiikki (78.48114)
alternative label: Iran, etnomusik (78.48114) @sv
alternative label: Iran, perinnemusiikki (78.48114)
alternative label: Iran, traditionell musik (78.48114) @sv
broader: Etnomusiikki. Kansanmusiikki, Etu-Aasia
in scheme: YKL - Yleisten kirjastojen luokitusjärjestelmä
notation: 78.48114
preferred label: Ethnic music. Folk music, Iran. Afghanistan @en
preferred label: Traditionell musik. Folkmusik, Iran. Afghanistan @sv

Etnomusiikki. Kansanmusiikki, Saudi-Arabia. Bahrain. Jemen. Oman. Qatar
type: Concept
type: YKL-luokka
alternative label: Arabian niemimaa, etnomusiikki (78.48115)
alternative label: Arabian niemimaa, perinnemusiikki (78.48115)
alternative label: Arabiska halvön, etnomusik (78.48115) @sv
alternative label: Arabiska halvön, traditionell musik (78.48115) @sv
alternative label: Bahrain, etnomusiikki (78.48115)
alternative label: Bahrain, etnomusik (78.48115) @sv
alternative label: Bahrain, perinnemusiikki (78.48115)
alternative label: Bahrain, traditionell musik (78.48115) @sv
alternative label: Jemen, etnomusiikki (78.48115)
alternative label: Jemen, etnomusik (78.48115) @sv
alternative label: Jemen, perinnemusiikki (78.48115)
alternative label: Jemen, traditionell musik (78.48115) @sv
alternative label: Oman, etnomusiikki (78.48115)
alternative label: Oman, etnomusik (78.48115) @sv
alternative label: Oman, perinnemusiikki (78.48115)
alternative label: Oman, traditionell musik (78.48115) @sv
alternative label: Qatar, etnomusiikki (78.48115)
alternative label: Qatar, etnomusik (78.48115) @sv
alternative label: Qatar, perinnemusiikki (78.48115)
alternative label: Qatar, traditionell musik (78.48115) @sv
alternative label: Saudi-Arabia, etnomusiikki (78.48115)
alternative label: Saudi-Arabia, perinnemusiikki (78.48115)
alternative label: Saudi-Arabien, etnomusik (78.48115) @sv
alternative label: Saudi-Arabien, traditionell musik (78.48115) @sv
broader: Etnomusiikki. Kansanmusiikki, Etu-Aasia
in scheme: YKL - Yleisten kirjastojen luokitusjärjestelmä
notation: 78.48115
preferred label: SEthnic music. Folk music, Saudi-Arabia. Bahrain. Yemen. Oman. Qatar @en
preferred label: Traditionell musik. Folkmusik, Saudi-Arabien. Bahrain. Jemen. Oman. Qatar @sv

Etnomusiikki. Kansanmusiikki, Etelä-Aasia
type: Concept
type: YKL-luokka
alternative label: Etelä-Aasia, etnomusiikki (78.4812)
alternative label: Etelä-Aasia, perinnemusiikki (78.4812)
alternative label: Sydasien, etnomusik (78.4812) @sv
alternative label: Sydasien, traditionell musik (78.4812) @sv
broader: Etnomusiikki. Kansanmusiikki, Aasia
in scheme: YKL - Yleisten kirjastojen luokitusjärjestelmä
narrower: Etnomusiikki. Kansanmusiikki, Intia. Kashmir
narrower: Etnomusiikki. Kansanmusiikki, Pakistan. Bangladesh
narrower: Etnomusiikki. Kansanmusiikki, Himalajan alue
narrower: Etnomusiikki. Kansanmusiikki, Sri Lanka. Malediivit
notation: 78.4812
preferred label: Ethnic music. Folk music, South Asia @en
preferred label: Traditionell musik. Folkmusik, Sydasien @sv
scope note: Allmänna verk och samlingar @sv
scope note: Yleisteokset ja kokoelmat

Etnomusiikki. Kansanmusiikki, Intia. Kashmir
type: Concept
type: YKL-luokka
alternative label: Indien, etnomusik (78.48121) @sv
alternative label: Indien, traditionell musik (78.48121) @sv
alternative label: Intia, etnomusiikki (78.48121)
alternative label: Intia, perinnemusiikki (78.48121)
alternative label: Kashmir, etnomusiikki (78.48121)
alternative label: Kashmir, etnomusik (78.48121) @sv
alternative label: Kashmir, perinnemusiikki (78.48121)
alternative label: Kashmir, traditionell musik (78.48121) @sv
alternative label: Sitar, Indiens etnomusik (78.48121) @sv
alternative label: Sitar, Indiens traditionella musik (78.48121) @sv
alternative label: Sitar, Intian etnomusiikki (78.48121)
alternative label: Sitar, Intian perinnemusiikki (78.48121)
alternative label: Tanbur, Indisk etnomusik (78.48121) @sv
alternative label: Tanbur, Indisk traditionell musik (78.48121) @sv
alternative label: Tanpura, Intian etnomusiikki (78.48121)
alternative label: Tanpura, Intian perinnemusiikki (78.48121)
broader: Etnomusiikki. Kansanmusiikki, Etelä-Aasia
in scheme: YKL - Yleisten kirjastojen luokitusjärjestelmä
notation: 78.48121
preferred label: Ethnic music. Folk music, India. Kashmir @en
preferred label: Traditionell musik. Folkmusik, Indien. Kashmir @sv

Etnomusiikki. Kansanmusiikki, Pakistan. Bangladesh
type: Concept
type: YKL-luokka
alternative label: Bangladesh, etnomusiikki (78.48122)
alternative label: Bangladesh, etnomusik (78.48122) @sv
alternative label: Bangladesh, perinnemusiikki (78.48122)
alternative label: Bangladesh, traditionell musik (78.48122) @sv
alternative label: Pakistan, etnomusiikki (78.48122)
alternative label: Pakistan, etnomusik (78.48122) @sv
alternative label: Pakistan, perinnemusiikki (78.48122)
alternative label: Pakistan, traditionell musik (78.48122) @sv
broader: Etnomusiikki. Kansanmusiikki, Etelä-Aasia
in scheme: YKL - Yleisten kirjastojen luokitusjärjestelmä
notation: 78.48122
preferred label: Ethnic music. Folk music, Pakistan. Bangladesh @en
preferred label: Traditionell musik. Folkmusik, Pakistan. Bangladesh @sv

Etnomusiikki. Kansanmusiikki, Himalajan alue
type: Concept
type: YKL-luokka
alternative label: Bhutan, etnomusiikki (78.48123)
alternative label: Bhutan, etnomusik (78.48123) @sv
alternative label: Bhutan, perinnemusiikki (78.48123)
alternative label: Bhutan, traditionell musik (78.48123) @sv
alternative label: Himalajan alue, etnomusiikki (78.48123)
alternative label: Himalajan alue, perinnemusiikki (78.48123)
alternative label: Himalayaområdet, etnomusik (78.48123) @sv
alternative label: Himalayaområdet, traditionell musik (78.48123) @sv
alternative label: Nepal, etnomusiikki (78.48123)
alternative label: Nepal, etnomusik (78.48123) @sv
alternative label: Nepal, perinnemusiikki (78.48123)
alternative label: Nepal, traditionell musik (78.48123) @sv
alternative label: Tibet, etnomusik (78.48123) @sv
alternative label: Tibet, traditionell musik (78.48123) @sv
alternative label: Tiibet, etnomusiikki (78.48123)
alternative label: Tiibet, perinnemusiikki (78.48123)
broader: Etnomusiikki. Kansanmusiikki, Etelä-Aasia
in scheme: YKL - Yleisten kirjastojen luokitusjärjestelmä
notation: 78.48123
preferred label: Ethnic music. Folk music, Himalayan area @en
preferred label: Traditionell musik. Folkmusik, Himalaya @sv

Etnomusiikki. Kansanmusiikki, Sri Lanka. Malediivit
type: Concept
type: YKL-luokka
alternative label: Maldiverna, etnomusik (78.48124) @sv
alternative label: Maldiverna, traditionell musik (78.48124) @sv
alternative label: Malediivit, etnomusiikki (78.48124)
alternative label: Malediivit, perinnemusiikki (78.48124)
alternative label: Sri Lanka, etnomusiikki (78.48124)
alternative label: Sri Lanka, etnomusik (78.48124) @sv
alternative label: Sri Lanka, perinnemusiikki (78.48124)
alternative label: Sri Lanka, traditionell musik (78.48124) @sv
broader: Etnomusiikki. Kansanmusiikki, Etelä-Aasia
in scheme: YKL - Yleisten kirjastojen luokitusjärjestelmä
notation: 78.48124
preferred label: Ethnic music. Folk music, Sri Lanka. Maldives @en
preferred label: Traditionell musik. Folkmusik, Sri Lanka. Maldiverna @sv

Etnomusiikki. Kansanmusiikki, Kaakkois-Aasia
type: Concept
type: YKL-luokka
alternative label: Kaakkois-Aasia, etnomusiikki (78.4813)
alternative label: Kaakkois-Aasia, perinnemusiikki (78.4813)
alternative label: Sydostasien, etnomusik (78.4813) @sv
alternative label: Sydostasien, traditionell musik (78.4813) @sv
broader: Etnomusiikki. Kansanmusiikki, Aasia
in scheme: YKL - Yleisten kirjastojen luokitusjärjestelmä
narrower: Etnomusiikki. Kansanmusiikki, Myanmar
narrower: Etnomusiikki. Kansanmusiikki, Thaimaa. Laos. Kambodza. Vietnam
narrower: Etnomusiikki. Kansanmusiikki, Indonesia. Malesia. Brunei
narrower: Etnomusiikki. Kansanmusiikki, Filippiinit
notation: 78.4813
preferred label: Ethnic music. Folk music, South-East Asia @en
preferred label: Traditionell musik. Folkmusik, Sydostasien @sv
scope note: Allmänna verk och samlingar @sv
scope note: Yleisteokset ja kokoelmat

Etnomusiikki. Kansanmusiikki, Myanmar
type: Concept
type: YKL-luokka
alternative label: Myanmar, etnomusiikki (78.48131)
alternative label: Myanmar, etnomusik (78.48131) @sv
alternative label: Myanmar, perinnemusiikki (78.48131)
alternative label: Myanmar, traditionell musik (78.48131) @sv
broader: Etnomusiikki. Kansanmusiikki, Kaakkois-Aasia
in scheme: YKL - Yleisten kirjastojen luokitusjärjestelmä
notation: 78.48131
preferred label: Ethnic music. Folk music, Myanmar @en
preferred label: Traditionell musik. Folkmusik, Myanmar @sv

Etnomusiikki. Kansanmusiikki, Thaimaa. Laos. Kambodza. Vietnam
type: Concept
type: YKL-luokka
alternative label: Kambodja, etnomusik (78.48132) @sv
alternative label: Kambodja, traditionell musik (78.48132) @sv
alternative label: Kambodza, etnomusiikki (78.48132)
alternative label: Kambodza, perinnemusiikki (78.48132)
alternative label: Laos, etnomusiikki (78.48132)
alternative label: Laos, etnomusik (78.48132) @sv
alternative label: Laos, perinnemusiikki (78.48132)
alternative label: Laos, traditionell musik (78.48132) @sv
alternative label: Thailand, etnomusik (78.48132) @sv
alternative label: Thailand, traditionell musik (78.48132) @sv
alternative label: Thaimaa, etnomusiikki (78.48132)
alternative label: Thaimaa, perinnemusiikki (78.48132)
alternative label: Vietnam, etnomusiikki (78.48132)
alternative label: Vietnam, etnomusik (78.48132) @sv
alternative label: Vietnam, perinnemusiikki (78.48132)
alternative label: Vietnam, traditionell musik (78.48132) @sv
broader: Etnomusiikki. Kansanmusiikki, Kaakkois-Aasia
in scheme: YKL - Yleisten kirjastojen luokitusjärjestelmä
notation: 78.48132
preferred label: Ethnic music. Folk music, Thailand. Laos. Cambodia. Viet Nam @en
preferred label: Traditionell musik. Folkmusik, Thailand. Laos. Kambodja. Vietnam @sv

Etnomusiikki. Kansanmusiikki, Indonesia. Malesia. Brunei
type: Concept
type: YKL-luokka
alternative label: Brunei, etnomusiikki (78.48133)
alternative label: Brunei, etnomusik (78.48133) @sv
alternative label: Brunei, perinnemusiikki (78.48133)
alternative label: Brunei, traditionell musik (78.48133) @sv
alternative label: Gamelan-musiikki (78.48133)
alternative label: Gamelan-musik (78.48133) @sv
alternative label: Gamelan-orkester, javansk (78.48133) @sv
alternative label: Gamelan-orkesteri, jaavalainen (78.48133)
alternative label: Indonesia, etnomusiikki (78.48133)
alternative label: Indonesia, perinnemusiikki (78.48133)
alternative label: Indonesien, etnomusik (78.48133) @sv
alternative label: Indonesien, traditionell musik (78.48133) @sv
alternative label: Malaysia, etnomusik (78.48133) @sv
alternative label: Malaysia, traditionell musik (78.48133) @sv
alternative label: Malesia, etnomusiikki (78.48133)
alternative label: Malesia, perinnemusiikki (78.48133)
alternative label: Singapore, etnomusiikki (78.48133)
alternative label: Singapore, etnomusik (78.48133) @sv
alternative label: Singapore, perinnemusiikki (78.48133)
alternative label: Singapore, traditionell musik (78.48133) @sv
broader: Etnomusiikki. Kansanmusiikki, Kaakkois-Aasia
in scheme: YKL - Yleisten kirjastojen luokitusjärjestelmä
notation: 78.48133
preferred label: Ethnic music. Folk music, Indonesia. Malaysia. Brunei @en
preferred label: Traditionell musik. Folkmusik, Indonesien. Malaysia. Brunei @sv

Etnomusiikki. Kansanmusiikki, Filippiinit
type: Concept
type: YKL-luokka
alternative label: Filippiinit, etnomusiikki (78.48134)
alternative label: Filippiinit, perinnemusiikki (78.48134)
alternative label: Filippinerna, etnomusik (78.48134) @sv
alternative label: Filippinerna, traditionell musik (78.48134) @sv
broader: Etnomusiikki. Kansanmusiikki, Kaakkois-Aasia
in scheme: YKL - Yleisten kirjastojen luokitusjärjestelmä
notation: 78.48134
preferred label: Ethnic music. Folk music, Philippines @en
preferred label: Traditionell musik. Folkmusik, Filippinerna @sv

Etnomusiikki. Kansanmusiikki, Keski-Aasia
type: Concept
type: YKL-luokka
alternative label: Centralasien, etnomusik (78.4814+) @sv
alternative label: Centralasien, traditionell musik (78.4814+) @sv
alternative label: Keski-Aasia, etnomusiikki (78.4814+)
alternative label: Keski-Aasia, perinnemusiikki (78.4814+)
broader: Etnomusiikki. Kansanmusiikki, Aasia
in scheme: YKL - Yleisten kirjastojen luokitusjärjestelmä
narrower: Etnomusiikki. Kansanmusiikki, Mongolia
narrower: Etnomusiikki. Kansanmusiikki, Kazakstan. Kirgisia. Tadzikistan. Turkmenistan Uzbekistan
notation: 78.4814
preferred label: Ethnic music. Folk music, Central Asia @en
preferred label: Traditionell musik. Folkmusik, Centralasien @sv
scope note: Allmänna verk och samlingar @sv
scope note: Yleisteokset ja kokoelmat

Etnomusiikki. Kansanmusiikki, Mongolia
type: Concept
type: YKL-luokka
alternative label: Mongolia, etnomusiikki (78.48141)
alternative label: Mongolia, perinnemusiikki (78.48141)
alternative label: Mongoliet, etnomusik (78.48141) @sv
alternative label: Mongoliet, traditionell musik (78.48141) @sv
broader: Etnomusiikki. Kansanmusiikki, Keski-Aasia
in scheme: YKL - Yleisten kirjastojen luokitusjärjestelmä
notation: 78.48141
preferred label: Ethnic music. Folk music, Mongolia @en
preferred label: Traditionell musik. Folkmusik, Mongoliet @sv

Etnomusiikki. Kansanmusiikki, Kazakstan. Kirgisia. Tadzikistan. Turkmenistan Uzbekistan
type: Concept
type: YKL-luokka
alternative label: Kazahstan, etnomusiikki (78.48142)
alternative label: Kazahstan, perinnemusiikki (78.48142)
alternative label: Kazakstan, etnomusik (78.48142) @sv
alternative label: Kazakstan, traditionell musik (78.48142) @sv
alternative label: Kirgisia, etnomusiikki (78.48142)
alternative label: Kirgisia, perinnemusiikki (78.48142)
alternative label: Kirgisien, etnomusik (78.48142) @sv
alternative label: Kirgisien, traditionell musik (78.48142) @sv
alternative label: Tadzikistan, etnomusiikki (78.48142)
alternative label: Tadzikistan, perinnemusiikki (78.48142)
alternative label: Tadzjikistan, etnomusik (78.48142) @sv
alternative label: Tadzjikistan, traditionell musik (78.48142) @sv
alternative label: Turkmenia, etnomusiikki (78.48142)
alternative label: Turkmenia, perinnemusiikki (78.48142)
alternative label: Turkmenien, etnomusik (78.48142) @sv
alternative label: Turkmenien, traditionell musik (78.48142) @sv
alternative label: Uzbekistan, etnomusiikki (78.48142)
alternative label: Uzbekistan, etnomusik (78.48142) @sv
alternative label: Uzbekistan, perinnemusiikki (78.48142)
alternative label: Uzbekistan, traditionell musik (78.48142) @sv
broader: Etnomusiikki. Kansanmusiikki, Keski-Aasia
in scheme: YKL - Yleisten kirjastojen luokitusjärjestelmä
notation: 78.48142
preferred label: Ethnic music. Folk music, Kazakhstan. Kyrgyzstan. Tajikistan. Turkmenistan. Uzbekistan @en
preferred label: Traditionell musik. Folkmusik, Kazakstan. Kirgisien. Tadzjikistan. Turkmenistan. Uzbekistan @sv

Etnomusiikki. Kansanmusiikki, Siperia
type: Concept
type: YKL-luokka
alternative label: Sibirien, etnomusik (78.4815) @sv
alternative label: Sibirien, traditionell musik (78.4815) @sv
alternative label: Siperia, etnomusiikki (78.4815)
alternative label: Siperia, perinnemusiikki (78.4815)
broader: Etnomusiikki. Kansanmusiikki, Aasia
in scheme: YKL - Yleisten kirjastojen luokitusjärjestelmä
notation: 78.4815
preferred label: Ethnic music. Folk music, Siberia @en
preferred label: Traditionell musik. Folkmusik, Sibirien @sv

Etnomusiikki. Kansanmusiikki, Itä-Aasia
type: Concept
type: YKL-luokka
alternative label: Itä-Aasia, etnomusiikki (78.4816+)
alternative label: Itä-Aasia, perinnemusiikki (78.4816+)
alternative label: Östasien, etnomusik (78.4816+) @sv
alternative label: Östasien, traditionell musik (78.4816+) @sv
broader: Etnomusiikki. Kansanmusiikki, Aasia
in scheme: YKL - Yleisten kirjastojen luokitusjärjestelmä
narrower: Etnomusiikki. Kansanmusiikki, Kiina
narrower: Etnomusiikki. Kansanmusiikki, Korea
narrower: Etnomusiikki. Kansanmusiikki. Japani
notation: 78.4816
preferred label: Ethnic music. Folk music, East Asia @en
preferred label: Traditionell musik. Folkmusik, Ostasien @sv
scope note: Allmänna verk och församlingar @sv
scope note: Yleisteokset ja kokoelmat

Etnomusiikki. Kansanmusiikki, Kiina
type: Concept
References: Etnomusiikki. Kansanmusiikki, Himalajan alue
type: YKL-luokka
alternative label: Kiina, etnomusiikki (78.48161)
alternative label: Kiina, perinnemusiikki (78.48161)
alternative label: Kina, etnomusik (78.48161) @sv
alternative label: Kina, traditionell musik (78.48161) @sv
alternative label: Taiwan, etnomusiikki (78.48161)
alternative label: Taiwan, etnomusik (78.48161) @sv
alternative label: Taiwan, perinnemusiikki (78.48161)
alternative label: Taiwan, traditionell musik (78.48161) @sv
broader: Etnomusiikki. Kansanmusiikki, Itä-Aasia
in scheme: YKL - Yleisten kirjastojen luokitusjärjestelmä
notation: 78.48161
preferred label: Ethnic music. Folk music, China @en
preferred label: Traditionell musik. Folkmusik, Kina @sv

Etnomusiikki. Kansanmusiikki, Korea
type: Concept
type: YKL-luokka
alternative label: Korea, etnomusiikki (78.48162)
alternative label: Korea, etnomusik (78.48162) @sv
alternative label: Korea, perinnemusiikki (78.48162)
alternative label: Korea, traditionell musik (78.48162) @sv
broader: Etnomusiikki. Kansanmusiikki, Itä-Aasia
in scheme: YKL - Yleisten kirjastojen luokitusjärjestelmä
notation: 78.48162
preferred label: Ethnic music. Folk music, Korea @en
preferred label: Traditionell musik. Folkmusik, Korea @sv

Etnomusiikki. Kansanmusiikki. Japani
type: Concept
type: YKL-luokka
alternative label: Japan, etnomusik (78.48163) @sv
alternative label: Japan, traditionell musik (78.48163) @sv
alternative label: Japani, etnomusiikki (78.48163)
alternative label: Japani, perinnemusiikki (78.48163)
broader: Etnomusiikki. Kansanmusiikki, Itä-Aasia
in scheme: YKL - Yleisten kirjastojen luokitusjärjestelmä
notation: 78.48163
preferred label: Ethnic music. Folk music, Japan @en
preferred label: Traditionell musik. Folkmusik, Japan @sv

Etnomusiikki. Kansanmusiikki, Afrikka
type: Concept
type: YKL-luokka
alternative label: Afrika, etnomusik (78.482+) @sv
alternative label: Afrika, traditionell musik (78.482+) @sv
alternative label: Afrikka, etnomusiikki (78.482+)
alternative label: Afrikka, perinnemusiikki (78.482+)
broader: Etnomusiikki. Kansanmusiikki, Aasia. Afrikka. Amerikka. Australia
in scheme: YKL - Yleisten kirjastojen luokitusjärjestelmä
narrower: Etnomusiikki. Kansanmusiikki, Pohjois-Afrikka
narrower: Etnomusiikki. Kansanmusiikki, Länsi-Afrikka
narrower: Etnomusiikki. Kansanmusiikki, Keski-Afrikka
narrower: Etnomusiikki. Kansanmusiikki, Itä-Afrikka
narrower: Etnomusiikki. Kansanmusiikki, Etelä-Afrikka
narrower: Etnomusiikki. Kansanmusiikki, Afrikan saaret
notation: 78.482
preferred label: Ethnic music. Folk music, Africa @en
preferred label: Traditionell musik. Folkmusik, Afrika @sv
scope note: Allmänna verk och församlingar @sv
scope note: Yleisteokset ja kokoelmat

Etnomusiikki. Kansanmusiikki, Pohjois-Afrikka
type: Concept
type: YKL-luokka
alternative label: Algeria, etnomusiikki (78.4821)
alternative label: Algeria, perinnemusiikki (78.4821)
alternative label: Algeriet, etnomusik (78.4821) @sv
alternative label: Algeriet, traditionell musik (78.4821) @sv
alternative label: Arabialainen musiikki, Pohjois-Afrikka (78.4821)
alternative label: Arabisk musik, Norra Afrika (78.4821) @sv
alternative label: Egypten, etnomusik (78.4821) @sv
alternative label: Egypten, traditionell musik (78.4821) @sv
alternative label: Egypti, etnomusiikki (78.4821)
alternative label: Egypti, perinnemusiikki (78.4821)
alternative label: Marocko, etnomusik (78.4821) @sv
alternative label: Marocko, traditionell musik (78.4821) @sv
alternative label: Marokko, etnomusiikki (78.4821)
alternative label: Marokko, perinnemusiikki (78.4821)
alternative label: Nordafrika, etnomusik (78.4821) @sv
alternative label: Nordafrika, traditionell musik (78.4821) @sv
alternative label: Pohjois-Afrikka, etnomusiikki (78.4821)
alternative label: Pohjois-Afrikka, perinnemusiikki (78.4821)
alternative label: Sudan, etnomusiikki (78.4821)
alternative label: Sudan, etnomusik (78.4821) @sv
alternative label: Sudan, perinnemusiikki (78.4821)
alternative label: Sudan, traditionell musik (78.4821) @sv
alternative label: Tunisia, etnomusiikki (78.4821)
alternative label: Tunisia, perinnemusiikki (78.4821)
alternative label: Tunisien, etnomusik (78.4821) @sv
alternative label: Tunisien, traditionell musik (78.4821) @sv
broader: Etnomusiikki. Kansanmusiikki, Afrikka
in scheme: YKL - Yleisten kirjastojen luokitusjärjestelmä
notation: 78.4821
preferred label: Ethnic music. Folk music, North Africa @en
preferred label: Traditionell musik. Folkmusik, Nordafrika @sv
scope note: Algeria. Egypti. Libya. Marokko. Sudan. Tunisia Tähän myös Saharan alue yleensä
scope note: Algeriet. Egypten. Libyen. Marocko. Sudan. Tunisien Hit även Sahararegionen i allmänhet @sv

Etnomusiikki. Kansanmusiikki, Länsi-Afrikka
type: Concept
type: YKL-luokka
alternative label: Benin, etnomusiikki (78.4825)
alternative label: Benin, etnomusik (78.4825) @sv
alternative label: Benin, perinnemusiikki (78.4825)
alternative label: Benin, traditionell musik (78.4825) @sv
alternative label: Burkina Faso, etnomusiikki (78.4825)
alternative label: Burkina Faso, etnomusik (78.4825) @sv
alternative label: Burkina Faso, perinnemusiikki (78.4825)
alternative label: Burkina Faso, traditionell musik (78.4825) @sv
alternative label: Elfenbenskusten, etnomusik (78.4825) @sv
alternative label: Elfenbenskusten, traditionell musik (78.4825) @sv
alternative label: Gambia, etnomusiikki (78.4825)
alternative label: Gambia, etnomusik (78.4825) @sv
alternative label: Gambia, perinnemusiikki (78.4825)
alternative label: Gambia, traditionell musik (78.4825) @sv
alternative label: Ghana, etnomusiikki (78.4825)
alternative label: Ghana, etnomusik (78.4825) @sv
alternative label: Ghana, perinnemusiikki (78.4825)
alternative label: Ghana, traditionell musik (78.4825) @sv
alternative label: Guinea, etnomusiikki (78.4825)
alternative label: Guinea, etnomusik (78.4825) @sv
alternative label: Guinea, perinnemusiikki (78.4825)
alternative label: Guinea, traditionell musik (78.4825) @sv
alternative label: Guinea-Bissau, etnomusiikki (78.4825)
alternative label: Guinea-Bissau, etnomusik (78.4825) @sv
alternative label: Guinea-Bissau, perinnemusiikki (78.4825)
alternative label: Guinea-Bissau, traditionell musik (78.4825) @sv
alternative label: Liberia, etnomusiikki (78.4825)
alternative label: Liberia, etnomusik (78.4825) @sv
alternative label: Liberia, perinnemusiikki (78.4825)
alternative label: Liberia, traditionell musik (78.4825) @sv
alternative label: Länsi-Afrikka, etnomusiikki (78.4825)
alternative label: Länsi-Afrikka, perinnemusiikki (78.4825)
alternative label: Mali, etnomusiikki (78.4825)
alternative label: Mali, etnomusik (78.4825) @sv
alternative label: Mali, perinnemusiikki (78.4825)
alternative label: Mali, traditionell musik (78.4825) @sv
alternative label: Mauretanien, etnomusik (78.4825) @sv
alternative label: Mauretanien, traditionell musik (78.4825) @sv
alternative label: Mauritania, etnomusiikki (78.4825)
alternative label: Mauritania, perinnemusiikki (78.4825)
alternative label: Niger, etnomusiikki (78.4825)
alternative label: Niger, etnomusik (78.4825) @sv
alternative label: Niger, perinnemusiikki (78.4825)
alternative label: Niger, traditionell musik (78.4825) @sv
alternative label: Nigeria, etnomusiikki (78.4825)
alternative label: Nigeria, etnomusik (78.4825) @sv
alternative label: Nigeria, perinnemusiikki (78.4825)
alternative label: Nigeria, traditionell musik (78.4825) @sv
alternative label: Norsunluurannikko, etnomusiikki (78.4825)
alternative label: Norsunluurannikko, perinnemusiikki (78.4825)
alternative label: Senegal, etnomusiikki (78.4825)
alternative label: Senegal, etnomusik (78.4825) @sv
alternative label: Senegal, perinnemusiikki (78.4825)
alternative label: Senegal, traditionell musik (78.4825) @sv
alternative label: Sierra Leone, etnomusiikki (78.4825)
alternative label: Sierra Leone, etnomusik (78.4825) @sv
alternative label: Sierra Leone, perinnemusiikki (78.4825)
alternative label: Sierra Leone, traditionell musik (78.4825) @sv
alternative label: Togo, etnomusiikki (78.4825)
alternative label: Togo, etnomusik (78.4825) @sv
alternative label: Togo, perinnemusiikki (78.4825)
alternative label: Togo, traditionell musik (78.4825) @sv
alternative label: Västafrika, etnomusik (78.4825) @sv
alternative label: Västafrika, traditionell musik (78.4825) @sv
broader: Etnomusiikki. Kansanmusiikki, Afrikka
in scheme: YKL - Yleisten kirjastojen luokitusjärjestelmä
notation: 78.4825
preferred label: Ethnic music. Folk music, West Africa @en
preferred label: Traditionell musik. Folkmusik, Västafrika @sv
scope note: Benin. Burkina Faso. Gambia. Ghana. Guinea Guinea-Bissau. Liberia. Mali. Mauritania. Niger Nigeria. Norsunluurannikko. Senegal. Sierra Leone Togo
scope note: Benin. Burkina Faso. Gambia. Ghana. Guinea. Guinea-Bissau. Liberia. Mali. Mauretanien. Niger. Nigeria. Elfenbenskusten. Senegal. Sierra Leone. Togo @sv

Etnomusiikki. Kansanmusiikki, Keski-Afrikka
type: Concept
type: YKL-luokka
alternative label: Angola, etnomusiikki (78.4826)
alternative label: Angola, etnomusik (78.4826) @sv
alternative label: Angola, perinnemusiikki (78.4826)
alternative label: Angola, traditionell musik (78.4826) @sv
alternative label: Burundi, Centralafrikas etnomusik (78.4826) @sv
alternative label: Burundi, Centralafrikas traditionella musik (78.4826) @sv
alternative label: Burundi, Keski-Afrikan etnomusiikki (78.4826)
alternative label: Burundi, Keski-Afrikan perinnemusiikki (78.4826)
alternative label: Centralafrika, etnomusik (78.4826) @sv
alternative label: Centralafrika, traditionell musik (78.4826) @sv
alternative label: Centralafrikanska republiken, etnomusik (78.4826) @sv
alternative label: Centralafrikanska republiken, traditionell musik (78.4826) @sv
alternative label: Ekvatorialguinea, etnomusik (78.4826) @sv
alternative label: Ekvatorialguinea, traditionell musik (78.4826) @sv
alternative label: Gabon, etnomusiikki (78.4826)
alternative label: Gabon, etnomusik (78.4826) @sv
alternative label: Gabon, perinnemusiikki (78.4826)
alternative label: Gabon, traditionell musik (78.4826) @sv
alternative label: Kamerun, etnomusiikki (78.4826)
alternative label: Kamerun, etnomusik (78.4826) @sv
alternative label: Kamerun, perinnemusiikki (78.4826)
alternative label: Kamerun, traditionell musik (78.4826) @sv
alternative label: Keski-Afrikan tasavalta, etnomusiikki (78.4826)
alternative label: Keski-Afrikan tasavalta, perinnemusiikki (78.4826)
alternative label: Keski-Afrikka, etnomusiikki (78.4826)
alternative label: Keski-Afrikka, perinnemusiikki (78.4826)
alternative label: Kongo, etnomusiikki (78.4826)
alternative label: Kongo, etnomusik (78.4826) @sv
alternative label: Kongo, perinnemusiikki (78.4826)
alternative label: Kongo, traditionell musik (78.4826) @sv
alternative label: Päiväntasaajan Guinea, etnomusiikki (78.4826)
alternative label: Päiväntasaajan Guinea, perinnemusiikki (78.4826)
alternative label: Ruanda, etnomusiikki (78.4826)
alternative label: Ruanda, etnomusik (78.4826) @sv
alternative label: Ruanda, perinnemusiikki (78.4826)
alternative label: Ruanda, traditionell musik (78.4826) @sv
alternative label: Sambia, etnomusiikki (78.4826)
alternative label: Sambia, perinnemusiikki (78.4826)
alternative label: Tchad, etnomusik (78.4826) @sv
alternative label: Tchad, traditionell musik (78.4826) @sv
alternative label: Tsad, etnomusiikki (78.4826)
alternative label: Tsad, perinnemusiikki (78.4826)
alternative label: Uganda, etnomusiikki (78.4826)
alternative label: Uganda, etnomusik (78.4826) @sv
alternative label: Uganda, perinnemusiikki (78.4826)
alternative label: Uganda, traditionell musik (78.4826) @sv
alternative label: Zaire, etnomusiikki (78.4826)
alternative label: Zaire, etnomusik (78.4826) @sv
alternative label: Zaire, perinnemusiikki (78.4826)
alternative label: Zaire, traditionell musik (78.4826) @sv
alternative label: Zambia, etnomusik (78.4826) @sv
alternative label: Zambia, traditionell musik (78.4826) @sv
broader: Etnomusiikki. Kansanmusiikki, Afrikka
in scheme: YKL - Yleisten kirjastojen luokitusjärjestelmä
notation: 78.4826
preferred label: Ethnic music. Folk music, Central Africa @en
preferred label: Traditionell musik. Folkmusik, Centralafrika @sv
scope note: Angola. Burundi. Gabon. Kamerun. Keski-Afrikan tasavalta. Kongo. Päiväntasaajan Guinea. Ruanda. Sambia. Tsad. Uganda
scope note: Angola. Centralafrikanska republiken. Burundi. Ekvatorialguinea. Gabon. Kamerun. Kongo. Ruanda. Tchad @sv

Etnomusiikki. Kansanmusiikki, Itä-Afrikka
type: Concept
type: YKL-luokka
alternative label: Afrikan sarven alue, etnomusiikki (78.4827)
alternative label: Afrikan sarven alue, perinnemusiikki (78.4827)
alternative label: Afrikas horn, etnomusik (78.4827) @sv
alternative label: Afrikas horn, traditionell musik (78.4827) @sv
alternative label: Burundi, Itä-Afrikan etnomusiikki (78.4827)
alternative label: Burundi, Itä-Afrikan perinnemusiikki (78.4827)
alternative label: Burundi, Östafrikas etnomusik (78.4827) @sv
alternative label: Burundi, Östafrikas traditionella musik (78.4827) @sv
alternative label: Djibouti, etnomusiikki (78.4827)
alternative label: Djibouti, etnomusik (78.4827) @sv
alternative label: Djibouti, perinnemusiikki (78.4827)
alternative label: Djibouti, traditionell musik (78.4827) @sv
alternative label: Etiopia, etnomusiikki (78.4827)
alternative label: Etiopia, perinnemusiikki (78.4827)
alternative label: Etiopien, etnomusik (78.4827) @sv
alternative label: Etiopien, traditionell musik (78.4827) @sv
alternative label: Itä-Afrikka, etnomusiikki (78.4827)
alternative label: Itä-Afrikka, perinnemusiikki (78.4827)
alternative label: Kenia, etnomusiikki (78.4827)
alternative label: Kenia, perinnemusiikki (78.4827)
alternative label: Kenya, etnomusik (78.4827) @sv
alternative label: Kenya, traditionell musik (78.4827) @sv
alternative label: Malawi, etnomusiikki (78.4827)
alternative label: Malawi, etnomusik (78.4827) @sv
alternative label: Malawi, perinnemusiikki (78.4827)
alternative label: Malawi, traditionell musik (78.4827) @sv
alternative label: Mosambik, etnomusiikki (78.4827)
alternative label: Mosambik, perinnemusiikki (78.4827)
alternative label: Moçambique, etnomusik (78.4827) @sv
alternative label: Moçambique, traditionell musik (78.4827) @sv
alternative label: Somalia, etnomusiikki (78.4827)
alternative label: Somalia, etnomusik (78.4827) @sv
alternative label: Somalia, perinnemusiikki (78.4827)
alternative label: Somalia, traditionell musik (78.4827) @sv
alternative label: Tansania, etnomusiikki (78.4827)
alternative label: Tansania, perinnemusiikki (78.4827)
alternative label: Tanzania, etnomusik (78.4827) @sv
alternative label: Tanzania, traditionell musik (78.4827) @sv
alternative label: Östafrika, etnomusik (78.4827) @sv
alternative label: Östafrika, traditionell musik (78.4827) @sv
broader: Etnomusiikki. Kansanmusiikki, Afrikka
in scheme: YKL - Yleisten kirjastojen luokitusjärjestelmä
notation: 78.4827
preferred label: Ethnic music. Folk music, East Africa @en
preferred label: Traditionell musik. Folkmusik, Östafrika @sv
scope note: Burundi. Djibouti. Etiopia. Kenia. Malawi. Mosambik Somalia Tansania
scope note: Burundi. Djibouti. Etiopien. Kenya. Malawi. Moçambique. Somalia. Tanzania. Uganda @sv

Etnomusiikki. Kansanmusiikki, Etelä-Afrikka
type: Concept
type: YKL-luokka
alternative label: Botswana, etnomusiikki (78.4828)
alternative label: Botswana, etnomusik (78.4828) @sv
alternative label: Botswana, perinnemusiikki (78.4828)
alternative label: Botswana, traditionell musik (78.4828) @sv
alternative label: Etelä-Afrikan tasavalta, etnomusiikki (78.4828)
alternative label: Etelä-Afrikan tasavalta, perinnemusiikki (78.4828)
alternative label: Etelä-Afrikka, etnomusiikki (78.4828)
alternative label: Etelä-Afrikka, perinnemusiikki (78.4828)
alternative label: Lesotho, etnomusiikki (78.4828)
alternative label: Lesotho, etnomusik (78.4828) @sv
alternative label: Lesotho, perinnemusiikki (78.4828)
alternative label: Lesotho, traditionell musik (78.4828) @sv
alternative label: Namibia, etnomusiikki (78.4828)
alternative label: Namibia, etnomusik (78.4828) @sv
alternative label: Namibia, perinnemusiikki (78.4828)
alternative label: Namibia, traditionell musik (78.4828) @sv
alternative label: Swaziland, etnomusik (78.4828) @sv
alternative label: Swaziland, traditionell musik (78.4828) @sv
alternative label: Swazimaa, etnomusiikki (78.4828)
alternative label: Swazimaa, perinnemusiikki (78.4828)
alternative label: Sydafrika, etnomusik (78.4828) @sv
alternative label: Sydafrika, traditionell musik (78.4828) @sv
alternative label: Sydafrikanska republiken, etnomusik (78.4828) @sv
alternative label: Sydafrikanska republiken, traditionell musik (78.4828) @sv
alternative label: Zimbabwe, etnomusiikki (78.4828)
alternative label: Zimbabwe, etnomusik (78.4828) @sv
alternative label: Zimbabwe, perinnemusiikki (78.4828)
alternative label: Zimbabwe, traditionell musik (78.4828) @sv
broader: Etnomusiikki. Kansanmusiikki, Afrikka
in scheme: YKL - Yleisten kirjastojen luokitusjärjestelmä
notation: 78.4828
preferred label: Ethnic music. Folk music, South Africa @en
preferred label: Traditionell musik. Folkmusik, Sydafrika @sv
scope note: Botswana. Etelä-Afrikan tasavalta. Lesotho. Namibia. Swazimaa. Zimbabwe
scope note: Botswana. Lesotho. Namibia. Swaziland. Sydafrikanska republiken. Zambia. Zimbabwe @sv

Etnomusiikki. Kansanmusiikki, Afrikan saaret
type: Concept
type: YKL-luokka
alternative label: Afrikan saaret, etnomusiikki (78.4829)
alternative label: Afrikan saaret, perinnemusiikki (78.4829)
alternative label: Afrikas öar, etnomusik (78.4829) @sv
alternative label: Afrikas öar, traditionell musik (78.4829) @sv
alternative label: Kanarian saaret, etnomusiikki (78.4829)
alternative label: Kanarian saaret, perinnemusiikki (78.4829)
alternative label: Kanarieöarna, etnomusik (78.4829) @sv
alternative label: Kanarieöarna, traditionell musik (78.4829) @sv
alternative label: Kap Verde, etnomusiikki (78.4829)
alternative label: Kap Verde, etnomusik (78.4829) @sv
alternative label: Kap Verde, perinnemusiikki (78.4829)
alternative label: Kap Verde, traditionell musik (78.4829) @sv
alternative label: Komorerna, etnomusik (78.4829) @sv
alternative label: Komorerna, traditionell musik (78.4829) @sv
alternative label: Komorit, etnomusiikki (78.4829)
alternative label: Komorit, perinnemusiikki (78.4829)
alternative label: Madagaskar, etnomusiikki (78.4829)
alternative label: Madagaskar, etnomusik (78.4829) @sv
alternative label: Madagaskar, perinnemusiikki (78.4829)
alternative label: Madagaskar, traditionell musik (78.4829) @sv
alternative label: Madeira, etnomusiikki (78.4829)
alternative label: Madeira, etnomusik (78.4829) @sv
alternative label: Madeira, perinnemusiikki (78.4829)
alternative label: Madeira, traditionell musik (78.4829) @sv
alternative label: Mauritius, etnomusiikki (78.4829)
alternative label: Mauritius, etnomusik (78.4829) @sv
alternative label: Mauritius, perinnemusiikki (78.4829)
alternative label: Mauritius, traditionell musik (78.4829) @sv
alternative label: Seychellerna, etnomusik (78.4829) @sv
alternative label: Seychellerna, traditionell musik (78.4829) @sv
alternative label: Seychellit, etnomusiikki (78.4829)
alternative label: Seychellit, perinnemusiikki (78.4829)
alternative label: Zansibar, etnomusiikki (78.4829)
alternative label: Zansibar, perinnemusiikki (78.4829)
alternative label: Zanzibar, etnomusik (78.4829) @sv
alternative label: Zanzibar, traditionell musik (78.4829) @sv
broader: Etnomusiikki. Kansanmusiikki, Afrikka
in scheme: YKL - Yleisten kirjastojen luokitusjärjestelmä
notation: 78.4829
preferred label: Ethnic music. Folk music, African islands @en
preferred label: Traditionell musik. Folkmusik, Öarna kring Afrika @sv
scope note: Aldabrasaaret. Amirantit. Ascension. Azorit. Kanarian saaret. Kap Verde. Komorit. Madagaskar. Madeira Mauritius. Réunion. Saint Helena. Sao Tomé ja Principe Seychellit. Tristan da Cunha. Zanzibar
scope note: Aldabraöarna. Amiranterna. Ascension. Azorerna. Kanarieöarna. Kap Verde. Komorerna. Madagaskar. Madeira. Mauritius. Réunion. Saint Helena. Sao Tomé och Principe. Seychellerna. Tristan da Cunha. Zanzibar @sv

Etnomusiikki. Kansanmusiikki, Amerikka
type: Concept
type: YKL-luokka
alternative label: Amerika, etnomusik (78.483+) @sv
alternative label: Amerika, traditionell musik (78.483+) @sv
alternative label: Amerikka, etnomusiikki (78.483+)
alternative label: Amerikka, perinnemusiikki (78.483+)
broader: Etnomusiikki. Kansanmusiikki, Aasia. Afrikka. Amerikka. Australia
in scheme: YKL - Yleisten kirjastojen luokitusjärjestelmä
narrower: Etnomusiikki. Kansanmusiikki, Pohjois-Amerikka
narrower: Etnomusiikki. Kansanmusiikki, Väli-Amerikka
narrower: Etnomusiikki. Kansanmusiikki, Etelä-Amerikka
notation: 78.483
preferred label: Ethnic music. Folk music, America @en
preferred label: Traditionell musik. Folkmusik, Amerika @sv
scope note: Allmänna verk och samlingar med blandat innehåll som presenterar traditionell musik i olika delar av Amerika @sv
scope note: Yleisteokset ja Amerikan eri osien etnomusiikkia esittelevät sekasisältöiset kokoelmat

Etnomusiikki. Kansanmusiikki, Pohjois-Amerikka
type: Concept
References: Etnomusiikki. Kansanmusiikki, Intiaanit
References: Etnomusiikki. Kansanmusiikki, Inuitit
type: YKL-luokka
alternative label: Nordamerika, etnomusik (78.4831) @sv
alternative label: Nordamerika, traditionell musik (78.4831) @sv
alternative label: Pohjois-Amerikka, etnomusiikki (78.4831)
alternative label: Pohjois-Amerikka, perinnemusiikki (78.4831)
broader: Etnomusiikki. Kansanmusiikki, Amerikka
in scheme: YKL - Yleisten kirjastojen luokitusjärjestelmä
narrower: Etnomusiikki. Kansanmusiikki, Yhdysvallat
narrower: Etnomusiikki. Kansanmusiikki, Kanada
notation: 78.4831
preferred label: Ethnic music. Folk music, North America @en
preferred label: Traditionell musik. Folkmusik, Nordamerika @sv
scope note: Allmänna verk och samlingar @sv
scope note: Yleisteokset ja kokoelmat

Etnomusiikki. Kansanmusiikki, Yhdysvallat
type: Concept
type: YKL-luokka
alternative label: Förenta Staterna, etnomusik (78.48312) @sv
alternative label: Förenta Staterna, traditionell musik (78.48312) @sv
alternative label: Yhdysvallat, etnomusiikki (78.48312)
alternative label: Yhdysvallat, perinnemusiikki (78.48312)
broader: Etnomusiikki. Kansanmusiikki, Pohjois-Amerikka
in scheme: YKL - Yleisten kirjastojen luokitusjärjestelmä
notation: 78.48312
preferred label: Ethnic music. Folk music, The United States of America @en
preferred label: Traditionell musik. Folkmusik, Förenta staterna @sv

Etnomusiikki. Kansanmusiikki, Kanada
type: Concept
type: YKL-luokka
alternative label: Kanada, etnomusiikki (78.48313)
alternative label: Kanada, etnomusik (78.48313) @sv
alternative label: Kanada, perinnemusiikki (78.48313)
alternative label: Kanada, traditionell musik (78.48313) @sv
broader: Etnomusiikki. Kansanmusiikki, Pohjois-Amerikka
in scheme: YKL - Yleisten kirjastojen luokitusjärjestelmä
notation: 78.48313
preferred label: Ethnic music. Folk music, Canada @en
preferred label: Traditionell musik. Folkmusik, Kanada @sv

Etnomusiikki. Kansanmusiikki, Väli-Amerikka
type: Concept
References: Etnomusiikki. Kansanmusiikki, Intiaanit
type: YKL-luokka
alternative label: Mellanamerika, etnomusik (78.4835) @sv
alternative label: Mellanamerika, traditionell musik (78.4835) @sv
alternative label: Väli-Amerikka, etnomusiikki (78.4835)
alternative label: Väli-Amerikka, perinnemusiikki (78.4835)
broader: Etnomusiikki. Kansanmusiikki, Amerikka
in scheme: YKL - Yleisten kirjastojen luokitusjärjestelmä
narrower: Etnomusiikki. Kansanmusiikki, Meksiko
narrower: Etnomusiikki. Kansanmusiikki, Muut Väli-Amerikan maat
narrower: Etnomusiikki. Kansanmusiikki, Karibianmeren alue
notation: 78.4835
preferred label: Ethnic music. Folk music, Central America @en
preferred label: Traditionell musik. Folkmusik, Mellanamerika @sv
scope note: Allmänna verk och samlingar @sv
scope note: Yleisteokset ja kokoelmat

Etnomusiikki. Kansanmusiikki, Meksiko
type: Concept
type: YKL-luokka
alternative label: Meksiko, etnomusiikki (78.48351)
alternative label: Meksiko, perinnemusiikki (78.48351)
alternative label: Mexiko, etnomusik (78.48351) @sv
alternative label: Mexiko, traditionell musik (78.48351) @sv
broader: Etnomusiikki. Kansanmusiikki, Väli-Amerikka
in scheme: YKL - Yleisten kirjastojen luokitusjärjestelmä
notation: 78.48351
preferred label: Ethnic music. Folk music, Mexico @en
preferred label: Traditionell musik. Folkmusik, Mexico @sv

Etnomusiikki. Kansanmusiikki, Muut Väli-Amerikan maat
type: Concept
References: Etnomusiikki. Kansanmusiikki, Karibianmeren alue
type: YKL-luokka
alternative label: Belize, etnomusiikki (78.48355)
alternative label: Belize, etnomusik (78.48355) @sv
alternative label: Belize, perinnemusiikki (78.48355)
alternative label: Belize, traditionell musik (78.48355) @sv
alternative label: Costa Rica, etnomusiikki (78.48355)
alternative label: Costa Rica, etnomusik (78.48355) @sv
alternative label: Costa Rica, perinnemusiikki (78.48355)
alternative label: Costa Rica, traditionell musik (78.48355) @sv
alternative label: Guatemala, etnomusiikki (78.48355)
alternative label: Guatemala, etnomusik (78.48355) @sv
alternative label: Guatemala, perinnemusiikki (78.48355)
alternative label: Guatemala, traditionell musik (78.48355) @sv
alternative label: Honduras, etnomusiikki (78.48355)
alternative label: Honduras, etnomusik (78.48355) @sv
alternative label: Honduras, perinnemusiikki (78.48355)
alternative label: Honduras, traditionell musik (78.48355) @sv
alternative label: Nicaragua, etnomusiikki (78.48355)
alternative label: Nicaragua, etnomusik (78.48355) @sv
alternative label: Nicaragua, perinnemusiikki (78.48355)
alternative label: Nicaragua, traditionell musik (78.48355) @sv
alternative label: Panama, etnomusiikki (78.48355)
alternative label: Panama, etnomusik (78.48355) @sv
alternative label: Panama, perinnemusiikki (78.48355)
alternative label: Panama, traditionell musik (78.48355) @sv
alternative label: Salvador, etnomusiikki (78.48355)
alternative label: Salvador, etnomusik (78.48355) @sv
alternative label: Salvador, perinnemusiikki (78.48355)
alternative label: Salvador, traditionell musik (78.48355) @sv
broader: Etnomusiikki. Kansanmusiikki, Väli-Amerikka
in scheme: YKL - Yleisten kirjastojen luokitusjärjestelmä
notation: 78.48355
preferred label: Ethnic music. Folk music, Other Central American countries @en
preferred label: Traditionell musik. Folkmusik, Andra länder i Mellanamerika @sv
scope note: Belize. Costa Rica. El Salvador. Guatemala. Honduras. Nicaragua. Panama

Etnomusiikki. Kansanmusiikki, Karibianmeren alue
type: Concept
type: YKL-luokka
alternative label: Antigua, etnomusiikki (78.48356)
alternative label: Antigua, etnomusik (78.48356) @sv
alternative label: Antigua, perinnemusiikki (78.48356)
alternative label: Antigua, traditionell musik (78.48356) @sv
alternative label: Antillerna, etnomusik (78.48356) @sv
alternative label: Antillerna, traditionell musik (78.48356) @sv
alternative label: Antillit, etnomusiikki (78.48356)
alternative label: Antillit, perinnemusiikki (78.48356)
alternative label: Bahama, etnomusiikki (78.48356)
alternative label: Bahama, etnomusik (78.48356) @sv
alternative label: Bahama, perinnemusiikki (78.48356)
alternative label: Bahama, traditionell musik (78.48356) @sv
alternative label: Barbados, etnomusiikki (78.48356)
alternative label: Barbados, etnomusik (78.48356) @sv
alternative label: Barbados, perinnemusiikki (78.48356)
alternative label: Barbados, traditionell musik (78.48356) @sv
alternative label: Bermuda, etnomusiikki (78.48356)
alternative label: Bermuda, etnomusik (78.48356) @sv
alternative label: Bermuda, perinnemusiikki (78.48356)
alternative label: Bermuda, traditionell musik (78.48356) @sv
alternative label: Dominica, etnomusiikki (78.48356)
alternative label: Dominica, etnomusik (78.48356) @sv
alternative label: Dominica, perinnemusiikki (78.48356)
alternative label: Dominica, traditionell musik (78.48356) @sv
alternative label: Dominikaaninen tasavalta, etnomusiikki (78.48356)
alternative label: Dominikaaninen tasavalta, perinnemusiikki (78.48356)
alternative label: Dominikanska republiken, etnomusik (78.48356) @sv
alternative label: Dominikanska republiken, traditionell musik (78.48356) @sv
alternative label: Grenada, etnomusiikki (78.48356)
alternative label: Grenada, etnomusik (78.48356) @sv
alternative label: Grenada, perinnemusiikki (78.48356)
alternative label: Grenada, traditionell musik (78.48356) @sv
alternative label: Guadeloupe, etnomusiikki (78.48356)
alternative label: Guadeloupe, etnomusik (78.48356) @sv
alternative label: Guadeloupe, perinnemusiikki (78.48356)
alternative label: Guadeloupe, traditionell musik (78.48356) @sv
alternative label: Haiti, etnomusiikki (78.48356)
alternative label: Haiti, etnomusik (78.48356) @sv
alternative label: Haiti, perinnemusiikki (78.48356)
alternative label: Haiti, traditionell musik (78.48356) @sv
alternative label: Jamaica, etnomusik (78.48356) @sv
alternative label: Jamaica, traditionell musik (78.48356) @sv
alternative label: Jamaika, etnomusiikki (78.48356)
alternative label: Jamaika, perinnemusiikki (78.48356)
alternative label: Karibianmeren alue, etnomusiikki (78.48356)
alternative label: Karibianmeren alue, perinnemusiikki (78.48356)
alternative label: Karibiska öarna, etnomusik (78.48356) @sv
alternative label: Karibiska öarna, traditionell musik (78.48356) @sv
alternative label: Kuba, etnomusik (78.48356) @sv
alternative label: Kuba, traditionell musik (78.48356) @sv
alternative label: Kuuba, etnomusiikki (78.48356)
alternative label: Kuuba, perinnemusiikki (78.48356)
alternative label: Martinique, etnomusiikki (78.48356)
alternative label: Martinique, etnomusik (78.48356) @sv
alternative label: Martinique, perinnemusiikki (78.48356)
alternative label: Martinique, traditionell musik (78.48356) @sv
alternative label: Puerto Rico, etnomusiikki (78.48356)
alternative label: Puerto Rico, etnomusik (78.48356) @sv
alternative label: Puerto Rico, perinnemusiikki (78.48356)
alternative label: Puerto Rico, traditionell musik (78.48356) @sv
alternative label: Trinidad ja Tobago, etnomusiikki (78.48356)
alternative label: Trinidad ja Tobago, perinnemusiikki (78.48356)
alternative label: Trinidad och Tobago, etnomusik (78.48356) @sv
alternative label: Trinidad och Tobago, traditionell musik (78.48356) @sv
broader: Etnomusiikki. Kansanmusiikki, Väli-Amerikka
in scheme: YKL - Yleisten kirjastojen luokitusjärjestelmä
notation: 78.48356
preferred label: Ethnic music. Folk music, The Caribbean @en
preferred label: Traditionell musik. Folkmusik, Karibiska öarna @sv
scope note: Isot-Antillit. Pienet-Antillit Alankomaiden Antillit. Anguilla. Antigua. Bahama. Barbados. Bermuda. Dominica. Dominikaaninen tasavalta. Grenada Guadeloupe. Haiti. Jamaika. Kuuba. Martinique. Neitsytsaaret. Puerto Rico. Saint Kitts-Nevis. Saint Lucia. Saint Vincent. Trinidad ja Tobago
scope note: Stora Antillerna. Små Antillerna Anguilla. Antigua. Bahama. Barbados. Bermuda. Dominica. Dominikanska republiken. Grenada. Guadeloupe. Haiti. Jamaica. Jungfruöarna. Kuba. Martinique. Nederländska Antillerna. Puerto Rico. Saint Kitts-Nevis. Saint Lucia. Saint Vincent. Trinidad och Tobago @sv

Etnomusiikki. Kansanmusiikki, Etelä-Amerikka
type: Concept
References: Etnomusiikki. Kansanmusiikki, Intiaanit
type: YKL-luokka
alternative label: Etelä-Amerikka, etnomusiikki (78.4838)
alternative label: Etelä-Amerikka, perinnemusiikki (78.4838)
alternative label: Inkamusiikki (78.4838)
alternative label: Inkamusik (78.4838) @sv
alternative label: Sydamerika, etnomusik (78.4838) @sv
alternative label: Sydamerika, traditionell musik (78.4838) @sv
broader: Etnomusiikki. Kansanmusiikki, Amerikka
in scheme: YKL - Yleisten kirjastojen luokitusjärjestelmä
narrower: Etnomusiikki. Kansanmusiikki, Venezuela. Guyana. Surinam. Ranskan Guayana
narrower: Etnomusiikki. Kansanmusiikki, Kolumbia
narrower: Etnomusiikki. Kansanmusiikki, Ecuador. Peru. Bolivia
narrower: Etnomusiikki. Kansanmusiikki, Chile
narrower: Etnomusiikki. Kansanmusiikki, Argentiina. Uruguay. Paraguay
narrower: Etnomusiikki. Kansanmusiikki, Brasilia
notation: 78.4838
preferred label: Ethnic music. Folk music, South America @en
preferred label: Traditionell musik. Folkmusik, Sydamerika @sv
scope note: Allmänna verk och samlingar Hit och till undergrupperna den traditionella musik som har uppstått genom sammansmältningen av indiankulturerna och den iberiska (spansk-portugisiska) kulturen @sv
scope note: Yleisteokset ja kokoelmat Tähän ja alaluokkiin intiaanikulttuurien ja iberialaisen (espanjalais-portugalilaisen) kulttuurin yhteensulautumisesta syntynyt etnomusiikki

Etnomusiikki. Kansanmusiikki, Venezuela. Guyana. Surinam. Ranskan Guayana
type: Concept
type: YKL-luokka
alternative label: Franska Guyana, etnomusik (78.48381) @sv
alternative label: Franska Guyana, traditionell musik (78.48381) @sv
alternative label: Guyana, etnomusiikki (78.48381)
alternative label: Guyana, etnomusik (78.48381) @sv
alternative label: Guyana, perinnemusiikki (78.48381)
alternative label: Guyana, traditionell musik (78.48381) @sv
alternative label: Ranskan Guyana, etnomusiikki (78.48381)
alternative label: Ranskan Guyana, perinnemusiikki (78.48381)
alternative label: Surinam, etnomusiikki (78.48381)
alternative label: Surinam, etnomusik (78.48381) @sv
alternative label: Surinam, perinnemusiikki (78.48381)
alternative label: Surinam, traditionell musik (78.48381) @sv
alternative label: Venezuela, etnomusiikki (78.48381)
alternative label: Venezuela, etnomusik (78.48381) @sv
alternative label: Venezuela, perinnemusiikki (78.48381)
alternative label: Venezuela, traditionell musik (78.48381) @sv
broader: Etnomusiikki. Kansanmusiikki, Etelä-Amerikka
in scheme: YKL - Yleisten kirjastojen luokitusjärjestelmä
notation: 78.48381
preferred label: Ethnic music. Folk music, Venezuela. Guyana. Surinam. French Guyana @en
preferred label: Traditionell musik. Folkmusik, Venezuela. Guyana. Surinam. Fransk Guyana @sv

Etnomusiikki. Kansanmusiikki, Kolumbia
type: Concept
type: YKL-luokka
alternative label: Colombia, traditionell musik (78.48382) @sv
alternative label: Kolumbia, etnomusiikki (78.48382)
alternative label: Kolumbia, etnomusik (78.48382) @sv
alternative label: Kolumbia, perinnemusiikki (78.48382)
broader: Etnomusiikki. Kansanmusiikki, Etelä-Amerikka
in scheme: YKL - Yleisten kirjastojen luokitusjärjestelmä
notation: 78.48382
preferred label: Ethnic music. Folk music, Columbia @en
preferred label: Traditionell musik. Folkmusik, Colombia @sv

Etnomusiikki. Kansanmusiikki, Ecuador. Peru. Bolivia
type: Concept
type: YKL-luokka
alternative label: Bolivia, etnomusiikki (78.48383)
alternative label: Bolivia, etnomusik (78.48383) @sv
alternative label: Bolivia, perinnemusiikki (78.48383)
alternative label: Bolivia, traditionell musik (78.48383) @sv
alternative label: Ecuador, etnomusiikki (78.48383)
alternative label: Ecuador, etnomusik (78.48383) @sv
alternative label: Ecuador, perinnemusiikki (78.48383)
alternative label: Ecuador, traditionell musik (78.48383) @sv
alternative label: Peru, etnomusiikki (78.48383)
alternative label: Peru, etnomusik (78.48383) @sv
alternative label: Peru, perinnemusiikki (78.48383)
alternative label: Peru, traditionell musik (78.48383) @sv
broader: Etnomusiikki. Kansanmusiikki, Etelä-Amerikka
in scheme: YKL - Yleisten kirjastojen luokitusjärjestelmä
notation: 78.48383
preferred label: Ethnic music. Folk music, Ecuador. Peru. Bolivia @en
preferred label: Traditionell musik. Folkmusik, Ecuador. Peru. Bolivia @sv

Etnomusiikki. Kansanmusiikki, Chile
type: Concept
type: YKL-luokka
alternative label: Chile, etnomusiikki (78.48385)
alternative label: Chile, etnomusik (78.48385) @sv
alternative label: Chile, perinnemusiikki (78.48385)
alternative label: Chile, traditionell musik (78.48385) @sv
broader: Etnomusiikki. Kansanmusiikki, Etelä-Amerikka
in scheme: YKL - Yleisten kirjastojen luokitusjärjestelmä
notation: 78.48385
preferred label: Ethnic music. Folk music, Chile @en
preferred label: Traditionell musik. Folkmusik, Chile @sv

Etnomusiikki. Kansanmusiikki, Argentiina. Uruguay. Paraguay
type: Concept
type: YKL-luokka
alternative label: Argentiina, etnomusiikki (78.48386)
alternative label: Argentiina, perinnemusiikki (78.48386)
alternative label: Argentina, etnomusik (78.48386) @sv
alternative label: Argentina, traditionell musik (78.48386) @sv
alternative label: Paraguay, etnomusiikki (78.48386)
alternative label: Paraguay, etnomusik (78.48386) @sv
alternative label: Paraguay, perinnemusiikki (78.48386)
alternative label: Paraguay, traditionell musik (78.48386) @sv
alternative label: Uruguay, etnomusiikki (78.48386)
alternative label: Uruguay, etnomusik (78.48386) @sv
alternative label: Uruguay, perinnemusiikki (78.48386)
alternative label: Uruguay, traditionell musik (78.48386) @sv
broader: Etnomusiikki. Kansanmusiikki, Etelä-Amerikka
in scheme: YKL - Yleisten kirjastojen luokitusjärjestelmä
notation: 78.48386
preferred label: Ethnic music. Folk music, Argentina. Uruguay. Paraguay @en
preferred label: Traditionell musik. Folkmusik, Argentina. Uruguay. Paraguay @sv

Etnomusiikki. Kansanmusiikki, Brasilia
type: Concept
type: YKL-luokka
alternative label: Brasilia, etnomusiikki (78.48388)
alternative label: Brasilia, perinnemusiikki (78.48388)
alternative label: Brasilien, etnomusik (78.48388) @sv
alternative label: Brasilien, traditionell musik (78.48388) @sv
broader: Etnomusiikki. Kansanmusiikki, Etelä-Amerikka
in scheme: YKL - Yleisten kirjastojen luokitusjärjestelmä
notation: 78.48388
preferred label: Ethnic music. Folk music, Brazil @en
preferred label: Traditionell musik. Folkmusik, Brasilien @sv

Etnomusiikki. Kansanmusiikki, Australia ja Oseania
type: Concept
type: YKL-luokka
alternative label: Oceanien, etnomusik (78.485) @sv
alternative label: Oceanien, traditionell musik (78.485) @sv
alternative label: Oseania, etnomusiikki (78.485)
alternative label: Oseania, perinnemusiikki (78.485)
alternative label: Tonga, etnomusiikki (78.485)
alternative label: Tonga, etnomusik (78.485) @sv
alternative label: Tonga, perinnemusiikki (78.485)
alternative label: Tonga, traditionell musik (78.485) @sv
broader: Etnomusiikki. Kansanmusiikki, Aasia. Afrikka. Amerikka. Australia
in scheme: YKL - Yleisten kirjastojen luokitusjärjestelmä
narrower: Etnomusiikki. Kansanmusiikki, Australia. Tasmania
narrower: Etnomusiikki. Kansanmusiikki, Uusi-Seelanti
narrower: Etnomusiikki. Kansanmusiikki, Uusi-Guinea
narrower: Etnomusiikki. Kansanmusiikki, Tyynenmeren saaret
notation: 78.485
preferred label: Ethnic music. Folk music, Australia and Oceania @en
preferred label: Traditionell musik. Folkmusik, Australien och Oceanien @sv
scope note: Allmänna verk och samlingar @sv
scope note: Yleisteokset ja kokoelmat

Etnomusiikki. Kansanmusiikki, Australia. Tasmania
type: Concept
type: YKL-luokka
alternative label: Aboriginaalit (78.4851)
alternative label: Aboriginer (78.4851) @sv
alternative label: Australia, etnomusiikki (78.4851)
alternative label: Australia, perinnemusiikki (78.4851)
alternative label: Australien, etnomusik (78.4851) @sv
alternative label: Australien, traditionell musik (78.4851) @sv
alternative label: Tasmania, etnomusiikki (78.4851)
alternative label: Tasmania, perinnemusiikki (78.4851)
alternative label: Tasmanien, etnomusik (78.4851) @sv
alternative label: Tasmanien, traditionell musik (78.4851) @sv
broader: Etnomusiikki. Kansanmusiikki, Australia ja Oseania
in scheme: YKL - Yleisten kirjastojen luokitusjärjestelmä
notation: 78.4851
preferred label: Ethnic music. Folk music, Australia. Tasmania @en
preferred label: Traditionell musik. Folkmusik, Australien. Tasmanien @sv
scope note: Hit både ursprungsbefolkningens (aboriginernas) musik och den traditionella musik som utvecklats efter kolonisationen @sv
scope note: Tähän sekä alkuperäisväestön (aboriginaalit) musiikki että siirtolaisten muuton jälkeen kehittynyt etnomusiikki

Etnomusiikki. Kansanmusiikki, Uusi-Seelanti
type: Concept
type: YKL-luokka
alternative label: Maorier, etnomusik (78.4854) @sv
alternative label: Maorier, traditionell musik (78.4854) @sv
alternative label: Maorit, etnomusiikki (78.4854)
alternative label: Maorit, perinnemusiikki (78.4854)
alternative label: Nya Zeeland, etnomusik (78.4854) @sv
alternative label: Nya Zeeland, traditionell musik (78.4854) @sv
alternative label: Uusi-Seelanti, etnomusiikki (78.4854)
alternative label: Uusi-Seelanti, perinnemusiikki (78.4854)
broader: Etnomusiikki. Kansanmusiikki, Australia ja Oseania
in scheme: YKL - Yleisten kirjastojen luokitusjärjestelmä
notation: 78.4854
preferred label: Ethnic music. Folk music, New Zealand @en
preferred label: Traditionell musik. Folkmusik, Nya Zeeland @sv
scope note: Hit både ursprungsbefolkningens (maoriernas) musik och den traditionella musik som utvecklats efter kolonisationen @sv
scope note: Tähän sekä alkuperäisväestön (maorit) musiikki että siirtolaisten muuton jälkeen kehittynyt etnomusiikki

Etnomusiikki. Kansanmusiikki, Uusi-Guinea
type: Concept
type: YKL-luokka
alternative label: Nya Guinea, etnomusik (78.4856) @sv
alternative label: Nya Guinea, traditionell musik (78.4856) @sv
alternative label: Uusi-Guinea, etnomusiikki (78.4856)
alternative label: Uusi-Guinea, perinnemusiikki (78.4856)
broader: Etnomusiikki. Kansanmusiikki, Australia ja Oseania
in scheme: YKL - Yleisten kirjastojen luokitusjärjestelmä
notation: 78.4856
preferred label: Ethnic music. Folk music, New Guinea @en
preferred label: Traditionell musik. Folkmusik, Nya Guinea @sv

Etnomusiikki. Kansanmusiikki, Tyynenmeren saaret
type: Concept
References: Etnomusiikki. Kansanmusiikki, Uusi-Seelanti
References: Etnomusiikki. Kansanmusiikki, Uusi-Guinea
type: YKL-luokka
alternative label: Fidzi, etnomusiikki (78.4857)
alternative label: Fidzi, perinnemusiikki (78.4857)
alternative label: Fiji, etnomusik (78.4857) @sv
alternative label: Fiji, traditionell musik (78.4857) @sv
alternative label: Karoliinit, etnomusiikki (78.4857)
alternative label: Karoliinit, perinnemusiikki (78.4857)
alternative label: Karolinerna, etnomusik (78.4857) @sv
alternative label: Karolinerna, traditionell musik (78.4857) @sv
alternative label: Melanesia, etnomusiikki (78.4857)
alternative label: Melanesia, perinnemusiikki (78.4857)
alternative label: Melanesien, etnomusik (78.4857) @sv
alternative label: Melanesien, traditionell musik (78.4857) @sv
alternative label: Mikronesia, etnomusiikki (78.4857)
alternative label: Mikronesia, perinnemusiikki (78.4857)
alternative label: Mikronesien, etnomusik (78.4857) @sv
alternative label: Mikronesien, traditionell musik (78.4857) @sv
alternative label: Nya Hebriderna, etnomusik (78.4857) @sv
alternative label: Nya Hebriderna, traditionell musik (78.4857) @sv
alternative label: Nya Kaledonien, etnomusik (78.4857) @sv
alternative label: Nya Kaledonien, traditionell musik (78.4857) @sv
alternative label: Polynesia, etnomusiikki (78.4857)
alternative label: Polynesia, perinnemusiikki (78.4857)
alternative label: Polynesien, etnomusik (78.4857) @sv
alternative label: Polynesien, traditionell musik (78.4857) @sv
alternative label: Salomonsaaret, etnomusiikki (78.4857)
alternative label: Salomonsaaret, perinnemusiikki (78.4857)
alternative label: Salomonöarna, etnomusik (78.4857) @sv
alternative label: Salomonöarna, traditionell musik (78.4857) @sv
alternative label: Samoa, etnomusiikki (78.4857)
alternative label: Samoa, etnomusik (78.4857) @sv
alternative label: Samoa, perinnemusiikki (78.4857)
alternative label: Samoa, traditionell musik (78.4857) @sv
alternative label: Stillahavsöarna, etnomusik (78.4857) @sv
alternative label: Stillahavsöarna, traditionell musik (78.4857) @sv
alternative label: Tyynenmeren saaret, etnomusiikki (78.4857)
alternative label: Tyynenmeren saaret, perinnemusiikki (78.4857)
alternative label: Uudet-Hebridit, etnomusiikki (78.4857)
alternative label: Uudet-Hebridit, perinnemusiikki (78.4857)
alternative label: Uusi-Kaledonia, etnomusiikki (78.4857)
alternative label: Uusi-Kaledonia, perinnemusiikki (78.4857)
broader: Etnomusiikki. Kansanmusiikki, Australia ja Oseania
in scheme: YKL - Yleisten kirjastojen luokitusjärjestelmä
narrower: Etnomusiikki. Kansanmusiikki, Havaiji
notation: 78.4857
preferred label: Ethnic music. Folk music, Pacific islands @en
preferred label: Traditionell musik. Folkmusik, Stillahavsöar @sv
scope note: Melanesia. Mikronesia. Polynesia Bismarckinsaaret. Cookinsaaret. Fidzisaaret. Galapagossaaret. Gilbertin saaret. Joulusaari. Karoliinit. Mariaanit. Marquesassaaret. Marshallinsaaret. Nauru. Pitcairn. Pääsiäissaari. Salomonsaaret. Samoa. Seurasaaret. Tahiti. Tonga. Tuvalu Uudet-Hebridit. Uusi-Kaledonia. Vanuatu
scope note: Melanesien. Mikronesien. Polynesien Bismarcköarna. Cooköarna. Fijiöarna. Galapagosöarna. Gilbertöarna. Julön. Karolinerna. Marianerna. Marquesasöarna. Marshallöarna. Nauru. Nya Hebriderna. Nya Kaledonien. Pitcairn. Påskön. Salomonöarna. Samoa. Sällskapsöarna. Tahiti. Tonga. Tuvalu. Vanuatu @sv

Etnomusiikki. Kansanmusiikki, Havaiji
type: Concept
type: YKL-luokka
alternative label: Havaiji, etnomusiikki (78.48575)
alternative label: Havaiji, perinnemusiikki (78.48575)
alternative label: Hawaii, etnomusik (78.48575) @sv
alternative label: Hawaii, traditionell musik (78.48575) @sv
broader: Etnomusiikki. Kansanmusiikki, Tyynenmeren saaret
in scheme: YKL - Yleisten kirjastojen luokitusjärjestelmä
notation: 78.48575
preferred label: Ethnic music. Folk music, Hawaii @en
preferred label: Traditionell musik. Folkmusik, Hawaii @sv

Useiden valtioiden alueelle ulottuvat etniset musiikkikulttuurit
type: Concept
type: YKL-luokka
broader: Etnomusiikki. Kansanmusiikki
in scheme: YKL - Yleisten kirjastojen luokitusjärjestelmä
narrower: Etnomusiikki. Kansanmusiikki, Saamelaiset
narrower: Etnomusiikki. Kansanmusiikki, Romanit
narrower: Etnomusiikki. Kansanmusiikki, Juutalaiset
narrower: Etnomusiikki. Kansanmusiikki, Tataarit
narrower: Etnomusiikki. Kansanmusiikki, Kurdit
narrower: Etnomusiikki. Kansanmusiikki, Intiaanit
narrower: Etnomusiikki. Kansanmusiikki, Inuitit
narrower: Muut useiden valtioiden alueelle ulottuvat musiikkikulttuurit
notation: 78.49
preferred label: Etniska musikkulturer som utsträcker sig på flera staters område @sv
preferred label: Music cultures extending over territories of several states @en
scope note: Allmänna verk och samlingar @sv
scope note: Yleisteokset ja kokoelmat

Etnomusiikki. Kansanmusiikki, Saamelaiset
type: Concept
type: YKL-luokka
alternative label: Joikaus, etnomusiikki (78.491)
alternative label: Joikaus, perinnemusiikki (78.491)
alternative label: Joiku, etnomusiikki (78.491)
alternative label: Joiku, perinnemusiikki (78.491)
alternative label: Jojk, etnomusik (78.491) @sv
alternative label: Jojk, traditionell musik (78.491) @sv
alternative label: Jojkning, etnomusik (78.491) @sv
alternative label: Jojkning, traditionell musik (78.491) @sv
alternative label: Saamelaiset, etnomusiikki (78.491)
alternative label: Saamelaiset, perinnemusiikki (78.491)
alternative label: Samer, etnomusik (78.491) @sv
alternative label: Samer, traditionell musik (78.491) @sv
broader: Useiden valtioiden alueelle ulottuvat etniset musiikkikulttuurit
in scheme: YKL - Yleisten kirjastojen luokitusjärjestelmä
notation: 78.491
preferred label: Ethnic music. Folk music, Sami people @en
preferred label: Traditionell musik. Folkmusik, Samer @sv

Etnomusiikki. Kansanmusiikki, Romanit
type: Concept
type: YKL-luokka
alternative label: Romanit, etnomusiikki (78.492)
alternative label: Romanit, perinnemusiikki (78.492)
alternative label: Romer, etnomusik (78.492) @sv
alternative label: Romer, traditionell musik (78.492) @sv
broader: Useiden valtioiden alueelle ulottuvat etniset musiikkikulttuurit
in scheme: YKL - Yleisten kirjastojen luokitusjärjestelmä
notation: 78.492
preferred label: Ethnic music. Folk music, Romanies @en
preferred label: Traditionell musik. Folkmusik, Romer @sv

Etnomusiikki. Kansanmusiikki, Juutalaiset
type: Concept
References: Musiikkikulttuurien sulautumat. Populaarimusiikki
type: YKL-luokka
alternative label: Judar, etnomusik (78.493) @sv
alternative label: Judar, etnomusik utanför Israel (78.493) @sv
alternative label: Judar, traditionell musik (78.493) @sv
alternative label: Judar, traditionell musik utanför Israel (78.493) @sv
alternative label: Juutalaiset, etnomusiikki (78.493)
alternative label: Juutalaiset, etnomusiikki Israelin ulkopuolella (78.493)
alternative label: Juutalaiset, perinnemusiikki (78.493)
alternative label: Juutalaiset, perinnemusiikki Israelin ulkopuolella (78.493)
broader: Useiden valtioiden alueelle ulottuvat etniset musiikkikulttuurit
in scheme: YKL - Yleisten kirjastojen luokitusjärjestelmä
notation: 78.493
preferred label: Ethnic music. Folk music, Jews @en
preferred label: Traditionell musik. Folkmusik, Judar @sv
scope note: Hit de judars traditionella musik som lever utanför Israel @sv
scope note: Tähän Israelin ulkopuolella elävien juutalaisten etnomusiikki

Etnomusiikki. Kansanmusiikki, Tataarit
type: Concept
type: YKL-luokka
alternative label: Tataarit, etnomusiikki (78.494)
alternative label: Tataarit, perinnemusiikki (78.494)
alternative label: Tatarer, etnomusik (78.494) @sv
alternative label: Tatarer, traditionell musik (78.494) @sv
broader: Useiden valtioiden alueelle ulottuvat etniset musiikkikulttuurit
in scheme: YKL - Yleisten kirjastojen luokitusjärjestelmä
notation: 78.494
preferred label: Ethnic music. Folk music, Tartars @en
preferred label: Traditionell musik. Folkmusik, Tatarer @sv

Etnomusiikki. Kansanmusiikki, Kurdit
type: Concept
References: Etnomusiikki. Kansanmusiikki, Etu-Aasia
type: YKL-luokka
alternative label: Kurder, etnomusik (78.495) @sv
alternative label: Kurder, traditionell musik (78.495) @sv
alternative label: Kurdit, etnomusiikki (78.495)
alternative label: Kurdit, perinnemusiikki (78.495)
broader: Useiden valtioiden alueelle ulottuvat etniset musiikkikulttuurit
in scheme: YKL - Yleisten kirjastojen luokitusjärjestelmä
notation: 78.495
preferred label: Ethnic music. Folk music, Kurds @en
preferred label: Traditionell musik. Folkmusik, Kurder @sv

Etnomusiikki. Kansanmusiikki, Intiaanit
type: Concept
References: Etnomusiikki. Kansanmusiikki, Etelä-Amerikka
type: YKL-luokka
broader: Useiden valtioiden alueelle ulottuvat etniset musiikkikulttuurit
in scheme: YKL - Yleisten kirjastojen luokitusjärjestelmä
notation: 78.496
preferred label: Ethnic music. Folk music, American Indians @en
preferred label: Traditionell musik. Folkmusik, Indianer @sv
scope note: Hit de amerikanska indianernas ursprungliga musik @sv
scope note: Tähän Amerikan intiaanien alkuperäin musiikki

Etnomusiikki. Kansanmusiikki, Inuitit
type: Concept
type: YKL-luokka
alternative label: Alaska (78.497)
alternative label: Grönland (78.497) @sv
alternative label: Grönlanti (78.497)
alternative label: Inuiter, etnomusik (78.497) @sv
alternative label: Inuiter, traditionell musik (78.497) @sv
alternative label: Inuitit, etnomusiikki (78.497)
alternative label: Inuitit, perinnemusiikki (78.497)
broader: Useiden valtioiden alueelle ulottuvat etniset musiikkikulttuurit
in scheme: YKL - Yleisten kirjastojen luokitusjärjestelmä
notation: 78.497
preferred label: Ethnic music. Folk music, Inuits @en
preferred label: Traditionell musik. Folkmusik, Inuiter @sv

Muut useiden valtioiden alueelle ulottuvat musiikkikulttuurit
type: Concept
References: Etnomusiikki. Kansanmusiikki, Britteinsaaret
References: Etnomusiikki. Kansanmusiikki, Ranska
type: YKL-luokka
alternative label: Armenialaiset, etnomusiikki (78.499)
alternative label: Armenialaiset, perinnemusiikki (78.499)
alternative label: Armenier, etnomusik (78.499) @sv
alternative label: Armenier, traditionell musik (78.499) @sv
broader: Useiden valtioiden alueelle ulottuvat etniset musiikkikulttuurit
in scheme: YKL - Yleisten kirjastojen luokitusjärjestelmä
notation: 78.499
preferred label: Musikkulturer som utsträcker sig på flera staters område @sv
preferred label: Other music cultures extending over territories of several states @en
scope note: Keltisk traditionell musik klassificeras efter landet @sv
scope note: Kelttiläinen etnomusiikki luokitetaan maan mukaan

Yhtye- ja orkesterimusiikki
type: Concept
type: YKL-luokka
alternative label: Balettimusiikki, orkesterimusiikki (78.5+)
alternative label: Balettmusik, orkestermusik (78.5+) @sv
broader: MUSIIKKI
in scheme: YKL - Yleisten kirjastojen luokitusjärjestelmä
narrower: Yhtyeet (2-9 soittajaa)
narrower: Kamariorkesterit (yli 9, yleensä alle 25 soittajaa)
narrower: Puhallinorkesterit (yli 25 soittajaa)
narrower: Orkesterit (yleensä enemmän kuin 25 soittajaa)
narrower: Konsertot
notation: 78.5
preferred label: Music for ensembles and orchestras @en
preferred label: Orkestermusik och musik för ensembler @sv
scope note: Allmänna verk och samlingar med blandat innehåll @sv
scope note: Yleisteokset ja sekasisältöiset kokoelmat

Yhtyeet (2-9 soittajaa)
type: Concept
References: URN:NBN:fi:au:ykl:78.5107
type: YKL-luokka
alternative label: Ensemble, instrument, konstmusik (78.51+) @sv
alternative label: Ensemblemusik, konstmusik (78.51+) @sv
alternative label: Yhtye, taidemusiikkisoittimet (78.51+)
alternative label: Yhtyemusiikki, taidemusiikki (78.51+)
broader: Yhtye- ja orkesterimusiikki
in scheme: YKL - Yleisten kirjastojen luokitusjärjestelmä
narrower: Duot ilman pianoa tai muuta sointusoitinta
narrower: Triot
narrower: Kvartetit
narrower: Kvintetit
narrower: Sekstetit
narrower: Septetit
narrower: Oktetit
narrower: Nonetit
narrower: Kokoonpanoltaan poikkeukselliset yhtyeet
notation: 78.51
preferred label: Ensembler (2-9 musiker) @sv
preferred label: Ensembles (2-9 players) @en
scope note: Allmänna verk och samlingar med blandat innehåll Hit även musik med fritt val av instrument då sammansättningen inte har antecknats (i musikalier) En mera detaljerad instrumentering av sammansättningarna antyds vid behov med ämnesord Continuo tolkas här och i de övriga delarna av klassificeringssystemet som ett instrument Duor och andra ensembler av samma instrument klassificeras inte till ensembleklasserna utan till klasserna för ifrågavarande instrument (t.ex. tre gitarrer 78.653 och åtta cellor 78.733) @sv
scope note: Yleisteokset ja sekasisältöiset kokoelmat Tähän myös soitinvalinnaltaan vapaa musiikki silloin, kun kokoonpanoa ei ole merkitty (nuottijulkaisuissa). Kokoonpanojen tarkempi soitinnus ilmaistaan tarvittaessa asiasanoin. Continuo tulkitaan tässä ja luokitusjärjestelmän muissa osissa yhdeksi soittimeksi Saman soittimen muodostamia duoja ja muita yhtyeitä ei sijoiteta yhtyemusiikkiin, vaan ko. soittimien luokkiin (esim. kolme kitaraa 78.653 ja kahdeksan selloa 78.733)

Duot ilman pianoa tai muuta sointusoitinta
type: Concept
type: YKL-luokka
alternative label: Duo, instrument (78.511+) @sv
alternative label: Duo, soittimet (78.511+)
broader: Yhtyeet (2-9 soittajaa)
in scheme: YKL - Yleisten kirjastojen luokitusjärjestelmä
narrower: Kaksi eri kosketin- ja/tai näppäilysoitinta
narrower: Kaksi eri jousisoitinta
narrower: Kaksi eri puhallinsoitinta
narrower: Muut kahden eri soittimen kokoonpanot
notation: 78.511
preferred label: Duor utan piano eller annat tangentinstrument @sv
preferred label: Duos without piano or other chord instrument @en
scope note: Duor i vilka den andra parten är ett ackordinstrument för till klassen för det ifrågavarande soloinstrumentet @sv
scope note: Duot, joissa toisena osapuolena on sointusoitin, sijoitetaan ko. soolosoittimen luokkaan

Kaksi eri kosketin- ja/tai näppäilysoitinta
type: Concept
type: YKL-luokka
broader: Duot ilman pianoa tai muuta sointusoitinta
in scheme: YKL - Yleisten kirjastojen luokitusjärjestelmä
notation: 78.5111
preferred label: Två olika tangent- och/eller knäppinstrument @sv
preferred label: Two different keyboard and/or plucked instruments @en

Kaksi eri jousisoitinta
type: Concept
type: YKL-luokka
broader: Duot ilman pianoa tai muuta sointusoitinta
in scheme: YKL - Yleisten kirjastojen luokitusjärjestelmä
notation: 78.5112
preferred label: Två olika stråkinstrument @sv
preferred label: Two different string instruments @en

Kaksi eri puhallinsoitinta
type: Concept
type: YKL-luokka
broader: Duot ilman pianoa tai muuta sointusoitinta
in scheme: YKL - Yleisten kirjastojen luokitusjärjestelmä
notation: 78.5113
preferred label: Två olika blåsinstrument @sv
preferred label: Two different wind instruments @en

Muut kahden eri soittimen kokoonpanot
type: Concept
type: YKL-luokka
broader: Duot ilman pianoa tai muuta sointusoitinta
in scheme: YKL - Yleisten kirjastojen luokitusjärjestelmä
notation: 78.5119
preferred label: Other ensembles of two or more different instruments @en
preferred label: Övriga sammansättningar med två instrument @sv

Triot
type: Concept
type: YKL-luokka
alternative label: Trio, instrument, konstmusik (78.512) @sv
alternative label: Trio, taidemusiikkisoittimet (78.512)
broader: Yhtyeet (2-9 soittajaa)
in scheme: YKL - Yleisten kirjastojen luokitusjärjestelmä
narrower: Kosketinsoitin ja kaksi jousisoitinta
narrower: Kolme jousisoitinta
narrower: Kolme puhallinsoitinta
narrower: Puhallinsoitin ja kaksi jousisoitinta
narrower: Muut kolmen soittimen kokoonpanot
notation: 78.512
preferred label: Trior @sv
preferred label: Trios @en

Kosketinsoitin ja kaksi jousisoitinta
type: Concept
type: YKL-luokka
broader: Triot
in scheme: YKL - Yleisten kirjastojen luokitusjärjestelmä
notation: 78.5121
preferred label: Ett tangentinstrument och två stråkinstrument @sv
preferred label: One keyboard instrument and two string instruments @en

Kolme jousisoitinta
type: Concept
type: YKL-luokka
alternative label: Jousitrio (78.5122)
alternative label: Stråktrio (78.5122) @sv
broader: Triot
in scheme: YKL - Yleisten kirjastojen luokitusjärjestelmä
notation: 78.5122
preferred label: Three string instruments @en
preferred label: Tre stråkinstrument @sv

Kolme puhallinsoitinta
type: Concept
type: YKL-luokka
broader: Triot
in scheme: YKL - Yleisten kirjastojen luokitusjärjestelmä
notation: 78.5123
preferred label: Three wind instruments @en
preferred label: Tre blåsinstrument @sv

Puhallinsoitin ja kaksi jousisoitinta
type: Concept
type: YKL-luokka
broader: Triot
in scheme: YKL - Yleisten kirjastojen luokitusjärjestelmä
notation: 78.5124
preferred label: Ett blåsinstrument och två stråkinstrument @sv
preferred label: One wind instrument and two string instruments @en

Muut kolmen soittimen kokoonpanot
type: Concept
type: YKL-luokka
broader: Triot
in scheme: YKL - Yleisten kirjastojen luokitusjärjestelmä
notation: 78.5129
preferred label: Other ensembles of three instruments @en
preferred label: Övriga sammansättningar med tre instrument @sv

Kvartetit
type: Concept
type: YKL-luokka
broader: Yhtyeet (2-9 soittajaa)
in scheme: YKL - Yleisten kirjastojen luokitusjärjestelmä
narrower: Kosketinsoitin ja kolme jousisoitinta
narrower: Neljä jousisoitinta
narrower: Neljä puhallinsoitinta
narrower: Puhallinsoitin ja kolme jousisoitinta
narrower: Muut neljän eri soittimen kokoonpanot
notation: 78.513
preferred label: Kvartetter @sv
preferred label: Quartets @en

Kosketinsoitin ja kolme jousisoitinta
type: Concept
type: YKL-luokka
broader: Kvartetit
in scheme: YKL - Yleisten kirjastojen luokitusjärjestelmä
notation: 78.5131
preferred label: Ett tangentinstrument och tre stråkinstrument @sv
preferred label: One keyboard instrument and three string instruments @en

Neljä jousisoitinta
type: Concept
type: YKL-luokka
alternative label: Jousikvartetti (78.5132)
alternative label: Stråkkvartett (78.5132) @sv
broader: Kvartetit
in scheme: YKL - Yleisten kirjastojen luokitusjärjestelmä
notation: 78.5132
preferred label: Four string instruments @en
preferred label: Fyra stråkinstrument @sv

Neljä puhallinsoitinta
type: Concept
type: YKL-luokka
broader: Kvartetit
in scheme: YKL - Yleisten kirjastojen luokitusjärjestelmä
notation: 78.5133
preferred label: Four wind instruments @en
preferred label: Fyra blåsinstrument @sv

Puhallinsoitin ja kolme jousisoitinta
type: Concept
type: YKL-luokka
broader: Kvartetit
in scheme: YKL - Yleisten kirjastojen luokitusjärjestelmä
notation: 78.5134
preferred label: Ett blåsinstrument och tre stråkinstrument @sv
preferred label: One wind instrument and three string instruments @en

Muut neljän eri soittimen kokoonpanot
type: Concept
type: YKL-luokka
broader: Kvartetit
in scheme: YKL - Yleisten kirjastojen luokitusjärjestelmä
notation: 78.5139
preferred label: Other ensembles of four different instruments @en
preferred label: Övriga sammansättningar med fyra instrument @sv

Kvintetit
type: Concept
type: YKL-luokka
alternative label: Kvartett, instrument, konstmusik (78.514+) @sv
alternative label: Kvartetti, taidemusiikkisoittimet (78.514+)
alternative label: Kvintett, instrument, konstmusik (78.514+) @sv
alternative label: Kvintetti, taidemusiikkisoittimet (78.514+)
broader: Yhtyeet (2-9 soittajaa)
in scheme: YKL - Yleisten kirjastojen luokitusjärjestelmä
narrower: Kosketinsoitin ja neljä jousisoitinta
narrower: Viisi jousisoitinta
narrower: Viisi puhallinsoitinta
narrower: Puhallinsoitin ja neljä jousisoitinta
narrower: Kosketinsoitin ja neljä puhallinsoitinta
narrower: Muut viiden soittimen kokoonpanot
notation: 78.514
preferred label: Kvintetter @sv
preferred label: Quintets @en

Kosketinsoitin ja neljä jousisoitinta
type: Concept
type: YKL-luokka
broader: Kvintetit
in scheme: YKL - Yleisten kirjastojen luokitusjärjestelmä
notation: 78.5141
preferred label: Ett tangentinstrument och fyra stråkinstrument @sv
preferred label: One keyboard instrument and four string instruments @en

Viisi jousisoitinta
type: Concept
type: YKL-luokka
broader: Kvintetit
in scheme: YKL - Yleisten kirjastojen luokitusjärjestelmä
notation: 78.5142
preferred label: Fem stråkinstrument @sv
preferred label: Five string instruments @en

Viisi puhallinsoitinta
type: Concept
type: YKL-luokka
alternative label: Jousikvintetti (78.5143)
alternative label: Stråkkvintett (78.5143) @sv
broader: Kvintetit
in scheme: YKL - Yleisten kirjastojen luokitusjärjestelmä
notation: 78.5143
preferred label: Fem blåsinstrument @sv
preferred label: Five wind instruments @en

Puhallinsoitin ja neljä jousisoitinta
type: Concept
type: YKL-luokka
broader: Kvintetit
in scheme: YKL - Yleisten kirjastojen luokitusjärjestelmä
notation: 78.5144
preferred label: Ett blåsinstrument och fyra stråkinstrument @sv
preferred label: One wind instrument and four string instruments @en

Kosketinsoitin ja neljä puhallinsoitinta
type: Concept
type: YKL-luokka
broader: Kvintetit
in scheme: YKL - Yleisten kirjastojen luokitusjärjestelmä
notation: 78.5145
preferred label: Ett tangentinstrument och fyra blåsinstrument @sv
preferred label: One keyboard instrument and four wind instruments @en

Muut viiden soittimen kokoonpanot
type: Concept
type: YKL-luokka
broader: Kvintetit
in scheme: YKL - Yleisten kirjastojen luokitusjärjestelmä
notation: 78.5149
preferred label: Other ensembles of five instruments @en
preferred label: Övriga sammansättningar av fem instrument @sv

Sekstetit
type: Concept
type: YKL-luokka
alternative label: Sekstetti, taidemusiikkisoittimet (78.515)
alternative label: Sextett, instrument, konstmusik (78.515) @sv
broader: Yhtyeet (2-9 soittajaa)
in scheme: YKL - Yleisten kirjastojen luokitusjärjestelmä
notation: 78.515
preferred label: Sextets @en
preferred label: Sextetter @sv

Septetit
type: Concept
type: YKL-luokka
alternative label: Septett, instrument, konstmusik (78.516) @sv
alternative label: Septetti, taidemusiikkisoittimet (78.516)
broader: Yhtyeet (2-9 soittajaa)
in scheme: YKL - Yleisten kirjastojen luokitusjärjestelmä
notation: 78.516
preferred label: Septets @en
preferred label: Septetter @sv

Oktetit
type: Concept
type: YKL-luokka
alternative label: Oktett, instrument, konstmusik (78.517) @sv
alternative label: Oktetti, taidemusiikkisoittimet (78.517)
broader: Yhtyeet (2-9 soittajaa)
in scheme: YKL - Yleisten kirjastojen luokitusjärjestelmä
notation: 78.517
preferred label: Octets @en
preferred label: Oktetter @sv

Nonetit
type: Concept
type: YKL-luokka
alternative label: Nonett, instrument, konstmusik (78.518) @sv
alternative label: Nonetti, taidemusiikkisoittimet (78.518)
broader: Yhtyeet (2-9 soittajaa)
in scheme: YKL - Yleisten kirjastojen luokitusjärjestelmä
notation: 78.518
preferred label: Nonets @en
preferred label: Nonetter @sv

Kokoonpanoltaan poikkeukselliset yhtyeet
type: Concept
type: YKL-luokka
alternative label: Lyömäsoitinyhtyeet (78.519)
alternative label: Slaginstrumentensembler (78.519) @sv
broader: Yhtyeet (2-9 soittajaa)
in scheme: YKL - Yleisten kirjastojen luokitusjärjestelmä
notation: 78.519
preferred label: Ensembler med exceptionell sammansättning @sv
preferred label: Exceptionally combined ensembles @en
scope note: Hit placeras huvudsakligen sextetter, septetter, oktetter och nonetter med slaginstrument eller etniska instrument Ensemblens särart antyds med ämnesord @sv
scope note: Tähän sijoitetaan pääasiassa lyömä- tai etnisiä soittimia sisältävät sekstetit, septetit, oktetit ja nonetit Yhtyeen erikoislaatu ilmaistaan asiasanoin

Kamariorkesterit (yli 9, yleensä alle 25 soittajaa)
type: Concept
type: YKL-luokka
alternative label: Kamariorkesteri (78.52)
alternative label: Kammarorkester (78.52) @sv
alternative label: Orkesterimusiikki, taidemusiikki (78.52 ... 78.54)
alternative label: Orkesterit, taidemusiikki (78.52 ... 78.54)
alternative label: Orkestermusik, konstmusik (78.52 ... 78.54) @sv
alternative label: Orkestrar, konstmusik (78.52 ... 78.54) @sv
broader: Yhtye- ja orkesterimusiikki
in scheme: YKL - Yleisten kirjastojen luokitusjärjestelmä
narrower: Jousiorkesterit
narrower: Puhallinsoittimista koostuvat kamariorkesterit
notation: 78.52
preferred label: Chamber orchestras (over 9, mostly less than 25 players) @en
preferred label: Kammarorkestrar (mer än 9, vanligen mindre än 25 musiker) @sv
scope note: Hit kammarorkestrar med instrument ur olika instrumentgrupper @sv
scope note: Tähän eri soitinryhmien soittimia sisältävät kamariorkesterit

Jousiorkesterit
type: Concept
type: YKL-luokka
alternative label: Jousiorkesteri (78.521)
alternative label: Stråkorkester (78.521) @sv
broader: Kamariorkesterit (yli 9, yleensä alle 25 soittajaa)
in scheme: YKL - Yleisten kirjastojen luokitusjärjestelmä
notation: 78.521
preferred label: String orchestras @en
preferred label: Stråkorkestrar @sv
scope note: I sammansättningen kan även ingå slaginstrument @sv
scope note: Kokoonpanoon voi sisältyä myös lyömäsoittimia

Puhallinsoittimista koostuvat kamariorkesterit
type: Concept
type: YKL-luokka
alternative label: Kamariorkesteri, puhallinsoittimista koostuva (78.522)
alternative label: Kammarorkester, bestående av blåsinstrument (78.522) @sv
broader: Kamariorkesterit (yli 9, yleensä alle 25 soittajaa)
in scheme: YKL - Yleisten kirjastojen luokitusjärjestelmä
notation: 78.522
preferred label: Chamber orchestras with solely wind instruments @en
preferred label: Kammarorkestrar som består av blåsinstrument @sv
scope note: Kammarorkestrar med enbart blåsinstrument @sv
scope note: Pelkästään puhallinsoittimia sisältävät kamariorkesterit

Puhallinorkesterit (yli 25 soittajaa)
type: Concept
type: YKL-luokka
alternative label: Blåsorkester (78.53) @sv
alternative label: Musikkår (78.53) @sv
alternative label: Orkesterimusiikki, taidemusiikki (78.52 ... 78.54)
alternative label: Orkesterit, taidemusiikki (78.52 ... 78.54)
alternative label: Orkestermusik, konstmusik (78.52 ... 78.54) @sv
alternative label: Orkestrar, konstmusik (78.52 ... 78.54) @sv
alternative label: Puhallinorkesteri (78.53)
alternative label: Soittokunta (78.53)
broader: Yhtye- ja orkesterimusiikki
in scheme: YKL - Yleisten kirjastojen luokitusjärjestelmä
notation: 78.53
preferred label: Blåsorkestrar (mer än 9 musiker) @sv
preferred label: Wind orchestras (over 25 players) @en
scope note: Hit närmast orkestrar och musikkårer som består av bläckinstrument I sammansättningen kan även ingå slaginstrument @sv
scope note: Tähän lähinnä vaskipuhaltimista koostuvat orkesterit ja soittokunnat Kokoonpanoon voi sisältyä myös lyömäsoittimia

Orkesterit (yleensä enemmän kuin 25 soittajaa)
type: Concept
References: Kamariorkesterit (yli 9, yleensä alle 25 soittajaa)
References: Puhallinorkesterit (yli 25 soittajaa)
type: YKL-luokka
alternative label: Orkesterimusiikki, taidemusiikki (78.52 ... 78.54)
alternative label: Orkesterit, taidemusiikki (78.52 ... 78.54)
alternative label: Orkestermusik, konstmusik (78.52 ... 78.54) @sv
alternative label: Orkestrar, konstmusik (78.52 ... 78.54) @sv
broader: Yhtye- ja orkesterimusiikki
in scheme: YKL - Yleisten kirjastojen luokitusjärjestelmä
narrower: Sinfoniat
notation: 78.54
preferred label: Orchestras (usually more than 25 players) @en
preferred label: Orkestrar (vanligen mer än 25 musiker) @sv
scope note: Hit orkestrar i vilka det finns instrument från alla instrumentgrupper i den västerländska konstmusiken Hit all sådan musik för den s.k. symfoniorkestern för vilken det inte finns en exaktare klass (t.ex. en betydande del av balettmusiken) @sv
scope note: Tähän orkesterit, joissa on soittimia kaikista länsimaisen taidemusiikin soitinryhmistä Tähän kaikki ns. sinfoniaorkesterilla esitetty musiikki, jolle ei ole täsmällisempää luokkaa (mm. huomattava osa balettimusiikista)

Sinfoniat
type: Concept
type: YKL-luokka
alternative label: Sinfonia (78.541)
alternative label: Symfoni (78.541) @sv
broader: Orkesterit (yleensä enemmän kuin 25 soittajaa)
in scheme: YKL - Yleisten kirjastojen luokitusjärjestelmä
notation: 78.541
preferred label: Symfonier @sv
preferred label: Symphonies @en
scope note: Hit även sådana symfonier i vilkens instrumentering det ingår solistiska vokal- och/eller körpartier. I några närmast barockens verk (t.ex. kantater) ingår dock instrumentala partier vilka kallas symfonier och vilka som särutgåvor klassificeras efter instrumentering (vanligen 78.51+ eller 78.52+) @sv
scope note: Tähän myös sellaiset sinfoniat, joiden soitinnukseen sisältyy solistisia vokaali ja/tai kuoro-osuuksia Joihinkin lähinnä barokin ajan teoksiin (esim. kantaatteihin) sisältyvät sinfonia-nimiset soitinosat erikseen julkaistuina luokitetaan kuitenkin soitinnuksensa mukaan (yleensä 78.51+ tai 78.52+)

Konsertot
type: Concept
References: Konsertot yhtyeelle
References: Konsertot orkesterille
type: YKL-luokka
alternative label: Konserter (78.55+) @sv
alternative label: Konsertot (78.55+)
broader: Yhtye- ja orkesterimusiikki
in scheme: YKL - Yleisten kirjastojen luokitusjärjestelmä
narrower: Concerto grossot. Sinfonia concertantet
narrower: Konsertot kahdelle soolosoittimelle
narrower: Konsertot kolmelle tai useammalle soolosoittimelle
narrower: Konsertot yhtyeelle
narrower: Konsertot orkesterille
narrower: Konsertot yhdelle kosketin- tai näppäilysoittimelle
narrower: Konsertot yhdelle jousisoittimelle
narrower: Konsertot yhdelle puhallinsoittimelle
narrower: Konsertot muille soolosoittimille
notation: 78.55
preferred label: Concertos @en
preferred label: Konserter @sv
scope note: Allmänna verk och konsertsamlingar Hit och till undergrupperna verk i vilka det finns ett solistiskt soloinstrument eller -instrumentgrupp till ackompanjemang av orkester @sv
scope note: Yleisteokset ja erilaisten konserttojen kokoelmat Tähän ja alaluokkiin teokset, joissa on solistinen soolosoitin tai -soittimia orkesterin säestyksellä

Concerto grossot. Sinfonia concertantet
type: Concept
type: YKL-luokka
alternative label: Concerto grosso (78.551)
alternative label: Concertone (78.551)
alternative label: Sinfonia concertante (78.551)
broader: Konsertot
in scheme: YKL - Yleisten kirjastojen luokitusjärjestelmä
notation: 78.551
preferred label: Concerto grosson. Sinfonia concertanten @sv
preferred label: Concerto grossos. Sinfonia concertantes @en
scope note: Hit konserter med ifrågavarande namn oberoende av instrumentering @sv
scope note: Tähän ko. nimiset konsertot soitinnuksesta riippumatta

Konsertot kahdelle soolosoittimelle
type: Concept
type: YKL-luokka
alternative label: Konserter, för två solistiska instrument (78.552) @sv
alternative label: Konsertot, kahdelle solistiselle soittimelle (78.552)
broader: Konsertot
in scheme: YKL - Yleisten kirjastojen luokitusjärjestelmä
notation: 78.552
preferred label: Concertos for two solo instruments @en
preferred label: Konserter för två soloinstrument @sv

Konsertot kolmelle tai useammalle soolosoittimelle
type: Concept
type: YKL-luokka
alternative label: Konserter, för tre eller flera solistiska instrument (78.553) @sv
alternative label: Konsertot, kolmelle tai useammalle solistiselle soittimelle (78.553)
broader: Konsertot
in scheme: YKL - Yleisten kirjastojen luokitusjärjestelmä
notation: 78.553
preferred label: Concertos for three or more solo instruments @en
preferred label: Konserter för tre eller flera soloinstrument @sv

Konsertot yhtyeelle
type: Concept
type: YKL-luokka
alternative label: Konserter, för ensemble (78.554) @sv
alternative label: Konsertot, yhtyeelle (78.554)
broader: Konsertot
in scheme: YKL - Yleisten kirjastojen luokitusjärjestelmä
notation: 78.554
preferred label: Concertos for ensemble @en
preferred label: Konserter för ensemble @sv

Konsertot orkesterille
type: Concept
type: YKL-luokka
alternative label: Konserter, för orkester (78.555) @sv
alternative label: Konsertot, orkesterille (78.555)
broader: Konsertot
in scheme: YKL - Yleisten kirjastojen luokitusjärjestelmä
notation: 78.555
preferred label: Concertos for orchestra @en
preferred label: Konserter för orkester @sv

Konsertot yhdelle kosketin- tai näppäilysoittimelle
type: Concept
type: YKL-luokka
alternative label: Konserter, för ett tangent- eller knäppinstrument (78.556+) @sv
alternative label: Konsertot, yhdelle kosketin- tai näppäilysoittimelle (78.556+)
broader: Konsertot
in scheme: YKL - Yleisten kirjastojen luokitusjärjestelmä
narrower: Konsertot pianolle
narrower: Konsertot uruille
narrower: Konsertot cembalolle
narrower: Konsertot harpulle
narrower: Konsertot kitaralle
narrower: Konsertot harmonikalle
narrower: Muut konsertot yhdelle kosketin- tai näppäilysoittimelle
notation: 78.556
preferred label: Concertos for one keyboard or plucked instrument @en
preferred label: Konserter för ett tangent- eller knäppinstrument @sv

Konsertot pianolle
type: Concept
type: YKL-luokka
alternative label: Piano, konserter (78.5561) @sv
alternative label: Piano, konsertot (78.5561)
broader: Konsertot yhdelle kosketin- tai näppäilysoittimelle
in scheme: YKL - Yleisten kirjastojen luokitusjärjestelmä
notation: 78.5561
preferred label: Concertos for piano @en
preferred label: Pianokonserter @sv

Konsertot uruille
type: Concept
type: YKL-luokka
alternative label: Orgel, konserter (78.5562) @sv
alternative label: Urut, konsertot (78.5562)
broader: Konsertot yhdelle kosketin- tai näppäilysoittimelle
in scheme: YKL - Yleisten kirjastojen luokitusjärjestelmä
notation: 78.5562
preferred label: Concertos for organ @en
preferred label: Orgelkonserter @sv

Konsertot cembalolle
type: Concept
type: YKL-luokka
alternative label: Cembalo, konserter (78.5563) @sv
alternative label: Cembalo, konsertot (78.5563)
broader: Konsertot yhdelle kosketin- tai näppäilysoittimelle
in scheme: YKL - Yleisten kirjastojen luokitusjärjestelmä
notation: 78.5563
preferred label: Cembalokonserter @sv
preferred label: Concertos for harpsichord @en

Konsertot harpulle
type: Concept
type: YKL-luokka
alternative label: Harpa, konserter (78.5564) @sv
alternative label: Harppu, konsertot (78.5564)
broader: Konsertot yhdelle kosketin- tai näppäilysoittimelle
in scheme: YKL - Yleisten kirjastojen luokitusjärjestelmä
notation: 78.5564
preferred label: Concertos for harp @en
preferred label: Konserter för harpa @sv

Konsertot kitaralle
type: Concept
type: YKL-luokka
broader: Konsertot yhdelle kosketin- tai näppäilysoittimelle
in scheme: YKL - Yleisten kirjastojen luokitusjärjestelmä
notation: 78.5565
preferred label: Concertos for guitar @en
preferred label: Gitarrkonserter @sv

Konsertot harmonikalle
type: Concept
type: YKL-luokka
broader: Konsertot yhdelle kosketin- tai näppäilysoittimelle
in scheme: YKL - Yleisten kirjastojen luokitusjärjestelmä
notation: 78.5566
preferred label: Concertos for accordion @en
preferred label: Konserter för dragspel @sv

Muut konsertot yhdelle kosketin- tai näppäilysoittimelle
type: Concept
type: YKL-luokka
broader: Konsertot yhdelle kosketin- tai näppäilysoittimelle
in scheme: YKL - Yleisten kirjastojen luokitusjärjestelmä
notation: 78.5569
preferred label: Andra konserter för ett tangent- eller knäppinstrument @sv
preferred label: Other concertos for one keyboard or plucked instrument @en

Konsertot yhdelle jousisoittimelle
type: Concept
type: YKL-luokka
alternative label: Konserter, för ett stråkinstrument (78.557+) @sv
alternative label: Konsertot, yhdelle jousisoittimelle (78.557+)
broader: Konsertot
in scheme: YKL - Yleisten kirjastojen luokitusjärjestelmä
narrower: Konsertot viululle
narrower: Konsertot alttoviululle
narrower: Konsertot sellolle
narrower: Konsertot kontrabassolle
narrower: Muut konsertot yhdelle jousisoittimelle
notation: 78.557
preferred label: Concertos for one string instrument @en
preferred label: Konserter för ett stråkinstrument @sv

Konsertot viululle
type: Concept
type: YKL-luokka
alternative label: Violin, konserter (78.5571) @sv
alternative label: Viulu, konsertot (78.5571)
broader: Konsertot yhdelle jousisoittimelle
in scheme: YKL - Yleisten kirjastojen luokitusjärjestelmä
notation: 78.5571
preferred label: Concertos for violin @en
preferred label: Violinkonserter @sv

Konsertot alttoviululle
type: Concept
type: YKL-luokka
alternative label: Alttoviulu, konsertot (78.5572)
alternative label: Viola, konserter (78.5572) @sv
broader: Konsertot yhdelle jousisoittimelle
in scheme: YKL - Yleisten kirjastojen luokitusjärjestelmä
notation: 78.5572
preferred label: Concertos for viola @en
preferred label: Konserter för viola @sv

Konsertot sellolle
type: Concept
type: YKL-luokka
broader: Konsertot yhdelle jousisoittimelle
in scheme: YKL - Yleisten kirjastojen luokitusjärjestelmä
notation: 78.5573
preferred label: Cellokonserter @sv
preferred label: Concertos for cello @en

Konsertot kontrabassolle
type: Concept
type: YKL-luokka
broader: Konsertot yhdelle jousisoittimelle
in scheme: YKL - Yleisten kirjastojen luokitusjärjestelmä
notation: 78.5574
preferred label: Concertos for double bass @en
preferred label: Konserter för kontrabas @sv

Muut konsertot yhdelle jousisoittimelle
type: Concept
type: YKL-luokka
broader: Konsertot yhdelle jousisoittimelle
in scheme: YKL - Yleisten kirjastojen luokitusjärjestelmä
notation: 78.5579
preferred label: Andra konserter för ett stråkinstrument @sv
preferred label: Other concertos for one string instrument @en

Konsertot yhdelle puhallinsoittimelle
type: Concept
type: YKL-luokka
alternative label: Konserter, för ett blåsinstrument (78.558+) @sv
alternative label: Konsertot, yhdelle puhallinsoittimelle (78.558+)
broader: Konsertot
in scheme: YKL - Yleisten kirjastojen luokitusjärjestelmä
narrower: Konsertot huilulle
narrower: Konsertot klarinetille. Konsertot saksofonille
narrower: Konsertot oboelle
narrower: Konsertot fagotille
narrower: Konsertot trumpetille
narrower: Konsertot käyrätorvelle
narrower: Muut konsertot yhdelle puhallinsoittimelle
notation: 78.558
preferred label: Concertos for one wind instrument @en
preferred label: Konserter för ett blåsinstrument @sv

Konsertot huilulle
type: Concept
type: YKL-luokka
broader: Konsertot yhdelle puhallinsoittimelle
in scheme: YKL - Yleisten kirjastojen luokitusjärjestelmä
notation: 78.5581
preferred label: Concertos for flute @en
preferred label: Flöjtkonserter @sv

Konsertot klarinetille. Konsertot saksofonille
type: Concept
type: YKL-luokka
broader: Konsertot yhdelle puhallinsoittimelle
in scheme: YKL - Yleisten kirjastojen luokitusjärjestelmä
notation: 78.5582
preferred label: Concertos for clarinet. Concertos for saxophone @en
preferred label: Klarinettkonserter. Saxofonkonserter @sv

Konsertot oboelle
type: Concept
type: YKL-luokka
broader: Konsertot yhdelle puhallinsoittimelle
in scheme: YKL - Yleisten kirjastojen luokitusjärjestelmä
notation: 78.5583
preferred label: Concertos for oboe @en
preferred label: Oboekonserter @sv

Konsertot fagotille
type: Concept
type: YKL-luokka
alternative label: Fagott, konserter (78.5584) @sv
alternative label: Fagotti, konsertot (78.5584)
broader: Konsertot yhdelle puhallinsoittimelle
in scheme: YKL - Yleisten kirjastojen luokitusjärjestelmä
notation: 78.5584
preferred label: Concertos for bassoon @en
preferred label: Fagottkonserter @sv

Konsertot trumpetille
type: Concept
type: YKL-luokka
broader: Konsertot yhdelle puhallinsoittimelle
in scheme: YKL - Yleisten kirjastojen luokitusjärjestelmä
notation: 78.5585
preferred label: Concertos for trumpet @en
preferred label: Trumpetkonserter @sv

Konsertot käyrätorvelle
type: Concept
type: YKL-luokka
broader: Konsertot yhdelle puhallinsoittimelle
in scheme: YKL - Yleisten kirjastojen luokitusjärjestelmä
notation: 78.5586
preferred label: Concertos for French horn @en
preferred label: Valthornskonserter @sv

Muut konsertot yhdelle puhallinsoittimelle
type: Concept
type: YKL-luokka
broader: Konsertot yhdelle puhallinsoittimelle
in scheme: YKL - Yleisten kirjastojen luokitusjärjestelmä
notation: 78.5589
preferred label: Andra konserter för ett blåsinstrument @sv
preferred label: Other concertos for one wind instrument @en

Konsertot muille soolosoittimille
type: Concept
type: YKL-luokka
broader: Konsertot
in scheme: YKL - Yleisten kirjastojen luokitusjärjestelmä
notation: 78.559
preferred label: Concertos for other solo instruments @en
preferred label: Konserter för andra soloinstrument @sv

Kosketinsoitinmusiikki. Näppäilysoitinmusiikki
type: Concept
References: Soitinrakennus
References: MUSIIKKI
References: URN:NBN:fi:au:ykl:78.03
References: URN:NBN:fi:au:ykl:78.8907
type: YKL-luokka
alternative label: Balettimusiikki, soitinmusiikki (78.6 ... 78.8+)
alternative label: Balettmusik, instrumentalmusik (78.6 ... 78.8+) @sv
alternative label: Etyder, tangentinstrument (78.6+) @sv
alternative label: Etydit, kosketinsoittimet (78.6+)
alternative label: Instrumentskolor (78.6 ... 78.879) @sv
alternative label: Knäppinstrument (78.6) @sv
alternative label: Kosketinsoittimet (78.6)
alternative label: Näppäilysoittimet (78.6)
alternative label: Soitonoppaat (78.6 ... 78.879)
alternative label: Tangentinstrument (78.6) @sv
broader: MUSIIKKI
in scheme: YKL - Yleisten kirjastojen luokitusjärjestelmä
narrower: Piano
narrower: Urut
narrower: Cembalo
narrower: Harppu
narrower: Kitara
narrower: Harmonikka
narrower: Kantele
narrower: Muut kosketinsoittimet
narrower: Muut näppäilysoittimet
notation: 78.6
preferred label: Keyboard music. Music for plucked instruments @en
preferred label: Musik för tangentinstrument. Musik för knäppinstrument @sv
scope note: Allmänna verk och samlingar som behandlar tangent- och knäppinstrument antingen tillsammans eller separat I varje instrumentklass har bara några viktigaste instrument nämnts, klassificering av de andra framgår av indexen Hit och till andra instrumentgrupper 78.6107-78.87907 endast sådana instrumentskolor som följer den västerländska konstmusikens tradition eller vars stilart är antingen allmän eller odifferentierad Om publikationen innehåller både material som hör till instrumentklasserna och material som hör till instrumentbygge, ges företräde åt instrumentklassen @sv
scope note: Kosketin- ja näppäilysoittimia yhdessä tai erikseen käsittelevät yleisteokset ja kokoelmat Kussakin soitinluokassa on mainittu vain tärkeimpiä soitinryhmän jäseniä, muiden luokitus selviää hakemistosta Tähän ja muihin soitinluokkiin 78.6107-78.87907 vain länsimaisen taidemusiikin perinteen mukaiset ja tyylilajiltaan yleiset tai eriytymättömät soitonoppaat Jos julkaisussa on sekä soitinluokkien että soitinrakennuksen luokan aineksia, annetaan etusija soitinluokalle

Piano
type: Concept
References: Kosketinsoitinmusiikki. Näppäilysoitinmusiikki
type: YKL-luokka
alternative label: Flygel (78.61+) @sv
alternative label: Flyygeli (78.61+)
alternative label: Fortepiano (78.61+)
alternative label: Hammarklaver (78.61+) @sv
alternative label: Hammerklavier (78.61+)
alternative label: Klavikord (78.61+) @sv
alternative label: Klavikordi (78.61+)
alternative label: Piano (78.61+)
alternative label: Preparerat piano (78.61+) @sv
alternative label: Preparoitu piano (78.61+)
alternative label: Taffelipiano (78.61+)
alternative label: Taffelpiano (78.61+) @sv
alternative label: Vasaraklaveeri (78.61+)
broader: Kosketinsoitinmusiikki. Näppäilysoitinmusiikki
in scheme: YKL - Yleisten kirjastojen luokitusjärjestelmä
narrower: Pianonsoiton opintoaineistoksi tarkoitettu musiikki (esim. etydit)
narrower: Piano neli- tai useampikätisesti soitettuna
narrower: Kaksi tai useampia pianoja
notation: 78.61
scope note: Hit även t.ex. klavikord och fortepiano Om en duo ackompanjeras av ett piano eller något annat ackordinstrument, klassificeras efter soloinstrumentet i fråga Handböcker i pianospel 78.6107 @sv
scope note: Tähän myös mm. klavikordi ja vasaraklaveeri Jos piano tai muu sointusoitin on duossa säestyssoittimena, luokitetaan ko. soolosoittimen mukaan Pianonsoitonoppaat 78.6107

Pianonsoiton opintoaineistoksi tarkoitettu musiikki (esim. etydit)
type: Concept
type: YKL-luokka
broader: Piano
in scheme: YKL - Yleisten kirjastojen luokitusjärjestelmä
notation: 78.611
preferred label: Music intended as study material for piano playing (e.g. études) @en
preferred label: Musik är avsedd som studiematerial i pianospel (t.ex. etyder) @sv

Piano neli- tai useampikätisesti soitettuna
type: Concept
type: YKL-luokka
broader: Piano
in scheme: YKL - Yleisten kirjastojen luokitusjärjestelmä
notation: 78.612
preferred label: Piano music for four hands or more @en
preferred label: Piano spelat fyr- eller flerhändigt @sv

Kaksi tai useampia pianoja
type: Concept
type: YKL-luokka
broader: Piano
in scheme: YKL - Yleisten kirjastojen luokitusjärjestelmä
notation: 78.613
preferred label: Två eller flera pianon @sv
preferred label: Two or more pianos @en

Urut
type: Concept
type: YKL-luokka
alternative label: Harmoni (78.62+)
alternative label: Orgel (78.62+) @sv
alternative label: Orgelharmonium (78.62+) @sv
alternative label: Pneumaattiset urut (78.62)
alternative label: Pneumatisk orgel (78.62) @sv
alternative label: Positiiviurut (78.62+)
alternative label: Positivorgel (78.62+) @sv
alternative label: Regaali, soitin (78.62+)
alternative label: Regal, instrument (78.62+) @sv
alternative label: Urkuharmoni (78.62+)
alternative label: Urut (78.62+)
alternative label: Vattenorgel (78.62+) @sv
alternative label: Vesiurut (78.62+)
broader: Kosketinsoitinmusiikki. Näppäilysoitinmusiikki
in scheme: YKL - Yleisten kirjastojen luokitusjärjestelmä
narrower: Urkujensoiton opintoaineistoksi tarkoitettu musiikki
narrower: Urut neli- ja useampikätisesti soitettuina
narrower: Kahdet tai useammat urut
notation: 78.62
preferred label: Organs @en
preferred label: Orgel @sv
scope note: Hit även harmonium och portativ @sv
scope note: Tähän myös urkuharmoni ja portatiiviurut

Urkujensoiton opintoaineistoksi tarkoitettu musiikki
type: Concept
type: YKL-luokka
broader: Urut
in scheme: YKL - Yleisten kirjastojen luokitusjärjestelmä
notation: 78.621
preferred label: Music intended as study material for organ playing @en
preferred label: Musik avsedd som studiematerial i orgelspel @sv

Urut neli- ja useampikätisesti soitettuina
type: Concept
type: YKL-luokka
broader: Urut
in scheme: YKL - Yleisten kirjastojen luokitusjärjestelmä
notation: 78.622
preferred label: Organ music for four hands or more @en
preferred label: Orgel spelad fyr- eller flerhändigt @sv

Kahdet tai useammat urut
type: Concept
type: YKL-luokka
broader: Urut
in scheme: YKL - Yleisten kirjastojen luokitusjärjestelmä
notation: 78.623
preferred label: Två eller flera orglar @sv
preferred label: Two or more organs @en

Cembalo
type: Concept
References: Piano
type: YKL-luokka
alternative label: Cembalo (78.63+)
alternative label: Harpsichord (78.63+)
alternative label: Kielflügel (78.63+)
alternative label: Spinett (78.63+) @sv
alternative label: Spinetti (78.63+)
alternative label: Virginaali (78.63+)
alternative label: Virginal (78.63+) @sv
broader: Kosketinsoitinmusiikki. Näppäilysoitinmusiikki
in scheme: YKL - Yleisten kirjastojen luokitusjärjestelmä
narrower: Cembalonsoiton opintoaineistoksi tarkoitettu musiikki
narrower: Cembalo neli- tai useampikätisesti soitettuna
narrower: Kaksi tai useampia cembaloita
notation: 78.63
preferred label: Harpsichord @en
scope note: Hit även bl.a. virginal och spinett @sv
scope note: Tähän myös mm. virginaali ja spinetti

Cembalonsoiton opintoaineistoksi tarkoitettu musiikki
type: Concept
type: YKL-luokka
broader: Cembalo
in scheme: YKL - Yleisten kirjastojen luokitusjärjestelmä
notation: 78.631
preferred label: Music intended as study material for harpsichord playing @en
preferred label: Musik avsedd som studiematerial i cembalospel @sv

Cembalo neli- tai useampikätisesti soitettuna
type: Concept
type: YKL-luokka
broader: Cembalo
in scheme: YKL - Yleisten kirjastojen luokitusjärjestelmä
notation: 78.632
preferred label: Cembalo spelad fyr- eller flerhändigt @sv
preferred label: Harpsichord music for four hands or more @en

Kaksi tai useampia cembaloita
type: Concept
type: YKL-luokka
broader: Cembalo
in scheme: YKL - Yleisten kirjastojen luokitusjärjestelmä
notation: 78.633
preferred label: Två eller flera cembalor @sv
preferred label: Two or more harpsichords @en

Harppu
type: Concept
References: Etnomusiikki. Kansanmusiikki
type: YKL-luokka
alternative label: Chrotta, näppäilysoittimena (78.64+)
alternative label: Chrotta, som knäppinstrument (78.64+) @sv
alternative label: Crwth, näppäilysoittimena (78.64+)
alternative label: Crwth, som knäppinstrument (78.64+) @sv
alternative label: Harpa (78.64+) @sv
alternative label: Harppu (78.64+)
alternative label: Psalterion (78.64+)
alternative label: Psalterium (78.64+) @sv
broader: Kosketinsoitinmusiikki. Näppäilysoitinmusiikki
in scheme: YKL - Yleisten kirjastojen luokitusjärjestelmä
narrower: Harpunsoiton opintoaineistoksi tarkoitettu musiikki
narrower: Kaksi tai useampia harppuja
notation: 78.64
preferred label: Harp @en
preferred label: Harpa @sv
scope note: Hit även bl.a. den medeltidsharpa och psalterium @sv
scope note: Tähän myös mm. keskiaikainen harppu ja psalterion

Harpunsoiton opintoaineistoksi tarkoitettu musiikki
type: Concept
type: YKL-luokka
broader: Harppu
in scheme: YKL - Yleisten kirjastojen luokitusjärjestelmä
notation: 78.641
preferred label: Music intended as study material for harp playing @en
preferred label: Musik avsedd som studiematerial i harpspel @sv

Kaksi tai useampia harppuja
type: Concept
type: YKL-luokka
broader: Harppu
in scheme: YKL - Yleisten kirjastojen luokitusjärjestelmä
notation: 78.643
preferred label: Två eller flera harpor @sv
preferred label: Two or more harps @en

Kitara
type: Concept
type: YKL-luokka
alternative label: Archiliuto (78.65+)
alternative label: Chitarra (78.65+)
alternative label: Chitarrone (78.65+)
alternative label: Citole (78.65+)
alternative label: Gitarr (78.65+) @sv
alternative label: Havaijinkitara, kitara (78.65+)
alternative label: Hawaiigitarr, gitarr (78.65+) @sv
alternative label: Kitara (78.65+)
alternative label: Laute (78.65+)
alternative label: Luta (78.65+) @sv
alternative label: Luuttu (78.65+)
alternative label: Lyragitarr (78.65+) @sv
alternative label: Lyyrakitara (78.65+)
alternative label: Slide guitar, gitarr (78.65+) @sv
alternative label: Slide guitar, kitara (78.65+)
alternative label: Teorb (78.65+) @sv
alternative label: Teorbi (78.65+)
alternative label: Vihuela (78.65+)
broader: Kosketinsoitinmusiikki. Näppäilysoitinmusiikki
in scheme: YKL - Yleisten kirjastojen luokitusjärjestelmä
narrower: Kitaransoiton opintoaineistoksi tarkoitettu musiikki
narrower: Kaksi tai useampia kitaroita
notation: 78.65
preferred label: Gitarr @sv
preferred label: Guitar @en
scope note: Hit förutom egentliga gitarrer även bl.a. alla lutinstrument och vihuela @sv
scope note: Tähän varsinaisten kitaroiden lisäksi myös mm. kaikki luuttusoittimet ja vihuela

Kitaransoiton opintoaineistoksi tarkoitettu musiikki
type: Concept
type: YKL-luokka
broader: Kitara
in scheme: YKL - Yleisten kirjastojen luokitusjärjestelmä
notation: 78.651
preferred label: Music intended as study material for guitar playing @en
preferred label: Musik avsedd som läromaterial i gitarrspel @sv

Kaksi tai useampia kitaroita
type: Concept
type: YKL-luokka
broader: Kitara
in scheme: YKL - Yleisten kirjastojen luokitusjärjestelmä
notation: 78.653
preferred label: Två eller flera gitarrer @sv
preferred label: Two or more guitars @en

Harmonikka
type: Concept
References: Viihdemusiikki
type: YKL-luokka
alternative label: Accordéon (78.66+)
alternative label: Bandoneon (78.66+)
alternative label: Concertina (78.66+)
alternative label: Dragspel (78.66+)
alternative label: Haitari (78.66+)
alternative label: Hanuri (78.66+)
alternative label: Harmonika (78.66+) @sv
alternative label: Harmonikka (78.66+)
alternative label: Musette, harmonika (78.66+) @sv
alternative label: Musette, harmonikka (78.66+)
broader: Kosketinsoitinmusiikki. Näppäilysoitinmusiikki
in scheme: YKL - Yleisten kirjastojen luokitusjärjestelmä
narrower: Harmonikan opintoaineistoksi tarkoitettu musiikki
narrower: Kaksi tai useampia harmonikkoja
notation: 78.66
preferred label: Accordion @en
preferred label: Dragspel @sv
scope note: Hit alla dragspelsinstrument av olika typer @sv
scope note: Tähän kaikki erityyppiset harmonikkasoittimet

Harmonikan opintoaineistoksi tarkoitettu musiikki
type: Concept
type: YKL-luokka
broader: Harmonikka
in scheme: YKL - Yleisten kirjastojen luokitusjärjestelmä
notation: 78.661
preferred label: Music intended as study material for accordion playing @en
preferred label: Musik avsedd som läromaterial i spel på dragspel @sv

Kaksi tai useampia harmonikkoja
type: Concept
type: YKL-luokka
broader: Harmonikka
in scheme: YKL - Yleisten kirjastojen luokitusjärjestelmä
notation: 78.663
preferred label: Två eller flera dragspel @sv
preferred label: Two or more accordions @en

Kantele
type: Concept
References: Etnomusiikki. Kansanmusiikki
type: YKL-luokka
alternative label: Citterinstument (78.67+) @sv
alternative label: Dulcimer, näppäilysoittimena (78.67+)
alternative label: Dulcimer, som knäppinstrument (78.67+) @sv
alternative label: Gusli (78.67+)
alternative label: Kantele (78.67+)
alternative label: Pandora, instrument (78.67+) @sv
alternative label: Pandora, soitin (78.67+)
alternative label: Sitrasoittimet (78.67+)
broader: Kosketinsoitinmusiikki. Näppäilysoitinmusiikki
in scheme: YKL - Yleisten kirjastojen luokitusjärjestelmä
narrower: Kanteleensoiton opintoaineistoksi tarkoitettu musiikki
narrower: Kaksi tai useampia kanteleita
notation: 78.67
scope note: Hit alla citterinstrument och dulcimer @sv
scope note: Tähän kaikki sitrasoittimet ja dulcimer

Kanteleensoiton opintoaineistoksi tarkoitettu musiikki
type: Concept
type: YKL-luokka
broader: Kantele
in scheme: YKL - Yleisten kirjastojen luokitusjärjestelmä
notation: 78.671
preferred label: Music intended as study material for kantele playing @en
preferred label: Musik avsedd som läromaterial i kantelespel @sv

Kaksi tai useampia kanteleita
type: Concept
type: YKL-luokka
broader: Kantele
in scheme: YKL - Yleisten kirjastojen luokitusjärjestelmä
notation: 78.673
preferred label: Två eller flera kanteler @sv
preferred label: Two or more kanteles @en

Muut kosketinsoittimet
type: Concept
References: Musiikkikulttuurien sulautumat. Populaarimusiikki
type: YKL-luokka
alternative label: Celesta, kosketinsoittimena (78.68+)
alternative label: Celesta, som tangentinstrument (78.68+) @sv
alternative label: Elorgel (78.68+) @sv
alternative label: Mellotron (78.68+) @sv
alternative label: Mellotroni (78.68+)
alternative label: Moog (78.68+)
alternative label: Syntetisaattori, kosketinsoitinkoskettimistolla varustettu (78.68+)
alternative label: Syntetisator, utrustad med klaviatur (78.68+) @sv
alternative label: Sähköurut (78.68+)
alternative label: Trautonium, kosketinsoittimet (78.68+)
alternative label: Trautonium, tangentinstrument (78.68+) @sv
broader: Kosketinsoitinmusiikki. Näppäilysoitinmusiikki
in scheme: YKL - Yleisten kirjastojen luokitusjärjestelmä
narrower: Sähköurkujensoiton opintoaineistoksi tarkoitettu musiikki
narrower: Sähköurut neli- tai useampikätisesti soitettuina
narrower: Kahdet tai useammat sähköurut
notation: 78.68
preferred label: Other keyboard instruments @en
preferred label: Övriga tangentinstrument @sv
scope note: Hit bl.a. elorgel och synthesizers som styrs med tangentinstrumentens tangenter @sv
scope note: Tähän mm. sähköurut ja kosketinsoittimien koskettimilla ohjattavat syntetisaattorit

Sähköurkujensoiton opintoaineistoksi tarkoitettu musiikki
type: Concept
type: YKL-luokka
broader: Muut kosketinsoittimet
in scheme: YKL - Yleisten kirjastojen luokitusjärjestelmä
notation: 78.681
preferred label: Music intended as study material for electric organ playing @en
preferred label: Musik avsedd som studiematerial i elorgelspel @sv

Sähköurut neli- tai useampikätisesti soitettuina
type: Concept
type: YKL-luokka
broader: Muut kosketinsoittimet
in scheme: YKL - Yleisten kirjastojen luokitusjärjestelmä
notation: 78.682
preferred label: Elorgel spelad fyr- eller flerhändigt @sv
preferred label: Music for electric organ for four hands or more @en

Kahdet tai useammat sähköurut
type: Concept
type: YKL-luokka
broader: Muut kosketinsoittimet
in scheme: YKL - Yleisten kirjastojen luokitusjärjestelmä
notation: 78.683
preferred label: Två eller flera elorglar @sv
preferred label: Two or more electric organs @en

Muut näppäilysoittimet
type: Concept
References: Etnomusiikki. Kansanmusiikki
type: YKL-luokka
alternative label: Balalaikka, näppäilysoittimet (78.69+)
alternative label: Balalajka, knäppinstrument (78.69+) @sv
alternative label: Bandora (78.69+)
alternative label: Bandurria (78.69+)
alternative label: Banjo (78.69)
alternative label: Basgitarr, knäppinstrument (78.69+) @sv
alternative label: Bassokitara, näppäilysoittimet (78.69+)
alternative label: Cittern (78.69+)
alternative label: Domra (78.69+)
alternative label: Elbas, gitarr (78.69+) @sv
alternative label: Elgitarr, gitarr (78.69+) @sv
alternative label: Gusla (78.69+)
alternative label: Helikon, kielisoitin (78.69+)
alternative label: Helikon, stränginstrument (78.69+) @sv
alternative label: Lyra (78.69+) @sv
alternative label: Lyyra (78.69+)
alternative label: Mandola (78.69+)
alternative label: Mandoliini (78.69+)
alternative label: Mandolin (78.69+) @sv
alternative label: Pedaalikitara, näppäilysoittimet (78.69+)
alternative label: Pedalgitarr, knäppinstrument (78.69+) @sv
alternative label: Sitar, knäppinstrument (78.69+) @sv
alternative label: Sitar, näppäilysoittimet (78.69+)
alternative label: Steel guitar, gitarr (78.69+) @sv
alternative label: Steel guitar, kitara (78.69+)
alternative label: Syntetisaattori, näppäilysoittimiin yhdistettynä (78.69+)
alternative label: Syntetisator, i anslutning till knäppinstrument (78.69+) @sv
alternative label: Sähköbasso, kitara (78.69+)
alternative label: Sähkökitara, kitara (78.69+)
alternative label: Tanbur, knäppinstrument (78.69+) @sv
alternative label: Tanpura, näppäilysoittimet (78.69+)
alternative label: Ukulele (78.69+)
broader: Kosketinsoitinmusiikki. Näppäilysoitinmusiikki
in scheme: YKL - Yleisten kirjastojen luokitusjärjestelmä
narrower: Muiden näppäilysoittimien soiton opintoaineistoksi tarkoitettu musiikki
narrower: Kaksi muuta (samaa) näppäilysoitinta tai useampia muita (samoja) näppäilysoittimia
notation: 78.69
preferred label: Other plucked instruments @en
preferred label: Övriga knäppinstrument @sv
scope note: Hit bl.a. banjo, balalajka, mandolin och sitar samt synthesizers som kopplats till knäppinstrument Elgitarr. Elbas @sv
scope note: Tähän mm. banjo, balalaikka, mandoliini ja sitar sekä näppäilysoittimiin yhdistetyt syntetisaattorit Sähkökitara. Bassokitara

Muiden näppäilysoittimien soiton opintoaineistoksi tarkoitettu musiikki
type: Concept
type: YKL-luokka
broader: Muut näppäilysoittimet
in scheme: YKL - Yleisten kirjastojen luokitusjärjestelmä
notation: 78.691
preferred label: Music intended as study material for playing other plucked instruments @en
preferred label: Musik avsedd som studiematerial för spelande av övriga knäppinstrument @sv

Kaksi muuta (samaa) näppäilysoitinta tai useampia muita (samoja) näppäilysoittimia
type: Concept
type: YKL-luokka
broader: Muut näppäilysoittimet
in scheme: YKL - Yleisten kirjastojen luokitusjärjestelmä
notation: 78.693
preferred label: Två övriga likadana knäppinstrument eller flera övriga likadana knäppinstrument @sv
preferred label: Two or more other plucked instruments (all similar). @en

Jousisoitinmusiikki
type: Concept
References: Soitinrakennus
References: MUSIIKKI
References: URN:NBN:fi:au:ykl:78.03
References: URN:NBN:fi:au:ykl:78.8907
type: YKL-luokka
alternative label: Balettimusiikki, soitinmusiikki (78.6 ... 78.8+)
alternative label: Balettmusik, instrumentalmusik (78.6 ... 78.8+) @sv
alternative label: Etyder, stråkinstrument (78.7+) @sv
alternative label: Etydit, jousisoittimet (78.7+)
alternative label: Instrumentskolor (78.6 ... 78.879) @sv
alternative label: Jousisoittimet (78.7)
alternative label: Soitonoppaat (78.6 ... 78.879)
alternative label: Stråkinstrument (78.7) @sv
broader: MUSIIKKI
in scheme: YKL - Yleisten kirjastojen luokitusjärjestelmä
narrower: Viulu
narrower: Alttoviulu
narrower: Sello
narrower: Kontrabasso
narrower: Muut jousisoittimet
notation: 78.7
preferred label: Music for string instruments @en
preferred label: Musik för stråkinstrument @sv
scope note: Allmänna verk och samlingar med blandat innehåll I varje instrumentklass har bara några viktigaste instrument nämnts, klassificering av de andra framgår av indexen Hit och till andra instrumentgrupper 78.6107-78.87907 endast sådana instrumentskolor som följer den västerländska konstmusikens tradition eller vars stilart är antingen allmän eller odifferentierad Om publikationen innehåller både material som hör till instrumentklasserna och material som hör till instrumentbygge, ges företräde åt instrumentklassen @sv
scope note: Yleisteokset ja sekasisältöiset kokoelmat Kussakin soitinluokassa on mainittu vain tärkeimpiä soitinryhmän jäseniä, muiden luokitus selviää hakemistosta Tähän ja muihin soitinluokkiin 78.6107-78.87907 vain länsimaisen taidemusiikin perinteen mukaiset ja tyylilajiltaan yleiset tai eriytymättömät soitonoppaat Jos julkaisussa on sekä soitinluokkien että soitinrakennuksen luokan aineksia, annetaan etusija soitinluokalle

Viulu
type: Concept
type: YKL-luokka
alternative label: Barockfiol (78.71) @sv
alternative label: Barokkiviulu (78.71)
alternative label: Hardangerfiol (78.71) @sv
alternative label: Hardangerinviulu (78.71)
alternative label: Viola da braccio (78.71)
alternative label: Violin (78.71+) @sv
alternative label: Viulu (78.71+)
broader: Jousisoitinmusiikki
in scheme: YKL - Yleisten kirjastojen luokitusjärjestelmä
narrower: Viulunsoiton opintoaineistoksi tarkoitettu musiikki
narrower: Viulu ilman säestystä
narrower: Kaksi tai useampia viuluja
notation: 78.71
preferred label: Violin @en
scope note: Violin till ackompanjemang av piano eller annat ackordinstrument Hit även bl.a. barockviol Violinskolor 78.7107 @sv
scope note: Viulu pianon tai muun sointusoittimen säestyksellä Tähän myös mm. barokkiviulu Viulunsoitonoppaat 78.7107

Viulunsoiton opintoaineistoksi tarkoitettu musiikki
type: Concept
type: YKL-luokka
broader: Viulu
in scheme: YKL - Yleisten kirjastojen luokitusjärjestelmä
notation: 78.711
preferred label: Music intended as study material for violin playing @en
preferred label: Musik avsedd som studiematerial i violinspel @sv

Viulu ilman säestystä
type: Concept
type: YKL-luokka
broader: Viulu
in scheme: YKL - Yleisten kirjastojen luokitusjärjestelmä
notation: 78.712
preferred label: Violin unaccompanied @en
preferred label: Violin utan ackompanjemang @sv

Kaksi tai useampia viuluja
type: Concept
type: YKL-luokka
broader: Viulu
in scheme: YKL - Yleisten kirjastojen luokitusjärjestelmä
notation: 78.713
preferred label: Två eller flera violiner @sv
preferred label: Two or more violins @en

Alttoviulu
type: Concept
type: YKL-luokka
alternative label: Alttoviulu (78.72+)
alternative label: Barytonfiol (78.72) @sv
alternative label: Barytoniviulu (78.72)
alternative label: Bratsche (78.72+)
alternative label: Viola (78.72+) @sv
alternative label: Viola d'amore (78.72+)
alternative label: Viola pomposa (78.72+)
broader: Jousisoitinmusiikki
in scheme: YKL - Yleisten kirjastojen luokitusjärjestelmä
narrower: Alttoviulunsoiton opintoaineistoksi tarkoitettu musiikki
narrower: Alttoviulu ilman säestystä
narrower: Kaksi tai useampia alttoviuluja
notation: 78.72
preferred label: Viola @en
scope note: Alttoviulu pianon tai muun sointusoittimen säestyksellä Tähän myös mm. viola d'amore
scope note: Viola till ackompanjemang av piano eller något annat ackordinstrument Hit även bl.a. viola d'amore @sv

Alttoviulunsoiton opintoaineistoksi tarkoitettu musiikki
type: Concept
type: YKL-luokka
broader: Alttoviulu
in scheme: YKL - Yleisten kirjastojen luokitusjärjestelmä
notation: 78.721
preferred label: Music intended as study material for viola playing @en
preferred label: Musik avsedd som studiematerial i violaspel @sv

Alttoviulu ilman säestystä
type: Concept
type: YKL-luokka
broader: Alttoviulu
in scheme: YKL - Yleisten kirjastojen luokitusjärjestelmä
notation: 78.722
preferred label: Viola unaccompanied @en
preferred label: Viola utan ackompanjemang @sv

Kaksi tai useampia alttoviuluja
type: Concept
type: YKL-luokka
broader: Alttoviulu
in scheme: YKL - Yleisten kirjastojen luokitusjärjestelmä
notation: 78.723
preferred label: Två eller flera violor @sv
preferred label: Two or more violas @en

Sello
type: Concept
References: Muut jousisoittimet
type: YKL-luokka
alternative label: Cello (78.73+) @sv
alternative label: Sello (78.73+)
alternative label: Viola da gamba, tenor (78.73+) @sv
alternative label: Viola da gamba, tenori (78.73+)
broader: Jousisoitinmusiikki
in scheme: YKL - Yleisten kirjastojen luokitusjärjestelmä
narrower: Sellonsoiton opintoaineistoksi tarkoitettu musiikki
narrower: Sello ilman säestystä
narrower: Kaksi tai useampia selloja
notation: 78.73
preferred label: Cello @en
scope note: Cello till ackompanjemang av piano eller något annat ackordinstrument Hit även bl.a. viola da gambas tenorform @sv
scope note: Sello pianon tai muun sointusoittimen säestyksellä Tähän myös mm. tenoriääninen viola da gamba

Sellonsoiton opintoaineistoksi tarkoitettu musiikki
type: Concept
type: YKL-luokka
broader: Sello
in scheme: YKL - Yleisten kirjastojen luokitusjärjestelmä
notation: 78.731
preferred label: Music intended as study material for cello playing @en
preferred label: Musik avsedd som studiematerial i cellospel @sv

Sello ilman säestystä
type: Concept
type: YKL-luokka
broader: Sello
in scheme: YKL - Yleisten kirjastojen luokitusjärjestelmä
notation: 78.732
preferred label: Cello unaccompanied @en
preferred label: Cello utan ackompanjemang @sv

Kaksi tai useampia selloja
type: Concept
type: YKL-luokka
broader: Sello
in scheme: YKL - Yleisten kirjastojen luokitusjärjestelmä
notation: 78.733
preferred label: Två eller flera cellor @sv
preferred label: Two or more cellos @en

Kontrabasso
type: Concept
type: YKL-luokka
alternative label: Basfiol (78.74+) @sv
alternative label: Bassoviulu (78.74+)
alternative label: Elbas, kontrabas (78.74+) @sv
alternative label: Kontrabas (78.74+) @sv
alternative label: Kontrabasso (78.74+)
alternative label: Sähköbasso, kontrabasso (78.74+)
alternative label: Violone (78.74+)
broader: Jousisoitinmusiikki
in scheme: YKL - Yleisten kirjastojen luokitusjärjestelmä
narrower: Kontrabassonsoiton opintoaineistoksi tarkoitettu musiikki
narrower: Kontrabasso ilman säestystä
narrower: Kaksi tai useampia kontrabassoja
notation: 78.74
preferred label: Double bass @en
preferred label: Kontrabas @sv
scope note: Kontrabas till ackompanjemang av piano eller något annat ackordinstrument Hit även bl.a. violone @sv
scope note: Kontrabasso pianon tai muun sointusoittimen säestyksellä Tähän myös mm. violone

Kontrabassonsoiton opintoaineistoksi tarkoitettu musiikki
type: Concept
type: YKL-luokka
broader: Kontrabasso
in scheme: YKL - Yleisten kirjastojen luokitusjärjestelmä
notation: 78.741
preferred label: Music intended as study material for double bass playing @en
preferred label: Musik avsedd som studiematerial i kontrabasspel @sv

Kontrabasso ilman säestystä
type: Concept
type: YKL-luokka
broader: Kontrabasso
in scheme: YKL - Yleisten kirjastojen luokitusjärjestelmä
notation: 78.742
preferred label: Double bass unaccompanied @en
preferred label: Kontrabas utan ackompanjemang @sv

Kaksi tai useampia kontrabassoja
type: Concept
type: YKL-luokka
broader: Kontrabasso
in scheme: YKL - Yleisten kirjastojen luokitusjärjestelmä
notation: 78.743
preferred label: Två eller flera kontrabasar @sv
preferred label: Two or more double basses @en

Muut jousisoittimet
type: Concept
type: YKL-luokka
alternative label: Arpeggione (78.79)
alternative label: Avainviulu (78.79)
alternative label: Baryton (78.79+) @sv
alternative label: Barytoni (78.79+)
alternative label: Chrotta, jousisoittimena (78.79+)
alternative label: Chrotta, som stråkinstrument (78.79+) @sv
alternative label: Crwth, jousisoittimena (78.79+)
alternative label: Crwth, som stråkinstrument (78.79+) @sv
alternative label: Fidla (78.79+) @sv
alternative label: Fiideli (78.79+)
alternative label: Gamba (78.79+)
alternative label: Jouhikannel (78.79+)
alternative label: Jouhikko (78.79+)
alternative label: Neulaviulu (78.79+)
alternative label: Nyckelharpa (78.79) @sv
alternative label: Nyckelharpa (78.79+)
alternative label: Pochette (78.79+)
alternative label: Psalmodikon (78.79+) @sv
alternative label: Rebec (78.79+)
alternative label: Spikharmonika (78.79+) @sv
alternative label: Stråkharpa (78.79+) @sv
alternative label: Syntetisaattori, jousisoittimiin yhdistettynä (78.79)
alternative label: Syntetisator, i anslutning till stråkinstrument (78.79) @sv
alternative label: Vielle (78.79+)
alternative label: Viola da gamba, andra än tenor (78.79+) @sv
alternative label: Viola da gamba, muut kuin tenori (78.79+)
alternative label: Viola di bardone (78.79+)
alternative label: Virsikannel (78.79+)
broader: Jousisoitinmusiikki
in scheme: YKL - Yleisten kirjastojen luokitusjärjestelmä
narrower: Muiden jousisoittimien soiton opintoaineistoksi tarkoitettu musiikki
narrower: Muut jousisoittimet ilman säestystä
narrower: Kaksi muuta (samaa) jousisoitinta tai useampia muita (samoja) jousisoittimia
notation: 78.79
preferred label: Other string instruments @en
preferred label: Övriga stråkinstrument @sv
scope note: Muu jousisoitin pianon tai muun sointusoittimen säestyksellä. Tähän mm. arpeggione ja viola da gamba, paitsi tenoriääninen 78.73
scope note: Övrigt stråkinstrument till ackompanjemang av piano eller något annat ackordinstrument. Hit bl.a. arpeggione och viola da gamba med undantag av dess tenorform 78.73 @sv

Muiden jousisoittimien soiton opintoaineistoksi tarkoitettu musiikki
type: Concept
type: YKL-luokka
broader: Muut jousisoittimet
in scheme: YKL - Yleisten kirjastojen luokitusjärjestelmä
notation: 78.791
preferred label: Music intended as study material for playing other string instruments @en
preferred label: Musik avsedd som studiematerial i spel på övriga stråkinstrument @sv

Muut jousisoittimet ilman säestystä
type: Concept
type: YKL-luokka
broader: Muut jousisoittimet
in scheme: YKL - Yleisten kirjastojen luokitusjärjestelmä
notation: 78.792
preferred label: Other string instruments unaccompanied @en
preferred label: Övriga stråkinstrument utan ackompanjemang @sv

Kaksi muuta (samaa) jousisoitinta tai useampia muita (samoja) jousisoittimia
type: Concept
type: YKL-luokka
broader: Muut jousisoittimet
in scheme: YKL - Yleisten kirjastojen luokitusjärjestelmä
notation: 78.793
preferred label: Två övriga likadana stråkinstrument eller flera övriga likadana stråkinstrument @sv
preferred label: Two or more other brass instruments (all similar) @en

Puhallinsoitinmusiikki. Lyömäsoitinmusiikki. Muilla soittimilla esitetty musiikki. Elektroakustinen musiikki. Musiikkikulttuurien sulautumat. Populaarimusiikki
type: Concept
References: Soitinrakennus
References: MUSIIKKI
References: URN:NBN:fi:au:ykl:78.03
References: Lyömäsoittimet. Muut soittimet
References: Musiikkikulttuurien sulautumat. Populaarimusiikki
References: URN:NBN:fi:au:ykl:78.8907
type: YKL-luokka
alternative label: Balettimusiikki, soitinmusiikki (78.6 ... 78.8+)
alternative label: Balettmusik, instrumentalmusik (78.6 ... 78.8+) @sv
alternative label: Bleckblåsinstrument (78.8+) @sv
alternative label: Blåsinstrument (78.8) @sv
alternative label: Etyder, övriga instrument (78.8+) @sv
alternative label: Etydit, muut soittimet (78.8+)
alternative label: Instrumentskolor (78.6 ... 78.879) @sv
alternative label: Lyricon (78.8)
alternative label: Musette, blåsinstrument (78.8) @sv
alternative label: Musette, puhallinsoitin (78.8)
alternative label: Puhallinsoittimet (78.8)
alternative label: Puupuhaltimet (78.8)
alternative label: Rauschpfeife (78.8)
alternative label: Soitonoppaat (78.6 ... 78.879)
alternative label: Syntetisaattori, puhallinsoittimiin yhdistettynä (78.8)
alternative label: Syntetisator, i anslutning till blåsinstrument (78.8) @sv
alternative label: Säckpipa, blåsinstrument (78.8) @sv
alternative label: Säkkipilli, puhallinsoittimet (78.8)
alternative label: Träblåsinstrument (78.8) @sv
alternative label: Vaskipuhaltimet (78.8+)
broader: MUSIIKKI
in scheme: YKL - Yleisten kirjastojen luokitusjärjestelmä
narrower: Huilu
narrower: Klarinetti
narrower: Oboe
narrower: Fagotti
narrower: Trumpetti
narrower: Muut vaskipuhaltimet
narrower: Lyömäsoittimet. Muut soittimet
narrower: Elektroakustinen musiikki
narrower: Musiikkikulttuurien sulautumat. Populaarimusiikki
notation: 78.8
preferred label: Music for wind instruments. Music for percussion instruments. Music performed with other instruments. Electroacoustic music. Fusions of music cultures. Popular music @en
preferred label: Musik för blåsinstrument. Musik för slaginstrument. Musik för övriga instrument. Elektroakustisk musik. Sammansmältningar av musikkulturer. Populärmusik @sv
scope note: Hit allmänna verk och samlingar som behandlar blåsinstrument Hit även icke-bleckinstrument såsom säckpipa som inte ryms i undergrupperna I varje instrumentklass har bara några viktigaste instrument nämnts, klassificering av de andra framgår av indexen Hit och till andra instrumentgrupper 78.6107-78.87907 endast sådana instrumentskolor som följer den västerländska konstmusikens tradition eller vars stilart är antingen allmän eller odifferentierad Om publikationen innehåller både material som hör till instrumentklasserna och material som hör till instrumentbygge, ges företräde åt instrumentklassen @sv
scope note: Tähän puhallinsoittimia käsittelevät yleisteokset ja kokoelmat Tähän myös alajaotteluun mahtumattomat ei-vaskipuhaltimet, kuten säkkipilli Kussakin soitinluokassa on mainittu vain tärkeimpiä soitinryhmän jäseniä, muiden luokitus selviää hakemistosta Tähän ja muihin soitinluokkiin 78.6107-78.87907 vain länsimaisen taidemusiikin perinteen mukaiset ja tyylilajiltaan yleiset tai eriytymättömät soitonoppaat Jos julkaisussa on sekä soitinluokkien että soitinrakennuksen luokan aineksia, annetaan etusija soitinluokalle Tähän myös ainakin kahta otsikossa mainittua musiikin lajia yhtä aikaa käsittelevät yleisteokset ja kokoelmat

Huilu
type: Concept
type: YKL-luokka
alternative label: Blockflöjt (78.81+) @sv
alternative label: Blockflöte (78.81+)
alternative label: Flageolett, instrument (78.81+) @sv
alternative label: Flageoletti, soitin (78.81+)
alternative label: Flautino (78.81+)
alternative label: Flauto (78.81+)
alternative label: Flute (78.81+)
alternative label: Flöjt (78.81+) @sv
alternative label: Huilu (78.81+)
alternative label: Nokkahuilu (78.81+)
alternative label: Okariina (78.81+)
alternative label: Okarina (78.81+) @sv
alternative label: Panflöjt (78.81+) @sv
alternative label: Panhuilu (78.81+)
alternative label: Piccolo (78.81+)
alternative label: Piccoloblockflöjt (78.81+) @sv
alternative label: Piccolonokkahuilu (78.81+)
alternative label: Poikkihuilu (78.81+)
alternative label: Querflöte (78.81+)
alternative label: Tvärflöjt (78.81+) @sv
broader: Puhallinsoitinmusiikki. Lyömäsoitinmusiikki. Muilla soittimilla esitetty musiikki. Elektroakustinen musiikki. Musiikkikulttuurien sulautumat. Populaarimusiikki
in scheme: YKL - Yleisten kirjastojen luokitusjärjestelmä
narrower: Huilunsoiton opintoaineistoksi tarkoitettu musiikki
narrower: Huilu ilman säestystä
narrower: Kaksi tai useampia huiluja
notation: 78.81
preferred label: Flute @en
preferred label: Flöjt @sv
scope note: Flöjt till ackompanjemang av piano eller något annat ackordinstrument Hit bl.a. blockflöjt, piccolo och panflöjt Flöjtskolor 78.8107 @sv
scope note: Huilu pianon tai muun sointusoittimen säestyksellä Tähän mm. nokkahuilu, piccolo ja panhuilu Huilunsoitonoppaat 78.8107

Huilunsoiton opintoaineistoksi tarkoitettu musiikki
type: Concept
type: YKL-luokka
broader: Huilu
in scheme: YKL - Yleisten kirjastojen luokitusjärjestelmä
notation: 78.811
preferred label: Music intended as study material for flute playing @en
preferred label: Musik avsedd som studiematerial i flöjtspel @sv

Huilu ilman säestystä
type: Concept
type: YKL-luokka
broader: Huilu
in scheme: YKL - Yleisten kirjastojen luokitusjärjestelmä
notation: 78.812
preferred label: Flute unaccompanied @en
preferred label: Flöjt utan ackompanjemang @sv

Kaksi tai useampia huiluja
type: Concept
type: YKL-luokka
broader: Huilu
in scheme: YKL - Yleisten kirjastojen luokitusjärjestelmä
notation: 78.813
preferred label: Två eller flera flöjter @sv
preferred label: Two or more flutes @en

Klarinetti
type: Concept
References: Musiikkikulttuurien sulautumat. Populaarimusiikki
type: YKL-luokka
alternative label: Basettiklarinetti (78.82)
alternative label: Basettitorvi (78.82+)
alternative label: Bassetthorn (78.82+) @sv
alternative label: Bassettklarinett (78.82) @sv
alternative label: Chalumeau (78.82+)
alternative label: Klarinett (78.82+) @sv
alternative label: Klarinetti (78.82+)
alternative label: Saksofoni (78.82+)
alternative label: Saxofon (78.82+) @sv
broader: Puhallinsoitinmusiikki. Lyömäsoitinmusiikki. Muilla soittimilla esitetty musiikki. Elektroakustinen musiikki. Musiikkikulttuurien sulautumat. Populaarimusiikki
in scheme: YKL - Yleisten kirjastojen luokitusjärjestelmä
narrower: Klarinetinsoiton opintoaineistoksi tarkoitettu musiikki
narrower: Klarinetti ilman säestystä
narrower: Kaksi tai useampia klarinetteja
notation: 78.82
preferred label: Clarinet @en
preferred label: Klarinett @sv
scope note: Klarinett till ackompanjemang av piano eller något annat ackordinstrument Hit även bl.a. alla saxofoner @sv
scope note: Klarinetti pianon tai muun soolosoittimen säestyksellä Tähän myös mm. kaikki saksofonit

Klarinetinsoiton opintoaineistoksi tarkoitettu musiikki
type: Concept
type: YKL-luokka
broader: Klarinetti
in scheme: YKL - Yleisten kirjastojen luokitusjärjestelmä
notation: 78.821
preferred label: Music intended as study material for clarinet playing @en
preferred label: Musik avsedd som studiematerial i klarinettspel @sv

Klarinetti ilman säestystä
type: Concept
type: YKL-luokka
broader: Klarinetti
in scheme: YKL - Yleisten kirjastojen luokitusjärjestelmä
notation: 78.822
preferred label: Clarinet unaccompanied @en
preferred label: Klarinett utan ackompanjemang @sv

Kaksi tai useampia klarinetteja
type: Concept
type: YKL-luokka
broader: Klarinetti
in scheme: YKL - Yleisten kirjastojen luokitusjärjestelmä
notation: 78.823
preferred label: Två eller flera klarinetter @sv
preferred label: Two or more clarinets @en

Oboe
type: Concept
type: YKL-luokka
alternative label: Aulos (78.83+)
alternative label: Cromorne (78.83+)
alternative label: Engelskt horn (78.83+) @sv
alternative label: Englannintorvi (78.83+)
alternative label: Hautbois (78.83+)
alternative label: Krumhorn (78.83+) @sv
alternative label: Krummhorn (78.83+)
alternative label: Oboe (78.83+)
alternative label: Oboe d'amore (78.83+)
alternative label: Skalmeija (78.83+)
alternative label: Skalmeja (78.83+) @sv
broader: Puhallinsoitinmusiikki. Lyömäsoitinmusiikki. Muilla soittimilla esitetty musiikki. Elektroakustinen musiikki. Musiikkikulttuurien sulautumat. Populaarimusiikki
in scheme: YKL - Yleisten kirjastojen luokitusjärjestelmä
narrower: Oboensoiton opintoaineistoksi tarkoitettu musiikki
narrower: Oboe ilman säestystä
narrower: Kaksi tai useampia oboeita
notation: 78.83
scope note: Oboe pianon tai muun sointusoittimen säestyksellä Tähän myös mm. oboe d'amore, englannintorvi ja skalmeija
scope note: Oboe till ackompanjemang av piano eller något annat ackordinstrument Hit även oboe d'amore, engelskt horn och skalmeja @sv

Oboensoiton opintoaineistoksi tarkoitettu musiikki
type: Concept
type: YKL-luokka
broader: Oboe
in scheme: YKL - Yleisten kirjastojen luokitusjärjestelmä
notation: 78.831
preferred label: Music intended as study material for oboe playing @en
preferred label: Musik avsedd som studiematerial i oboespel @sv

Oboe ilman säestystä
type: Concept
type: YKL-luokka
broader: Oboe
in scheme: YKL - Yleisten kirjastojen luokitusjärjestelmä
notation: 78.832
preferred label: Oboe unaccompanied @en
preferred label: Oboe utan ackompanjemang @sv

Kaksi tai useampia oboeita
type: Concept
type: YKL-luokka
broader: Oboe
in scheme: YKL - Yleisten kirjastojen luokitusjärjestelmä
notation: 78.833
preferred label: Två eller flera oboer @sv
preferred label: Two or more oboes @en

Fagotti
type: Concept
type: YKL-luokka
alternative label: Bombard (78.84+)
alternative label: Dulcian (78.84+) @sv
alternative label: Dulzian (78.84+)
alternative label: Fagott (78.84+) @sv
alternative label: Fagotti (78.84+)
alternative label: Fagotto chorista (78.84+) @sv
alternative label: Kortholt (78.84+)
alternative label: Kuorofagotti (78.84+)
alternative label: Pommer (78.84+) @sv
alternative label: Pommeri (78.84+)
alternative label: Rackett (78.84+) @sv
alternative label: Ranketti (78.84+)
broader: Puhallinsoitinmusiikki. Lyömäsoitinmusiikki. Muilla soittimilla esitetty musiikki. Elektroakustinen musiikki. Musiikkikulttuurien sulautumat. Populaarimusiikki
in scheme: YKL - Yleisten kirjastojen luokitusjärjestelmä
narrower: Fagotinsoiton opintoaineistoksi tarkoitettu musiikki
narrower: Fagotti ilman säestystä
narrower: Kaksi tai useampia fagotteja
notation: 78.84
preferred label: Bassoon @en
preferred label: Fagott @sv
scope note: Fagott till ackompanjemang av piano eller något annat ackordinstrument Hit även bl.a. bombard och rackett @sv
scope note: Fagotti pianon tai muun sointusoittimen säestyksellä Tähän myös mm. pommeri ja ranketti

Fagotinsoiton opintoaineistoksi tarkoitettu musiikki
type: Concept
type: YKL-luokka
broader: Fagotti
in scheme: YKL - Yleisten kirjastojen luokitusjärjestelmä
notation: 78.841
preferred label: Music intended as study material for bassoon playing @en
preferred label: Musik avsedd som studiematerial i fagottspel @sv

Fagotti ilman säestystä
type: Concept
type: YKL-luokka
broader: Fagotti
in scheme: YKL - Yleisten kirjastojen luokitusjärjestelmä
notation: 78.842
preferred label: Bassoon unaccompanied @en
preferred label: Fagott utan ackompanjemang @sv

Kaksi tai useampia fagotteja
type: Concept
type: YKL-luokka
broader: Fagotti
in scheme: YKL - Yleisten kirjastojen luokitusjärjestelmä
notation: 78.843
preferred label: Två eller flera fagotter @sv
preferred label: Two or more bassoons @en

Trumpetti
type: Concept
References: Musiikkikulttuurien sulautumat. Populaarimusiikki
type: YKL-luokka
alternative label: Flygelhorn (78.85+) @sv
alternative label: Flyygelitorvi (78.85+)
alternative label: Kornett (78.85+) @sv
alternative label: Kornetti (78.85+)
alternative label: Serpent (78.85+) @sv
alternative label: Serpentti (78.85+)
alternative label: Sinka (78.85+) @sv
alternative label: Sinkki, soitin (78.85+)
alternative label: Trumpet (78.85+) @sv
alternative label: Trumpetti (78.85+)
broader: Puhallinsoitinmusiikki. Lyömäsoitinmusiikki. Muilla soittimilla esitetty musiikki. Elektroakustinen musiikki. Musiikkikulttuurien sulautumat. Populaarimusiikki
in scheme: YKL - Yleisten kirjastojen luokitusjärjestelmä
narrower: Trumpetinsoiton opintoaineistoksi tarkoitettu musiikki
narrower: Trumpetti ilman säestystä
narrower: Kaksi tai useampia trumpetteja
notation: 78.85
preferred label: Trumpet @en
scope note: Trumpet till ackompanjemang av piano eller något annat ackordinstrument Hit även bl.a. kornett eller flygelhorn @sv
scope note: Trumpetti pianon tai muun sointusoittimen säestyksellä Tähän myös mm. kornetti ja flyygelitorvi

Trumpetinsoiton opintoaineistoksi tarkoitettu musiikki
type: Concept
type: YKL-luokka
broader: Trumpetti
in scheme: YKL - Yleisten kirjastojen luokitusjärjestelmä
notation: 78.851
preferred label: Music intended as study material for trumpet playing @en
preferred label: Musik avsedd som studiematerial i trumpetspel @sv

Trumpetti ilman säestystä
type: Concept
type: YKL-luokka
broader: Trumpetti
in scheme: YKL - Yleisten kirjastojen luokitusjärjestelmä
notation: 78.852
preferred label: Trumpet unaccompanied @en
preferred label: Trumpet utan ackompanjemang @sv

Kaksi tai useampia trumpetteja
type: Concept
type: YKL-luokka
broader: Trumpetti
in scheme: YKL - Yleisten kirjastojen luokitusjärjestelmä
notation: 78.853
preferred label: Två eller flera trumpeter @sv
preferred label: Two or more trumpets @en

Muut vaskipuhaltimet
type: Concept
type: YKL-luokka
alternative label: Alphorn (78.86+) @sv
alternative label: Alppitorvi (78.86+)
alternative label: Baritone (78.86+)
alternative label: Basun (78.86+) @sv
alternative label: Cornamusa (78.86+)
alternative label: Eufonium (78.86+)
alternative label: French horn (78.86+)
alternative label: Helikon, blåsinstrument (78.86+) @sv
alternative label: Helikon, puhallinsoitin (78.86+)
alternative label: Käyrätorvi (78.86+)
alternative label: Luonnontorvi (78.86+)
alternative label: Lur (78.86+) @sv
alternative label: Luuri (78.86+)
alternative label: Mellofon (78.86+) @sv
alternative label: Mellofoni (78.86+)
alternative label: Naturhorn (78.86+) @sv
alternative label: Pasuuna (78.86+)
alternative label: Posthorn (78.86+) @sv
alternative label: Postitorvi (78.86+)
alternative label: Sackbut (78.86+)
alternative label: Signaalitorvi (78.86+)
alternative label: Signalhorn (78.86+) @sv
alternative label: Sousafon (78.86+) @sv
alternative label: Sousafoni (78.86+)
alternative label: Tuba (78.86+) @sv
alternative label: Tuuba (78.86+)
alternative label: Valthorn (78.86+) @sv
broader: Puhallinsoitinmusiikki. Lyömäsoitinmusiikki. Muilla soittimilla esitetty musiikki. Elektroakustinen musiikki. Musiikkikulttuurien sulautumat. Populaarimusiikki
in scheme: YKL - Yleisten kirjastojen luokitusjärjestelmä
narrower: Muiden vaskipuhaltimien soiton opintoaineistoksi tarkoitettu musiikki
narrower: Muut vaskipuhaltimet ilman säestystä
narrower: Kaksi muuta (samaa) vaskipuhallinta tai useampia muita (samoja) vaskipuhaltimet
notation: 78.86
preferred label: Other brass instruments @en
preferred label: Övriga bleckinstrument @sv
scope note: Muu vaskipuhallin pianon tai muun sointusoittimen säestyksellä. Tähän mm. käyrätorvi, pasuuna, tuuba ja luonnontorvet
scope note: Övrigt bleckinstrument till ackompanjemang av piano eller något annat ackordinstrument. Hit bl.a. valthorn, basun, tuba och naturhorn @sv

Muiden vaskipuhaltimien soiton opintoaineistoksi tarkoitettu musiikki
type: Concept
type: YKL-luokka
broader: Muut vaskipuhaltimet
in scheme: YKL - Yleisten kirjastojen luokitusjärjestelmä
notation: 78.861
preferred label: Music intended as study material for playing other brass instruments @en
preferred label: Musik avsedd som studiematerial i spel på övriga bleckinstrument @sv

Muut vaskipuhaltimet ilman säestystä
type: Concept
type: YKL-luokka
broader: Muut vaskipuhaltimet
in scheme: YKL - Yleisten kirjastojen luokitusjärjestelmä
notation: 78.862
preferred label: Other brass instruments unaccompanied @en
preferred label: Övriga bleckinstrument utan ackompanjemang @sv

Kaksi muuta (samaa) vaskipuhallinta tai useampia muita (samoja) vaskipuhaltimet
type: Concept
type: YKL-luokka
broader: Muut vaskipuhaltimet
in scheme: YKL - Yleisten kirjastojen luokitusjärjestelmä
notation: 78.863
preferred label: Två övriga likadana bleckinstrument eller flera övriga likadana bleckinstrument @sv
preferred label: Two or more other brass instruments (all similar) @en

Lyömäsoittimet. Muut soittimet
type: Concept
References: Soitinrakennus
References: MUSIIKKI
References: URN:NBN:fi:au:ykl:78.03
References: URN:NBN:fi:au:ykl:78.8907
type: YKL-luokka
alternative label: Lyömäsoittimet (78.87)
alternative label: Percussion (78.87)
alternative label: Perkussion (78.87) @sv
alternative label: Slaginstrument (78.87) @sv
broader: Puhallinsoitinmusiikki. Lyömäsoitinmusiikki. Muilla soittimilla esitetty musiikki. Elektroakustinen musiikki. Musiikkikulttuurien sulautumat. Populaarimusiikki
in scheme: YKL - Yleisten kirjastojen luokitusjärjestelmä
narrower: Rummut. Symbaalit
narrower: Marimba. Patarummut
narrower: Huuliharppu. Melodica
narrower: Syntetisaattorit
narrower: Automaattisoittimet. Posetiivit. Soittorasiat
narrower: Muut soittimet
notation: 78.87
preferred label: Percussion instruments. Other instruments @en
preferred label: Slaginstrument. Övriga instrument @sv
scope note: Allmänna verk och samlingar med blandat innehåll I varje instrumentklass har bara några viktigaste instrument nämnts, klassificering av de andra framgår av indexen Hit och till andra instrumentgrupper 78.6107-78.87907 endast sådana instrumentskolor som följer den västerländska konstmusikens tradition eller vars stilart är antingen allmän eller odifferentierad Om publikationen innehåller både material som hör till instrumentklasserna och material som hör till instrumentbygge, ges företräde åt instrumentklassen @sv
scope note: Yleisteokset ja sekasisältöiset kokoelmat Kussakin soitinluokassa on mainittu vain tärkeimpiä soitinryhmän jäseniä, muiden luokitus selviää hakemistosta Tähän ja muihin soitinluokkiin 78.6107-78.87907 vain länsimaisen taidemusiikin perinteen mukaiset ja tyylilajiltaan yleiset tai eriytymättömät soitonoppaat Jos julkaisussa on sekä soitinluokkien että soitinrakennuksen luokan aineksia, annetaan etusija soitinluokalle

Rummut. Symbaalit
type: Concept
type: YKL-luokka
alternative label: Bongorummut (78.871)
alternative label: Bongotrummor (78.871) @sv
alternative label: Bäcken (78.871) @sv
alternative label: Claves (78.871)
alternative label: Congarummut (78.871)
alternative label: Congatrummor (78.871) @sv
alternative label: Crotales (78.871)
alternative label: Cymbaler (78.871) @sv
alternative label: Gong (78.871) @sv
alternative label: Gongi (78.871)
alternative label: Guiro (78.871)
alternative label: Harskramla (78.871) @sv
alternative label: High-hat ja lautaset (78.871)
alternative label: High-hat och bäcken (78.871) @sv
alternative label: Kastanjetit (78.871)
alternative label: Kastanjetter (78.871) @sv
alternative label: Kellot, soittimena (78.871 ... 78.872)
alternative label: Klockor, som instrument (78.871 ... 78.872) @sv
alternative label: Koskälla, som instrument (78.871) @sv
alternative label: Lautaset (78.871)
alternative label: Lehmänkello, soittimena (78.871)
alternative label: Maracas (78.871)
alternative label: Rummut (78.871)
alternative label: Räikkä (78.871)
alternative label: Symbaalit (78.871)
alternative label: Tamburiini (78.871)
alternative label: Tamburin (78.871) @sv
alternative label: Tamtam (78.871)
alternative label: Timbales (78.871)
alternative label: Tom-tom (78.871)
alternative label: Triangel (78.871) @sv
alternative label: Triangeli (78.871)
alternative label: Trummor (78.871) @sv
broader: Lyömäsoittimet. Muut soittimet
in scheme: YKL - Yleisten kirjastojen luokitusjärjestelmä
notation: 78.871
preferred label: Drums. Cymbals @en
preferred label: Trummor. Cymbaler @sv
scope note: Hit även övriga slaginstrument med vilka man inte kan producera toner på en bestämd höjd @sv
scope note: Tähän myös muut hälylyömäsoittimet

Marimba. Patarummut
type: Concept
type: YKL-luokka
alternative label: Carillon (78.872)
alternative label: Celesta, lyömäsoittimena (78.872)
alternative label: Celesta, som slaginstrument (78.872) @sv
alternative label: Cimbalom (78.872)
alternative label: Dulcimer, lyömäsoittimena (78.872)
alternative label: Dulcimer, som slaginstrument (78.872) @sv
alternative label: Glockenspiel (78.872)
alternative label: Kellopeli (78.872)
alternative label: Kellot, soittimena (78.871 ... 78.872)
alternative label: Kettle drums (78.872)
alternative label: Klockor, som instrument (78.871 ... 78.872) @sv
alternative label: Klockspel (78.872) @sv
alternative label: Ksylofoni (78.872)
alternative label: Marimba (78.872)
alternative label: Patarummut (78.872)
alternative label: Pukor (78.872) @sv
alternative label: Steel-rummut (78.872)
alternative label: Steel-trummor (78.872) @sv
alternative label: Timpani (78.872)
alternative label: Vibrafon (78.872) @sv
alternative label: Vibrafoni (78.872)
alternative label: Xylofon (78.872) @sv
broader: Lyömäsoittimet. Muut soittimet
in scheme: YKL - Yleisten kirjastojen luokitusjärjestelmä
notation: 78.872
preferred label: Marimba. Kettledrums @en
preferred label: Marimba. Pukor @sv
scope note: Hit även övriga slaginstrument med vilka man kan producera toner på en bestämd höjd @sv
scope note: Tähän myös muut lyömäsoittimet, joilla voidaan tuottaa määräkorkuisia säveliä

Huuliharppu. Melodica
type: Concept
type: YKL-luokka
alternative label: Huuliharppu (78.873)
alternative label: Melodika (78.873)
alternative label: Munspel (78.873) @sv
broader: Lyömäsoittimet. Muut soittimet
in scheme: YKL - Yleisten kirjastojen luokitusjärjestelmä
notation: 78.873
preferred label: Harmonica. Melodica @en
preferred label: Munspel. Melodika @sv

Syntetisaattorit
type: Concept
References: Äänitekniikka. Radiotekniikka
References: Muut kosketinsoittimet
References: Muut näppäilysoittimet
References: Puhallinsoitinmusiikki. Lyömäsoitinmusiikki. Muilla soittimilla esitetty musiikki. Elektroakustinen musiikki. Musiikkikulttuurien sulautumat. Populaarimusiikki
References: Elektroakustinen musiikki
References: Musiikkikulttuurien sulautumat. Populaarimusiikki
type: YKL-luokka
alternative label: MIDI, musiikki (78.874)
alternative label: MIDI, musik (78.874) @sv
alternative label: Sampling, musiikki (78.874)
alternative label: Sampling, musik (78.874) @sv
alternative label: Syntetisaattori, äänentuottajana sinänsä (78.874)
alternative label: Syntetisator, som ljudproducent i sig själv (78.874) @sv
broader: Lyömäsoittimet. Muut soittimet
in scheme: YKL - Yleisten kirjastojen luokitusjärjestelmä
notation: 78.874
preferred label: Synthesizers @en
scope note: Hit synthesizers som elektroniska producerare av musikalisk ton. Synthesizers som sammankopplats till vanliga instrument klassificeras till ifrågavarande instrumentgrupp Hit även material som utnyttjar MIDI- och samplingsteknik när dessa används för musikproduktion @sv
scope note: Tähän syntetisaattorit elektronisina musiikillisen äänen tuottajina, mutta tavanomaisiin soittimiin yhdistettyinä luokitetaan ko. soitinryhmään Tähän myös MIDI- ja sampling -tekniikkaa käsittelevä aineisto silloin, kun kysymys on niiden käytöstä musiikin tuottamiseen

Automaattisoittimet. Posetiivit. Soittorasiat
type: Concept
type: YKL-luokka
alternative label: Automaattisoittimet (78.875)
alternative label: Automaattiurut (78.875)
alternative label: Automatisk orgel (78.875) @sv
alternative label: Automatiska instrument (78.875) @sv
alternative label: Mekaaniset urut (78.875)
alternative label: Mekanisk orgel (78.875) @sv
alternative label: Pianola (78.875)
alternative label: Posetiivit (78.875)
alternative label: Positiv (78.875) @sv
alternative label: Soittorasiat (78.875)
alternative label: Speldosor (78.875) @sv
broader: Lyömäsoittimet. Muut soittimet
in scheme: YKL - Yleisten kirjastojen luokitusjärjestelmä
notation: 78.875
preferred label: Automatic instruments. Barrel organs. Music boxes @en
preferred label: Automatiska instrument. Positiv. Speldosor @sv
scope note: Hit alla automatiska instrument oavsett tonbildningssätt @sv
scope note: Tähän kaikki automaattisoittimet niiden äänenmuodostamistavasta riippumatta

Muut soittimet
type: Concept
type: YKL-luokka
alternative label: Bull-roarer (78.879) @sv
alternative label: Glasharmonika (78.879)
alternative label: Hurdy-gurdy (78.879)
alternative label: Kampiliira (78.879)
alternative label: Kampiviulu (78.879)
alternative label: Lasiharmonikka (78.879)
alternative label: Lira vielle (78.879) @sv
alternative label: Mungiga (78.879) @sv
alternative label: Munniharppu (78.879)
alternative label: Ondes martenot (78.879)
alternative label: Saha, soittimena (78.879)
alternative label: Suhistuspuu (78.879)
alternative label: Såg, som instrument (78.879) @sv
alternative label: Theremin (78.879)
alternative label: Trautonium, muut soittimet (78.879)
alternative label: Trautonium, övriga instrument (78.879) @sv
alternative label: Vevlira (78.879) @sv
broader: Lyömäsoittimet. Muut soittimet
in scheme: YKL - Yleisten kirjastojen luokitusjärjestelmä
notation: 78.879
preferred label: Other instruments @en
preferred label: Övriga instrument @sv
scope note: Hit instrument som inte kan placeras annanstans med hjälp av tabellerna och/eller indexen Dessutom används ämnesord @sv
scope note: Tähän ne soittimet, joita ei taulukoiden ja/tai hakemiston avulla voi muualle sijoittaa Lisäksi käytetään asiasanaa

Elektroakustinen musiikki
type: Concept
References: Musiikkikulttuurien sulautumat. Populaarimusiikki
type: YKL-luokka
alternative label: Elektroakustinen musiikki, taidemusiikki (78.88)
alternative label: Elektroakustisk musik, konstmusik (78.88) @sv
alternative label: Elektronimusiikki (78.88)
alternative label: Elektroninen musiikki (78.88)
alternative label: Elektronisk musik (78.88) @sv
alternative label: Elektronmusik (78.88) @sv
alternative label: Eloelektroninen musiikki (78.88)
alternative label: Konkreettinen musiikki (78.88)
alternative label: Konkret musik (78.88) @sv
alternative label: Levande elektronisk musik (78.88) @sv
alternative label: Live electronics (78.88)
alternative label: Musique concrète (78.88)
broader: Puhallinsoitinmusiikki. Lyömäsoitinmusiikki. Muilla soittimilla esitetty musiikki. Elektroakustinen musiikki. Musiikkikulttuurien sulautumat. Populaarimusiikki
in scheme: YKL - Yleisten kirjastojen luokitusjärjestelmä
notation: 78.88
preferred label: Electroacoustic music @en
preferred label: Elektroakustisk musik @sv
scope note: Hit all västerländsk konstmusik som åstadkommits med elektroakustiska medel @sv
scope note: Tähän kaikki elektroakustisin keinoin toteutettu länsimainen taidemusiikki

Musiikkikulttuurien sulautumat. Populaarimusiikki
type: Concept
type: YKL-luokka
alternative label: Afroamerikansk populärmusik (78.89+) @sv
alternative label: Afroamerikkalainen populaarimusiikki (78.89+)
alternative label: Basgitarr, populärmusik (78.89+) @sv
alternative label: Bassokitara, populaarimusiikki (78.89+)
alternative label: Disco (78.89+)
alternative label: Diskon, musikkultur (78.89+) @sv
alternative label: Diskot, musiikkikulttuuri (78.89+)
alternative label: Elbas, populärmusik (78.89+) @sv
alternative label: Elektroakustinen musiikki, populaarimusiikki (78.89+)
alternative label: Elektroakustisk musik, populärmusik (78.89+) @sv
alternative label: Elgitarr, populärmusik (78.89+) @sv
alternative label: Havaijinkitara, populaarimusiikki (78.89+)
alternative label: Hawaiigitarr, populärmusik (78.89+) @sv
alternative label: Improvisation, populärmusik (78.89+) @sv
alternative label: Improvisointi, populaarimusiikki (78.89+)
alternative label: Laulukokoelmat, populaarimusiikki (78.89+)
alternative label: Laululyriikka, nuottijulkaisut, populaarimusiikki (78.89+)
alternative label: Laulumusiikki, populaarimusiikki (78.89)
alternative label: Musiikkiklubit, musiikkikulttuuri (78.89+)
alternative label: Musiikkikulttuurien sulautumat (78.89+)
alternative label: Musikklubbar, musikkultur (78.99+) @sv
alternative label: Nattklubbar, musikkultur (78.99+) @sv
alternative label: Pedaalikitara, populaarimusiikki (78.89+)
alternative label: Pedalgitarr, populärmusik (78.89+) @sv
alternative label: Perinnemusiikki, populaarimusiikki (78.89+)
alternative label: Poliittiset laulut, populaarimusiikki (78.89+)
alternative label: Politiska sånger, populärmusik (78.89+) @sv
alternative label: Populaarimusiikki (78.89)
alternative label: Populaarimusiikki, afroamerikkalainen (78.89+)
alternative label: Populärmusik (78.89) @sv
alternative label: Populärmusik, afroamerikansk (78.89+) @sv
alternative label: Sammansmältningar av musikkulturer (78.89+) @sv
alternative label: Slide guitar, populaarimusiikki (78.89+)
alternative label: Slide guitar, populärmusik (78.89+) @sv
alternative label: Steel guitar, populaarimusiikki (78.89+)
alternative label: Steel guitar, populärmusik (78.89+) @sv
alternative label: Sähköbasso, populaarimusiikki (78.89+)
alternative label: Sähkökitara, populaarimusiikki (78.89+)
alternative label: Sånglyrik, notpublikationer, populärmusik (78.89+) @sv
alternative label: Sångsamlingar, populärmusik (78.89+) @sv
alternative label: Traditionell musik, populärmusik (78.89+) @sv
alternative label: Vokalmusik, populärmusik (78.89) @sv
alternative label: World music, populaarimusiikki (78.89+)
alternative label: World music, populärmusik (78.89+) @sv
alternative label: Yökerhot, musiikkikulttuuri (78.89+)
broader: Puhallinsoitinmusiikki. Lyömäsoitinmusiikki. Muilla soittimilla esitetty musiikki. Elektroakustinen musiikki. Musiikkikulttuurien sulautumat. Populaarimusiikki
in scheme: YKL - Yleisten kirjastojen luokitusjärjestelmä
narrower: Popmusiikki
narrower: Blues. Jazz
narrower: Viihdemusiikki
narrower: Laulelmamusiikki
narrower: Hengellinen populaarimusiikki
narrower: Maailmanmusiikki
narrower: New age -musiikki. Meditaatiomusiikki
notation: 78.89
preferred label: Fusions of music cultures. Popular music @en
preferred label: Sammansmältningar av musikkulturer. Populärmusik @sv
scope note: Allmänna verk och samlingar med blandat innehåll Hit även sådana fenomen inom populärmusiken som inte kan föras till en exaktare undergrupp (t.ex. publikationer som hör samtidigt till två olika undergrupper) Hit också nya, tillsvidare opreciserade fenomen Instrumentskolor för populärmusiken 78.8907 eller exaktare efter musikform @sv
scope note: Yleisteokset ja sekasisältöiset kokoelmat Tähän myös kaikki sellaiset populaarimusiikki-ilmiöt, joita ei voida sijoittaa täsmällisempään alaluokkaan (esim. kahteen tai useampaan alaluokkaan yhtä aikaa sijoittuvat julkaisut) Tähän myös uudet, vielä täsmentymättömät ilmiöt Populaarimusiikin soitonoppaat 78.8907 tai tarkemmin musiikin lajin mukaan

Popmusiikki
type: Concept
type: YKL-luokka
alternative label: Bubble gum musik (78.891) @sv
alternative label: Bubble gum-musiikki (78.891)
alternative label: Diskopop (78.891)
alternative label: House (78.891+)
alternative label: Popmusiikki (78.891+)
alternative label: Popmusik (78.891+) @sv
alternative label: Teinipop (78.891)
alternative label: Tonårspop (78.891) @sv
broader: Musiikkikulttuurien sulautumat. Populaarimusiikki
in scheme: YKL - Yleisten kirjastojen luokitusjärjestelmä
narrower: Rock
narrower: Folkmusiikki. Hootenanny. Folk rock
narrower: Country
narrower: Soul. Funk. Hip hop. Rap
narrower: Reggae. Ska
narrower: Elektroninen popmusiikki. Electronica. Ambient
narrower: Etninen popmusiikki
notation: 78.891
preferred label: Pop music @en
preferred label: Popmusik @sv
scope note: Allmänna verk och popmusiksamlingar med blandat innehåll Hit även all sådan popmusik som inte kan placeras till exaktare undergrupper (t.ex. s.k. bubble gum, diskopop, tonårspop o.s.v.) @sv
scope note: Yleisteokset ja sekasisältöiset popmusiikin kokoelmat Tähän myös kaikki sellainen popmusiikki, jota ei voida sijoittaa tarkempiin alaluokkiin (esim. ns. bubble gum, discopop, teinipop jne.)

Rock
type: Concept
References: Folkmusiikki. Hootenanny. Folk rock
References: Country
References: Etninen popmusiikki
References: Hengellinen populaarimusiikki
type: YKL-luokka
alternative label: AOR (78.8911)
alternative label: Acid house (78.8911)
alternative label: Acid rock (78.8911)
alternative label: Afro-rock (78.8911)
alternative label: Afrorock (78.8911) @sv
alternative label: Art rock (78.8911)
alternative label: Beatmusiikki (78.8911)
alternative label: Beatmusik (78.8911) @sv
alternative label: Konstrock (78.8911) @sv
alternative label: Latin rock (78.8911)
alternative label: New wave (78.8911)
alternative label: Nya vågen (78.8911) @sv
alternative label: Psykedeelinen rock (78.8911)
alternative label: Psykedelisk rock (78.8911) @sv
alternative label: Rock (78.8911+)
alternative label: Rocklyriikka, nuottijulkaisut (78.8911+)
alternative label: Rocklyrik, notpublikationer (78.8911+) @sv
alternative label: Surfmusiikki (78.8911)
alternative label: Surfmusik (78.8911) @sv
alternative label: Taiderock (78.8911)
alternative label: Teknorock (78.8911)
alternative label: Underground rock (78.8911)
alternative label: Uusi aalto (78.8911)
broader: Popmusiikki
in scheme: YKL - Yleisten kirjastojen luokitusjärjestelmä
narrower: Rock and roll. Rockabilly
narrower: Hard rock. Heavy metal
narrower: Progressiivinen rock. Proge
narrower: Punk rock. Hardcore punk
notation: 78.8911
scope note: Hit all sådan rockmusik som inte går att placera till exaktare undergrupper I osäkra fall används klassen för popmusik @sv
scope note: Tähän kaikki sellainen rockmusiikki, joka ei sijoitu tarkempiin alaluokkiin Epävarmoissa tapauksissa käytetään popmusiikin luokkaa

Rock and roll. Rockabilly
type: Concept
type: YKL-luokka
alternative label: Rock and roll (78.89111)
alternative label: Rockabilly (78.89111)
broader: Rock
in scheme: YKL - Yleisten kirjastojen luokitusjärjestelmä
notation: 78.89111

Hard rock. Heavy metal
type: Concept
type: YKL-luokka
alternative label: Hard rock (78.89112)
alternative label: Heavy metal (78.89112)
alternative label: Heavy rock (78.89112)
alternative label: Speed metal (78.89112)
broader: Rock
in scheme: YKL - Yleisten kirjastojen luokitusjärjestelmä
notation: 78.89112

Progressiivinen rock. Proge
type: Concept
type: YKL-luokka
alternative label: Proge (78.89113)
alternative label: Progressiivinen rock (78.89113)
alternative label: Progressiv rock (78.89113) @sv
broader: Rock
in scheme: YKL - Yleisten kirjastojen luokitusjärjestelmä
notation: 78.89113
preferred label: Progressiv rock @sv
preferred label: Progressive rock @en

Punk rock. Hardcore punk
type: Concept
type: YKL-luokka
alternative label: Hardcore punk (78.89114)
alternative label: Punk rock (78.89114)
broader: Rock
in scheme: YKL - Yleisten kirjastojen luokitusjärjestelmä
notation: 78.89114

Folkmusiikki. Hootenanny. Folk rock
type: Concept
References: Etninen popmusiikki
type: YKL-luokka
alternative label: Folk, amerikkalainen (78.8912)
alternative label: Folk, nordamerikansk populärmusik (78.8912) @sv
alternative label: Folk-rock (78.8912)
alternative label: Folkmusiikki, pohjoisamerikkalainen (78.8912)
alternative label: Folkrock (78.8912) @sv
alternative label: Hootenanny (78.8912)
broader: Popmusiikki
in scheme: YKL - Yleisten kirjastojen luokitusjärjestelmä
notation: 78.8912
preferred label: Folk music. Hootenanny. Folk rock @en
preferred label: Folk. Hootenanny. Folkrock @sv
scope note: Hit musiken av den nordamerikanska folk- och hootenannysångrörelsen på 1950-60-talen och stilmässigt närstående fenomen (t.ex. s.k. sångare-låtskrivares musik) @sv
scope note: Tähän 1950-60 -lukujen pohjoisamerikkalaisen folk- ja hootenannylaululiikkeen musiikki sekä sitä tyylillisesti lähellä olevat ilmiöt (esim. ns. laulaja-lauluntekijöiden musiikki)

Country
type: Concept
type: YKL-luokka
alternative label: Bluegrass (78.8913)
alternative label: Cajun (78.8913)
alternative label: Country (78.8913)
alternative label: Country and western (78.8913)
alternative label: Country-rock (78.8913)
alternative label: Countryrock (78.8913) @sv
alternative label: Hillbilly (78.8913)
alternative label: Kantri (78.8913)
alternative label: Ranchera-musiikki (78.8913)
alternative label: Ranchera-musik (78.8913) @sv
alternative label: Western swing (78.8913)
broader: Popmusiikki
in scheme: YKL - Yleisten kirjastojen luokitusjärjestelmä
notation: 78.8913
scope note: Hit närmast olika fenomen inom den nordamerikanska landsbygdsmusiken såsom bl.a. bluegrass, cajun, country and western, country rock, hillbilly, ranchera-musiken och western swing @sv
scope note: Tähän lähinnä pohjoisamerikkalaisen maaseutumusiikin eri ilmiöt, kuten mm. bluegrass, cajun, country and western, country rock, hillbilly, ranchera-musiikki ja western swing

Soul. Funk. Hip hop. Rap
type: Concept
References: Reggae. Ska
type: YKL-luokka
broader: Popmusiikki
in scheme: YKL - Yleisten kirjastojen luokitusjärjestelmä
narrower: Soul. Funk
narrower: Hip hop. Rap
notation: 78.8914
scope note: Allmänna verk och samlingar Hit och till underklasserna de fenomen inom den afroamerikanska s.k. "svarta musiken" som inte anses höra till blues, jazz eller gospel @sv
scope note: Yleisteokset ja kokoelmat Tähän ja alaluokiin afroamerikkalaisen ns. "mustan musiikin" ne ilmiöt, joita ei pidetä bluesin, jazzin tai gospelin piiriin kuuluvina

Soul. Funk
type: Concept
type: YKL-luokka
alternative label: Funk (78.89141)
alternative label: Soul (78.89141)
broader: Soul. Funk. Hip hop. Rap
in scheme: YKL - Yleisten kirjastojen luokitusjärjestelmä
notation: 78.89141

Hip hop. Rap
type: Concept
type: YKL-luokka
alternative label: Hip hop (78.89142)
alternative label: Rap (78.89142)
broader: Soul. Funk. Hip hop. Rap
in scheme: YKL - Yleisten kirjastojen luokitusjärjestelmä
notation: 78.89142

Reggae. Ska
type: Concept
type: YKL-luokka
alternative label: Calypso, reggae, ska (78.8915)
alternative label: Reggae (78.8915)
alternative label: Ska (78.8915)
alternative label: Soca (78.8915)
broader: Popmusiikki
in scheme: YKL - Yleisten kirjastojen luokitusjärjestelmä
notation: 78.8915

Elektroninen popmusiikki. Electronica. Ambient
type: Concept
type: YKL-luokka
alternative label: Electronica (78.8916+)
alternative label: Elektroninen popmusiikki (78.8916+)
alternative label: Elektronisk popmusik (78.8916+) @sv
alternative label: Tekno (78.8916+)
broader: Popmusiikki
in scheme: YKL - Yleisten kirjastojen luokitusjärjestelmä
narrower: EDM (electronic dance music). Elektroninen tanssimusiikki
narrower: Ambient. Downtempo
notation: 78.8916
preferred label: Electronic pop music. Electronica. Ambient @en
preferred label: Elektronisk popmusik. Electronica. Ambient @sv

EDM (electronic dance music). Elektroninen tanssimusiikki
type: Concept
type: YKL-luokka
alternative label: Dance (78.89161)
alternative label: EDM (78.89161)
alternative label: Electronic dance music (78.89161)
alternative label: Elektroninen tanssimusiikki (78.89161)
alternative label: Elektronisk dansmusik (78.89161) @sv
broader: Elektroninen popmusiikki. Electronica. Ambient
in scheme: YKL - Yleisten kirjastojen luokitusjärjestelmä
notation: 78.89161
preferred label: EDM (electronic dance music) @en
preferred label: EDM (electronic dance music). Elektronisk dansmusik @sv

Ambient. Downtempo
type: Concept
type: YKL-luokka
alternative label: Ambient (78.89162)
alternative label: Downtempo (78.89162)
broader: Elektroninen popmusiikki. Electronica. Ambient
in scheme: YKL - Yleisten kirjastojen luokitusjärjestelmä
notation: 78.89162

Etninen popmusiikki
type: Concept
References: Folkmusiikki. Hootenanny. Folk rock
References: Country
References: Reggae. Ska
References: Etninen jazz
References: Maailmanmusiikki
type: YKL-luokka
alternative label: Etninen popmusiikki (78.8917)
alternative label: Etninen rock (78.8917)
alternative label: Etnisk popmusik (78.8917) @sv
alternative label: Etnisk rock (78.8917) @sv
alternative label: Folk, eurooppalainen (78.8917)
alternative label: Folk, europeisk populärmusik (78.8917) @sv
alternative label: Folkmusiikki, eurooppalainen (78.8917)
alternative label: Modern folkmusik, etnisk popmusik (78.8917) @sv
alternative label: Nykykansanmusiikki, etninen popmusiikki (78.8917)
broader: Popmusiikki
in scheme: YKL - Yleisten kirjastojen luokitusjärjestelmä
notation: 78.8917
preferred label: Ethnic pop music @en
preferred label: Etnisk popmusik @sv
scope note: Hit sådan på folkmusikaliskt material baserad popmusik för vilken det inte finns en exaktare klass, dvs. merparten av den icke-nordamerikanska folkrocken, s.k. celtic folk och en del av den nutida folkmusiken @sv
scope note: Tähän sellainen kansanmusiikkiainekseen pohjautuva popmusiikki, jolle ei ole täsmällisempää luokkaa eli valtaosa ei-pohjoisamerikkalaisesta folkmusiikista, ns. kelttiläinen folk ja osa nykykansanmusiikista

Blues. Jazz
type: Concept
type: YKL-luokka
broader: Musiikkikulttuurien sulautumat. Populaarimusiikki
in scheme: YKL - Yleisten kirjastojen luokitusjärjestelmä
narrower: Blues
narrower: Jazz
notation: 78.892
scope note: Allmänna verk och samlingar med blandat innehåll Hit medier som innehåller både blues och jazz, också sådana vilkas exaktare undergrupp är osäker @sv
scope note: Yleisteokset ja sekasisältöiset kokoelmat Tähän sekä bluesia että jazzia sisältävä aineisto, myös sellainen, jonka tarkemmasta alalajista ei ole varmuutta

Blues
type: Concept
type: YKL-luokka
alternative label: Blues (78.8921+)
broader: Blues. Jazz
in scheme: YKL - Yleisten kirjastojen luokitusjärjestelmä
narrower: Folk-blues. Country blues. Mississippi blues
narrower: Barrelhouse piano. Boogie woogie
narrower: City-blues. Chicago-blues
narrower: Rhythm and blues. Doo wop
narrower: Zydeco
notation: 78.8921
scope note: Allmänna verk och samlingar Hit även all blues som inte bestämts närmare @sv
scope note: Yleisteokset ja kokoelmat Tähän myös kaikki tarkemmin määrittelemätön blues

Folk-blues. Country blues. Mississippi blues
type: Concept
type: YKL-luokka
alternative label: Country-blues (78.89211)
alternative label: Folk-blues (78.89211)
alternative label: Folkblues (78.89211) @sv
alternative label: Missisippi-blues (78.89211)
broader: Blues
in scheme: YKL - Yleisten kirjastojen luokitusjärjestelmä
notation: 78.89211
preferred label: Folk blues. Country blues. Mississippi blues @en
preferred label: Folkblues. Country blues. Mississippi blues @sv

Barrelhouse piano. Boogie woogie
type: Concept
type: YKL-luokka
alternative label: Barrelhouse-piano (78.89212)
alternative label: Boogie woogie (78.89212)
broader: Blues
in scheme: YKL - Yleisten kirjastojen luokitusjärjestelmä
notation: 78.89212

City-blues. Chicago-blues
type: Concept
type: YKL-luokka
alternative label: Chicago-blues (78.89213)
alternative label: City-blues (78.89213)
alternative label: Cityblues (78.89213) @sv
broader: Blues
in scheme: YKL - Yleisten kirjastojen luokitusjärjestelmä
notation: 78.89213
preferred label: City blues. Chicago blues @en
preferred label: Cityblues. Chicago-blues @sv

Rhythm and blues. Doo wop
type: Concept
type: YKL-luokka
alternative label: Doo wop (78.89214)
alternative label: Rhythm and blues (78.89214)
broader: Blues
in scheme: YKL - Yleisten kirjastojen luokitusjärjestelmä
notation: 78.89214

Zydeco
type: Concept
type: YKL-luokka
alternative label: Zydeco (78.89215)
broader: Blues
in scheme: YKL - Yleisten kirjastojen luokitusjärjestelmä
notation: 78.89215

Jazz
type: Concept
type: YKL-luokka
alternative label: Jazz (78.8922+)
broader: Blues. Jazz
in scheme: YKL - Yleisten kirjastojen luokitusjärjestelmä
narrower: Traditionaalinen jazz
narrower: Swing
narrower: Bebop. Mainstream-jazz. Afrokuubalainen jazz
narrower: Free jazz. Avantgarde jazz
narrower: Third stream -jazz
narrower: Fuusiomusiikki
narrower: Etninen jazz
notation: 78.8922
scope note: Allmänna verk och samlingar Hit även all jazz som inte bestämts närmare @sv
scope note: Yleisteokset ja kokoelmat Tähän myös kaikki tarkemmin määrittelemätön jazz

Traditionaalinen jazz
type: Concept
type: YKL-luokka
alternative label: Charleston, jazz (78.89221)
alternative label: Chicago-jazz (78.89221)
alternative label: Dixieland (78.89221)
alternative label: Harlem-jazz (78.89221)
alternative label: New Orleans -jazz (78.89221)
alternative label: New Orleans jazz (78.89221) @sv
alternative label: Ragtime (78.89221)
alternative label: Traditionaalinen jazz (78.89221)
alternative label: Traditionell jazz (78.89221) @sv
broader: Jazz
in scheme: YKL - Yleisten kirjastojen luokitusjärjestelmä
notation: 78.89221
preferred label: Traditional jazz @en
preferred label: Traditionell jazz @sv
scope note: Hit bl.a. Chicago-jazz, dixieland, Harlem-jazz, New Orleans-jazz och ragtime @sv
scope note: Tähän mm. Chicago-jazz, dixieland, Harlem-jazz, New Orleans-jazz ja ragtime

Swing
type: Concept
type: YKL-luokka
alternative label: Swing (78.89222)
broader: Jazz
in scheme: YKL - Yleisten kirjastojen luokitusjärjestelmä
notation: 78.89222

Bebop. Mainstream-jazz. Afrokuubalainen jazz
type: Concept
type: YKL-luokka
alternative label: Afrokubansk jazz (78.89223) @sv
alternative label: Afrokuubalainen jazz (78.89223)
alternative label: Bebop (78.89223)
alternative label: Cool jazz (78.89223)
alternative label: Mainstream-jazz (78.89223)
broader: Jazz
in scheme: YKL - Yleisten kirjastojen luokitusjärjestelmä
notation: 78.89223
preferred label: Bebop. Mainstream jazz. Afro-Cuban jazz @en
preferred label: Bebop. Mainstream jazz. Afrokubansk jazz @sv

Free jazz. Avantgarde jazz
type: Concept
type: YKL-luokka
alternative label: Avantgarde jazz (78.89224)
alternative label: Free jazz (78.89224)
broader: Jazz
in scheme: YKL - Yleisten kirjastojen luokitusjärjestelmä
notation: 78.89224
preferred label: Free jazz. Avant-garde jazz @en

Third stream -jazz
type: Concept
type: YKL-luokka
alternative label: Kamarijazz (78.89225)
alternative label: Kammarjazz (78.89225) @sv
alternative label: Third stream -jazz (78.89225)
alternative label: Third stream jazz (78.89225) @sv
broader: Jazz
in scheme: YKL - Yleisten kirjastojen luokitusjärjestelmä
notation: 78.89225
preferred label: Third stream jazz @en
scope note: Hit även all annan jazzmusik i vilken den andra komponenten är den västerländska konstmusiken (t.ex. s.k. kammarjazz) @sv
scope note: Tähän myös kaikki muu jazzmusiikki, jossa on toisena aineksena länsimainen taidemusiikki (esim. ns. kamarijazz)

Fuusiomusiikki
type: Concept
type: YKL-luokka
alternative label: Fusionsmusik (78.89226) @sv
alternative label: Fuusiomusiikki (78.89226)
alternative label: Rockjazz (78.89226)
broader: Jazz
in scheme: YKL - Yleisten kirjastojen luokitusjärjestelmä
notation: 78.89226
preferred label: Fusion @sv
preferred label: Fusion music @en
scope note: Hit all jazzmusik i vilken den andra komponenten är popmusiken I osäkra fall ges företräde åt klassen 78.89226 @sv
scope note: Tähän kaikki jazzmusiikki, jossa on toisena aineksena popmusiikki Epävarmoissa tapauksissa annetaan etusija luokalle 78.89226

Etninen jazz
type: Concept
type: YKL-luokka
alternative label: Etninen jazz (78.89227)
alternative label: Etnisk jazz (78.89227) @sv
broader: Jazz
in scheme: YKL - Yleisten kirjastojen luokitusjärjestelmä
notation: 78.89227
preferred label: Ethnic jazz @en
preferred label: Etnisk jazz @sv
scope note: Hit all jazzmusik i vilken den andra komponenten är etnomusik Trots detta klassificeras traditionell jazz till 78.89221 @sv
scope note: Tähän kaikki jazzmusiikki, jossa toisena aineksena on etnomusiikki Traditionaalinen jazz tästä riippumatta 78.89221

Viihdemusiikki
type: Concept
References: Laulelmamusiikki
type: YKL-luokka
alternative label: Calypso, underhållningsmusik (78.893+) @sv
alternative label: Calypso, viihdemusiikki (78.893+)
alternative label: Dansmusik, populärmusik (78.893+) @sv
alternative label: Foxtrot, populaarimusiikki (78.893+)
alternative label: Foxtrot, populärmusik (78.893+) @sv
alternative label: Iskelmälyriikka, nuottijulkaisut (78.893+)
alternative label: Iskelmät (78.893+)
alternative label: Kupletit, viihdemusiikki (78.893+)
alternative label: Kupletter, underhållningsmusik (78.893+) @sv
alternative label: Schlaageri (78.893+)
alternative label: Schlager (78.893+) @sv
alternative label: Schlagerlyrik, musikalier (78.893+) @sv
alternative label: Schlagrar (78.893+) @sv
alternative label: Tanssimusiikki, populaarimusiikki (78.893+)
alternative label: Underhållningsmusik, populärmusik (78.893+) @sv
alternative label: Valser, populärmusik (78.893) @sv
alternative label: Valssit, populaarimusiikki (78.893)
alternative label: Viihdemusiikki, populaarimusiikki (78.893+)
broader: Musiikkikulttuurien sulautumat. Populaarimusiikki
in scheme: YKL - Yleisten kirjastojen luokitusjärjestelmä
narrower: Instrumentaalinen viihdemusiikki
narrower: Suomenkielinen laulettu viihdemusiikki
narrower: Ruotsinkielinen laulettu viihdemusiikki
narrower: Saksankielinen laulettu viihdemusiikki
narrower: Englanninkielinen laulettu viihdemusiikki
narrower: Ranskan-, italian-, espanja- ja portugalinkielinen laulettu viihdemusiikki
narrower: Venäjänkielinen laulettu viihdemusiikki
narrower: Muilla kielillä laulettu viihdemusiikki
notation: 78.893
preferred label: Light music @en
preferred label: Underhållningsmusik @sv
scope note: Allmänna verk och flerspråkiga samlingar som innehåller både vokal och instrumental underhållningsmusik Hit och till undergrupperna underhållningsmässig instrumental populärmusik samt sådan vokal eller ursprungligen vokal underhållningsmusik som på grund av framförande eller textens natur inte betraktas som vismusik @sv
scope note: Yleisteokset ja monikieliset sekä laulettua ja soitettua viihdemusiikkia sisältävät kokoelmat Tähän ja alaluokkiin viihteellinen instrumentaalinen populaarimusiikki sekä sellainen laulettu tai laulettavaksi tarkoitettu viihdemusiikki, jota ei tekstin luonteen tai esitystavan takia pidetä laulelmamusiikkina

Instrumentaalinen viihdemusiikki
type: Concept
type: YKL-luokka
alternative label: Charleston, underhållningsmusik (78.8931) @sv
alternative label: Charleston, viihdemusiikki (78.8931)
alternative label: Dansmusik, instrumental, populärmusik (78.8931) @sv
alternative label: Instrumentaalinen viihdemusiikki (78.8931)
alternative label: Instrumental underhållningsmusik (78.8931) @sv
alternative label: Latinalaisamerikkalainen tanssimusiikki (78.8931)
alternative label: Latinamerikansk dansmusik (78.8931) @sv
alternative label: Polkat, populaarimusiikki, instrumentaalinen (78.8931)
alternative label: Polkor, populärmusik, instrumental (78.8931) @sv
alternative label: Salongsmusik, populärmusik (78.8931) @sv
alternative label: Salonkimusiikki, populaarimusiikki (78.8931)
alternative label: Tanssimusiikki, soitettu, populaarimusiikki (78.8931)
broader: Viihdemusiikki
in scheme: YKL - Yleisten kirjastojen luokitusjärjestelmä
notation: 78.8931
preferred label: Instrumental light music @en
preferred label: Instrumental underhållningsmusik @sv
scope note: Hit bl.a. instrumental dansmusik, salongsmusik och latinamerikansk dansmusik utan sång @sv
scope note: Tähän mm. soitettu tanssimusiikki, salonkimusiikki ja latinalais-amerikkalainen tanssimusiikki, joka ei sisällä laulua

Suomenkielinen laulettu viihdemusiikki
type: Concept
type: YKL-luokka
alternative label: Evergreens, finskspråkiga (78.8932) @sv
alternative label: Ikivihreät, suomenkieliset (78.8932)
broader: Viihdemusiikki
in scheme: YKL - Yleisten kirjastojen luokitusjärjestelmä
notation: 78.8932
preferred label: Underhållningsmusik med sång på finska @sv
preferred label: Vocal light music in Finnish @en
scope note: Evergreens. Schlagrar @sv
scope note: Ikivihreät. Iskelmät

Ruotsinkielinen laulettu viihdemusiikki
type: Concept
type: YKL-luokka
broader: Viihdemusiikki
in scheme: YKL - Yleisten kirjastojen luokitusjärjestelmä
notation: 78.8933
preferred label: Underhållningsmusik med sång på svenska @sv
preferred label: Vocal light music in Swedish @en

Saksankielinen laulettu viihdemusiikki
type: Concept
type: YKL-luokka
broader: Viihdemusiikki
in scheme: YKL - Yleisten kirjastojen luokitusjärjestelmä
notation: 78.8934
preferred label: Underhållningsmusik med sång på tyska @sv
preferred label: Vocal light music in German @en

Englanninkielinen laulettu viihdemusiikki
type: Concept
type: YKL-luokka
alternative label: Evergreenit, englanninkieliset (78.8935)
alternative label: Evergreens, på engelska (78.8935) @sv
broader: Viihdemusiikki
in scheme: YKL - Yleisten kirjastojen luokitusjärjestelmä
notation: 78.8935
preferred label: Underhållningsmusik med sång på engelska @sv
preferred label: Vocal light music in English @en

Ranskan-, italian-, espanja- ja portugalinkielinen laulettu viihdemusiikki
type: Concept
type: YKL-luokka
broader: Viihdemusiikki
in scheme: YKL - Yleisten kirjastojen luokitusjärjestelmä
notation: 78.8936
preferred label: Underhållningsmusik med sång på franska, italienska, spansk och portugisiska @sv
preferred label: Vocal light music in Italian, Spanish and Portuguese @en

Venäjänkielinen laulettu viihdemusiikki
type: Concept
type: YKL-luokka
broader: Viihdemusiikki
in scheme: YKL - Yleisten kirjastojen luokitusjärjestelmä
notation: 78.8937
preferred label: Underhållningsmusik med sång på ryska @sv
preferred label: Vocal light music in Russian @en

Muilla kielillä laulettu viihdemusiikki
type: Concept
type: YKL-luokka
broader: Viihdemusiikki
in scheme: YKL - Yleisten kirjastojen luokitusjärjestelmä
notation: 78.8938
preferred label: Underhållningsmusik med sång på övriga språk @sv
preferred label: Vocal light music in other languages @en

Laulelmamusiikki
type: Concept
References: Hengellinen populaarimusiikki
type: YKL-luokka
alternative label: Arbetarsånger (78.894) @sv
alternative label: Kupletit, laulelmamusiikki (78.894+)
alternative label: Kupletter, vismusik (78.894+) @sv
alternative label: Laulelmamusiikki (78.894+)
alternative label: Poliittiset laulut, laulelmamusiikki (78.894+)
alternative label: Politiska sånger, vismusik (78.894+) @sv
alternative label: Työväenlaulut (78.894)
alternative label: Vismusik (78.894+) @sv
broader: Musiikkikulttuurien sulautumat. Populaarimusiikki
in scheme: YKL - Yleisten kirjastojen luokitusjärjestelmä
narrower: Kabaree. Revyy
narrower: Suomenkielinen laulelmamusiikki
narrower: Ruotsinkielinen laulelmamusiikki
narrower: Saksankielen laulelmamusiikki
narrower: Englanninkielinen laulelmamusiikki
narrower: Ranskan-, italian-, espanjan- ja portugalinkielinen laulelmamusiikki
narrower: Venäjänkielinen laulelmamusiikki
narrower: Muunkielinen laulelmamusiikki
notation: 78.894
preferred label: Tunes and ditties @en
preferred label: Vismusik @sv
scope note: Allmänna verk och flerspråkiga samlingar Hit och till underklasserna vokal eller ursprungligen vokal populärmusik som stilmässigt inte går att placeras i klasserna för popmusik, blues eller jazz eller som på grund av framförande eller textens centrala ställning inte betraktas som underhållningsmusik @sv
scope note: Yleisteokset ja monikieliset kokoelmat Tähän ja alaluokkiin laulettava tai laulettavaksi tarkoitettu populaarimusiikki, joka ei tyylillisesti sijoitu popmusiikin, bluesin tai jazzin luokkiin tai jota ei tekstin keskeisen aseman ja esitystavan takia pidetä viihdemusiikkina

Kabaree. Revyy
type: Concept
type: YKL-luokka
alternative label: Kabaree (78.8941)
alternative label: Kabaré (78.8941) @sv
alternative label: Revy (78.8941) @sv
alternative label: Revyy (78.8941)
broader: Laulelmamusiikki
in scheme: YKL - Yleisten kirjastojen luokitusjärjestelmä
notation: 78.8941
preferred label: Cabaret. Revue @en
preferred label: Kabaré. Revy @sv
scope note: Hit hela kabaré- och revyprogram oavsett språk, men enskilda visor till klassen för språket @sv
scope note: Tähän kielestä riippumatta kabaree- ja revyyohjelmakokonaisuudet, mutta yksittäisinä laulelmina kielen mukaiseen luokkaan

Suomenkielinen laulelmamusiikki
type: Concept
type: YKL-luokka
broader: Laulelmamusiikki
in scheme: YKL - Yleisten kirjastojen luokitusjärjestelmä
notation: 78.8942
preferred label: Finsk vismusik @sv
preferred label: Tunes and ditties in Finnish @en

Ruotsinkielinen laulelmamusiikki
type: Concept
type: YKL-luokka
broader: Laulelmamusiikki
in scheme: YKL - Yleisten kirjastojen luokitusjärjestelmä
notation: 78.8943
preferred label: Svensk vismusik @sv
preferred label: Tunes and ditties in Swedish @en

Saksankielen laulelmamusiikki
type: Concept
type: YKL-luokka
broader: Laulelmamusiikki
in scheme: YKL - Yleisten kirjastojen luokitusjärjestelmä
notation: 78.8944
preferred label: Tunes and ditties in German @en
preferred label: Tysk vismusik @sv

Englanninkielinen laulelmamusiikki
type: Concept
type: YKL-luokka
broader: Laulelmamusiikki
in scheme: YKL - Yleisten kirjastojen luokitusjärjestelmä
notation: 78.8945
preferred label: Engelskspråkig vismusik @sv
preferred label: Tunes and ditties in English @en

Ranskan-, italian-, espanjan- ja portugalinkielinen laulelmamusiikki
type: Concept
type: YKL-luokka
alternative label: Chanson (78.8946)
alternative label: Fado-laulu, viihdemusiikki (78.8946)
alternative label: Fado-sång, underhållningsmusik (78.8946) @sv
alternative label: Flamenco, underhållningsmusik (78.8946) @sv
alternative label: Flamenco, viihdemusiikki (78.8946)
broader: Laulelmamusiikki
in scheme: YKL - Yleisten kirjastojen luokitusjärjestelmä
notation: 78.8946
preferred label: Fransk, italiensk, spansk och portugisisk vismusik @sv
preferred label: Tunes and ditties in Italian, Spanish and Portuguese @en

Venäjänkielinen laulelmamusiikki
type: Concept
type: YKL-luokka
broader: Laulelmamusiikki
in scheme: YKL - Yleisten kirjastojen luokitusjärjestelmä
notation: 78.8947
preferred label: Rysk vismusik @sv
preferred label: Tunes and ditties in Russian @en

Muunkielinen laulelmamusiikki
type: Concept
type: YKL-luokka
alternative label: Rebetika, laulelmamusiikki, Kreikka (78.8948)
alternative label: Rebetika, vismusik, Grekland (78.8948) @sv
broader: Laulelmamusiikki
in scheme: YKL - Yleisten kirjastojen luokitusjärjestelmä
notation: 78.8948
preferred label: Tunes and ditties in other languages @en
preferred label: Vismusik på övriga språk @sv

Hengellinen populaarimusiikki
type: Concept
type: YKL-luokka
alternative label: Andlig musik, populärmusik (78.896+) @sv
alternative label: Andlig populärmusik (78.896+) @sv
alternative label: Hengellinen musiikki, populaarimusiikki (78.896+)
alternative label: Hengellinen populaarimusiikki (78.896+)
broader: Musiikkikulttuurien sulautumat. Populaarimusiikki
in scheme: YKL - Yleisten kirjastojen luokitusjärjestelmä
narrower: Spirituaalit. Gospelit
narrower: Hengellinen pop- ja rockmusiikki
notation: 78.896
preferred label: Andlig popularmusik @sv
preferred label: Spiritual popular music @en

Spirituaalit. Gospelit
type: Concept
type: YKL-luokka
alternative label: Gospel (78.8961) @sv
alternative label: Gospelit (78.8961)
alternative label: Negro spirituaalit (78.8961)
alternative label: Negro spirituals (78.8961) @sv
alternative label: Spirituaalit (78.8961)
alternative label: Spiritualer (78.8961) @sv
broader: Hengellinen populaarimusiikki
in scheme: YKL - Yleisten kirjastojen luokitusjärjestelmä
notation: 78.8961
preferred label: Spiritualer. Gospel @sv
preferred label: Spirituals. Gospels @en

Hengellinen pop- ja rockmusiikki
type: Concept
type: YKL-luokka
alternative label: Gospelrock (78.8962)
broader: Hengellinen populaarimusiikki
in scheme: YKL - Yleisten kirjastojen luokitusjärjestelmä
notation: 78.8962
preferred label: Andlig pop- och rockmusik @sv
preferred label: Spiritual pop and rock music @en
scope note: Gospelrock

Maailmanmusiikki
type: Concept
References: Etninen popmusiikki
References: Etninen jazz
type: YKL-luokka
alternative label: Maailmanmusiikki (78.897)
alternative label: Världsmusik (78.897) @sv
broader: Musiikkikulttuurien sulautumat. Populaarimusiikki
in scheme: YKL - Yleisten kirjastojen luokitusjärjestelmä
notation: 78.897
preferred label: Världsmusik @sv
preferred label: World music @en
scope note: Perinnemusiikkiin pohjautuva populaarimusiikki, joka ei sijoitu luokkiin 78.8917 Etninen popmusiikki tai 78.89227 Etninen jazz
scope note: Popularmusik som grundar sig på traditionell musik, men klassifieras inte till klasserna 78.8917 Etnisk popmusik eller 78.89227 Etnisk jazz @sv

New age -musiikki. Meditaatiomusiikki
type: Concept
type: YKL-luokka
alternative label: Meditaatiomusiikki (78.898)
alternative label: Meditationsmusik (78.898) @sv
alternative label: New age -musiikki (78.898)
alternative label: New age -musik (78.898) @sv
broader: Musiikkikulttuurien sulautumat. Populaarimusiikki
in scheme: YKL - Yleisten kirjastojen luokitusjärjestelmä
notation: 78.898
preferred label: New age -musik. Meditationsmusik @sv
preferred label: New age music. Meditation music @en

Musiikin historia
type: Concept
type: YKL-luokka
alternative label: Ljudupptagningarnas historia, musik (78.9) @sv
alternative label: Musiikin historia (78.9+)
alternative label: Musikhistoria (78.9+) @sv
alternative label: Äänitteiden historia, musiikki (78.9)
broader: MUSIIKKI
in scheme: YKL - Yleisten kirjastojen luokitusjärjestelmä
narrower: Länsimaisen taidemusiikin historia
narrower: Suomen musiikin historia
narrower: Pohjoismaiden musiikin historia
narrower: Keski-Euroopan maiden musiikin historia
narrower: Britteinsaarten musiikin historia
narrower: Espanjan, Italian, Portugalin ja Ranskan musiikin historia
narrower: Muiden Euroopan maiden musiikin historia
narrower: Muiden maanosien maiden musiikin historia
narrower: Henkilöhistoria
notation: 78.9
preferred label: History of music @en
preferred label: Musikhistoria @sv
scope note: Allmänna verk och samlingar med blandat innehåll Hit även allmän europeisk musikhistoria Hit och till undergrupperna verk som behandlar allmän musikhistoria inom ett visst område Hit även ljudupptagningarnas och ljudupptagningsteknologins allmänna historia, men t.ex. jazzmusikinspelningarnas historia 78.892209 Verk som behandlar i allmänhet ett enskilt specialområdes historia inom musiken förs till klassen för det ifrågavarande området, t.ex. notskriftens historia 78.2709 @sv
scope note: Yleisteokset ja sekasisältöiset kokoelmat Tähän myös Euroopan musiikin yleinen historia Tähän ja alaluokkiin tietyn alueen yleistä musiikin historiaa käsittelevät teokset Tähän myös äänitteiden ja ääniteteknologian yleinen historia, mutta esim. jazzmusiikin äänitteiden historia 78.892209 Musiikin erikoisalojen historiaa yleisesti käsittelevät teokset ko. alojen luokkiin, esim. nuottikirjoituksen historia 78.2709

Länsimaisen taidemusiikin historia
type: Concept
type: YKL-luokka
alternative label: Länsimaisen musiikin tyylikaudet (78.91+)
alternative label: Stilhistoria, den västerländska konstmusikens (78.91+) @sv
alternative label: Stilperioder, den västerländska konstmusikens (78.91+) @sv
alternative label: Stilriktningar, den västerländska konstmusikens (78.91+) @sv
alternative label: Tyylihistoria, länsimaisen taidemusiikin (78.91+)
alternative label: Tyylikaudet, länsimaisen taidemusiikin (78.91+)
alternative label: Tyylisuunnat, länsimaisen taidemusiikin (78.91+)
alternative label: Västerländska musikens stilperioder (78.91+) @sv
broader: Musiikin historia
in scheme: YKL - Yleisten kirjastojen luokitusjärjestelmä
narrower: Vanhimpien kulttuurien musiikki. Antiikin ajan musiikki
narrower: Keskiajan musiikki (n. 1000-1400)
narrower: Renessanssin ajan musiikki (n. 1400-1600)
narrower: Barokkiajan musiikki (n. 1600-1750)
narrower: Klassismin ajan musiikki (n. 1750-1820)
narrower: Romantiikan ajan musiikki (n. 1820-1900)
narrower: 1900- ja 2000-luvun musiikki
notation: 78.91
preferred label: Den västerländska konstmusikens historia @sv
preferred label: History of Western classical music @en
scope note: Allmänna verk och samlingar som innehåller musik från olika stilperioder I undergrupperna anger årtalena i parentesen grovt den tidsperiod som begreppet i klassifikationen omfattar @sv
scope note: Yleisteokset ja eri tyylikausien musiikkia sisältävät kokoelmat Alaluokissa suluissa mainitut vuosiluvut osoittavat karkeasti luokituksessa käytetyn käsitteen kattaman ajanjakson

Vanhimpien kulttuurien musiikki. Antiikin ajan musiikki
type: Concept
type: YKL-luokka
alternative label: Antiikin ajan musiikki (78.911)
alternative label: Antikens musik (78.911) @sv
alternative label: Bysantinsk musik, historia (78.911) @sv
alternative label: Bysanttinen musiikki, historia (78.911)
alternative label: Gammal musik, som historisk stilperiod (78.911 ... 78.914) @sv
alternative label: Gregoriaaninen musiikki, tyylikausien historia (78.911)
alternative label: Gregoriansk musik, stilperiodernas historia (78.911) @sv
alternative label: Vanha musiikki, historiallisena tyylikautena (78.911 ... 78.914)
broader: Länsimaisen taidemusiikin historia
in scheme: YKL - Yleisten kirjastojen luokitusjärjestelmä
notation: 78.911
preferred label: De äldsta kulturernas musik. Antikens musik @sv
preferred label: Music of the ancient cultures. Music of antiquity. Gregorian and Byzantine music (c. -1000) @en
scope note: Hit även Gregoriansk och bysantinsk musik (ca -1000) @sv
scope note: Tähän myös Gregoriaaninen ja bysanttilainen musiikki (n. -1000)

Keskiajan musiikki (n. 1000-1400)
type: Concept
type: YKL-luokka
alternative label: Gammal musik, som historisk stilperiod (78.911 ... 78.914) @sv
alternative label: Keskiaika, musiikinhistoria (78.912)
alternative label: Keskiajan musiikki, historiallisena ilmiönä (78.912)
alternative label: Medeltida musik, som historiskt fenomen (78.912) @sv
alternative label: Medeltiden, musikhistoria (78.912) @sv
alternative label: Minnelaulu, musiikin tyylikaudet (78.912)
alternative label: Minnesång, musikens stilperioder (78.912) @sv
alternative label: Trubadursång, medeltida (78.912) @sv
alternative label: Trubaduurilaulu, keskiaikainen (78.912)
alternative label: Vanha musiikki, historiallisena tyylikautena (78.911 ... 78.914)
broader: Länsimaisen taidemusiikin historia
in scheme: YKL - Yleisten kirjastojen luokitusjärjestelmä
notation: 78.912
preferred label: Medeltidens musik (ca 1000-1400) @sv
preferred label: Medieval music (c. 1000-1400) @en

Renessanssin ajan musiikki (n. 1400-1600)
type: Concept
type: YKL-luokka
alternative label: Gammal musik, som historisk stilperiod (78.911 ... 78.914) @sv
alternative label: Renessanssin ajan musiikki, historiallisena ilmiönä (78.913)
alternative label: Renässansens musik, som historiskt fenomen (78.913) @sv
alternative label: Vanha musiikki, historiallisena tyylikautena (78.911 ... 78.914)
broader: Länsimaisen taidemusiikin historia
in scheme: YKL - Yleisten kirjastojen luokitusjärjestelmä
notation: 78.913
preferred label: Renaissance music (c. 1400-1600) @en
preferred label: Renässansens musik (ca 1400-1600) @sv

Barokkiajan musiikki (n. 1600-1750)
type: Concept
type: YKL-luokka
alternative label: Barockens musik, som historiskt fenomen (78.914) @sv
alternative label: Barokkiajan musiikki, historiallisena ilmiönä (78.914)
alternative label: Gammal musik, som historisk stilperiod (78.911 ... 78.914) @sv
alternative label: Vanha musiikki, historiallisena tyylikautena (78.911 ... 78.914)
broader: Länsimaisen taidemusiikin historia
in scheme: YKL - Yleisten kirjastojen luokitusjärjestelmä
notation: 78.914
preferred label: Barockens musik (1600-1750) @sv
preferred label: Baroque music (c. 1600-1750) @en

Klassismin ajan musiikki (n. 1750-1820)
type: Concept
type: YKL-luokka
alternative label: Klassicismens musik, som historiskt fenomen (78.915) @sv
alternative label: Klassismin ajan musiikki, historiallisena ilmiönä (78.915)
broader: Länsimaisen taidemusiikin historia
in scheme: YKL - Yleisten kirjastojen luokitusjärjestelmä
notation: 78.915
preferred label: Klassicismens musik (ca 1750-1820) @sv
preferred label: Music from the era of Classicism (c.1750-1820) @en

Romantiikan ajan musiikki (n. 1820-1900)
type: Concept
type: YKL-luokka
alternative label: Romantiikan ajan musiikki, historiallisena ilmiönä (78.916)
alternative label: Romantikens musik, som historiskt fenomen (78.916) @sv
broader: Länsimaisen taidemusiikin historia
in scheme: YKL - Yleisten kirjastojen luokitusjärjestelmä
notation: 78.916
preferred label: Music from the era of Romanticism (c. 1820-1900) @en
preferred label: Romantikens musik (ca 1820-1900) @sv

1900- ja 2000-luvun musiikki
type: Concept
type: YKL-luokka
alternative label: 1900-luvun musiikki (78.917)
alternative label: 1900-talets musik (78.917) @sv
broader: Länsimaisen taidemusiikin historia
in scheme: YKL - Yleisten kirjastojen luokitusjärjestelmä
notation: 78.917
preferred label: 1900-talets musik (1900-2000) @sv
preferred label: Music of 20th and 21st century @en

Suomen musiikin historia
type: Concept
type: YKL-luokka
broader: Musiikin historia
in scheme: YKL - Yleisten kirjastojen luokitusjärjestelmä
notation: 78.92
preferred label: Finlands musikhistoria @sv
preferred label: History of Finnish music @en
scope note: Hit den finländska konstmusikens historia och Finlands allmänna musikhistoria Verk som behandlar enbart den traditionella finska musiken 78.4209 Verk som behandlar enbart den finländska populärmusikens historia 78.8909 eller exaktare På motsvarande sätt även i klasserna för de andra europeiska ländernas musikhistoria, t.ex. den keltiska folkmusikens historia 78.4109 @sv
scope note: Tähän suomalaisen taidemusiikin historia ja yleinen Suomen musiikin historia Pelkästään suomalaisen etnomusiikin historiaa käsittelevät teokset 78.4209 Pelkästään suomalaisen populaarimusiikin historiaa käsittelevät teokset 78.8909 tai tarkemmin Vastaavasti myös muissa Euroopan maiden musiikin historian luokissa, esim. kelttiläisen kansanmusiikin historia 78.4109

Pohjoismaiden musiikin historia
type: Concept
type: YKL-luokka
broader: Musiikin historia
in scheme: YKL - Yleisten kirjastojen luokitusjärjestelmä
notation: 78.93
preferred label: History of Nordic music @en
preferred label: Nordisk musikhistoria @sv

Keski-Euroopan maiden musiikin historia
type: Concept
type: YKL-luokka
broader: Musiikin historia
in scheme: YKL - Yleisten kirjastojen luokitusjärjestelmä
notation: 78.94
preferred label: De mellaneuropeiska ländernas musikhistoria @sv
preferred label: History of the music of Central European countries @en

Britteinsaarten musiikin historia
type: Concept
type: YKL-luokka
broader: Musiikin historia
in scheme: YKL - Yleisten kirjastojen luokitusjärjestelmä
notation: 78.95
preferred label: Brittiska öarnas musikhistoria @sv
preferred label: History of the music of the British Isles @en

Espanjan, Italian, Portugalin ja Ranskan musiikin historia
type: Concept
type: YKL-luokka
broader: Musiikin historia
in scheme: YKL - Yleisten kirjastojen luokitusjärjestelmä
notation: 78.96
preferred label: History of the music of Spain, Italy, Portugal and France @en
preferred label: Spaniens, Italiens, Portugals och Frankrikes musikhistoria @sv

Muiden Euroopan maiden musiikin historia
type: Concept
type: YKL-luokka
broader: Musiikin historia
in scheme: YKL - Yleisten kirjastojen luokitusjärjestelmä
notation: 78.97
preferred label: De övriga europeiska ländernas musikhistoria @sv
preferred label: History of the music of other European countries @en

Muiden maanosien maiden musiikin historia
type: Concept
type: YKL-luokka
broader: Musiikin historia
in scheme: YKL - Yleisten kirjastojen luokitusjärjestelmä
notation: 78.98
preferred label: History of the music of countries in other continents @en
preferred label: Musikhistoria i länder i andra världsdelar @sv
scope note: Hit verk som på ett allmänt sätt behandlar musikkulturer i två eller flera världsdelar Hit även material om den västerländska konstmusikens historia i länderna utanför Europa Enskilda icke-europeiska musikkulturernas historia 78.4809 eller exaktare, t.ex. japansk musikhistoria 78.4816309 @sv
scope note: Tähän kahden tai useamman muun maanosan musiikkikulttuureita yleisesti käsittelevät teokset Tähän myös länsimaisen taidemusiikin historiaa Euroopan ulkopuolisissa maissa käsittelevä aineisto Yksittäisten ei-eurooppalaisten musiikkikulttuurien historia 78.4809 tai tarkemmin, esim. Japanin musiikin historia 78.4816309

Henkilöhistoria
type: Concept
References: URN:NBN:fi:au:ykl:78.03
References: URN:NBN:fi:au:ykl:78.8903
References: Elämäkerrat. Muistelmat, taiteentutkijat ja urheilututkijat
References: Elämäkerralliset hakuteokset, Taiteentutkijat. Urheilututkijat
type: YKL-luokka
alternative label: Biografier, musik (78.99+) @sv
alternative label: Bloggar, musik (78.99+) @sv
alternative label: Blogit, musiikki (78.99+)
alternative label: Brev, musik (78.99+) @sv
alternative label: Brevsamlingar, musik (78.99+) @sv
alternative label: Brevväxling, musik (78.99+) @sv
alternative label: Dagböcker, musik (78.99+) @sv
alternative label: Dagböcker, musik, forskning (78.99+) @sv
alternative label: Elämäkerrat, musiikki (78.99+)
alternative label: Elämäkertatutkimus, musiikki (78.99+)
alternative label: Henkilöhistoria, musiikki (78.99+)
alternative label: Kirjeenvaihto, musiikki (78.99+)
alternative label: Kirjeet, musiikki (78.99+)
alternative label: Kirjekokoelmat, musiikki (78.99+)
alternative label: Kompositörer, biografier och memoarer (78.99+) @sv
alternative label: Laulajat, elämäkerrat ja muistelmat (78.99+)
alternative label: Livshistorieforskning, musik (78.99+) @sv
alternative label: Matrikkelit, musiikin henkilöhistoria (78.99)
alternative label: Matriklar, musikens personhistoria (78.99) @sv
alternative label: Memoarer, musik (78.99+) @sv
alternative label: Muistelmat, musiikki (78.99+)
alternative label: Musiker, biografier och memoarer (78.99+) @sv
alternative label: Muusikot, elämäkerrat ja muistelmat (78.99+)
alternative label: Nettipäiväkirjat, musiikki (78.99+)
alternative label: Nätdagböcker, musik (78.99+) @sv
alternative label: Omaelämäkerrat, musiikki (78.99+)
alternative label: Personhistoria, musik (78.99+) @sv
alternative label: Päiväkirjat, musiikki (78.99+)
alternative label: Päiväkirjat, musiikki, tutkimus (78.99+)
alternative label: Självbiografier, musik (78.99+) @sv
alternative label: Säveltäjät, elämäkerrat ja muistelmat (78.99+)
alternative label: Sångare, biografier och memoarer (78.99+) @sv
alternative label: Tonsättare, biografier och memoarer (78.99+) @sv
alternative label: Verkkopäiväkirjat, musiikki (78.99+)
alternative label: Web-log, musiikki (78.99+)
alternative label: Webbjournaler, musik (78.99+) @sv
alternative label: Webbloggar, musik (78.99+) @sv
broader: Musiikin historia
in scheme: YKL - Yleisten kirjastojen luokitusjärjestelmä
narrower: Länsimaisen taidemusiikin edustajat
narrower: Etnomusiikin edustajat
narrower: Populaarimusiikin edustajat
notation: 78.99
preferred label: Personal history @en
preferred label: Personhistoria @sv
scope note: Biografier. Memoarer. Tryckta brevsamlingar Hit personhistoriska verk som samtidigt behandlar representanter för olika musikformer Hit och till undergrupperna även krönikor om musikaliska samfund när dessa innehåller material som till sin natur är väsentligt personhistoriskt, annars till klassen för musikformen @sv
scope note: Elämäkerrat. Muistelmat. Painetut kirjekokoelmat Tähän eri musiikin lajien edustajia yhtä aikaa käsittelevät henkilöhistorialliset teokset Tähän ja alaluokkiin myös musiikillisten yhteisöjen historiikit silloin, kun ne sisältävät olennaisesti henkilöhistoriallista ainesta, muuten ko. musiikin lajin mukaiseen luokkaan

Länsimaisen taidemusiikin edustajat
type: Concept
type: YKL-luokka
alternative label: Dirigenter, biografier och memoarer (78.991+) @sv
alternative label: Kapellimestarit, elämäkerrat ja muistelmat (78.991+)
alternative label: Kapellmästare, biografier och memoarer (78.991+) @sv
alternative label: Orkesterinjohtajat, elämäkerrat ja muistelmat (78.991+)
broader: Henkilöhistoria
in scheme: YKL - Yleisten kirjastojen luokitusjärjestelmä
notation: 78.991
preferred label: Den västerländska konstmusikens företrädare @sv
preferred label: Representatives of Western classical music @en

Etnomusiikin edustajat
type: Concept
type: YKL-luokka
broader: Henkilöhistoria
in scheme: YKL - Yleisten kirjastojen luokitusjärjestelmä
notation: 78.992
preferred label: Den traditionella musikens företrädare @sv
preferred label: Representatives of ethnic music @en

Populaarimusiikin edustajat
type: Concept
type: YKL-luokka
broader: Henkilöhistoria
in scheme: YKL - Yleisten kirjastojen luokitusjärjestelmä
notation: 78.993
preferred label: Populärmusikens företrädare @sv
preferred label: Representatives of popular music @en

LIIKUNTA. URHEILU. LEIKIT. HUVIT
type: Concept
References: Liikunta. Urheilu
type: YKL-luokka
alternative label: Ekstreme-lajit (79+)
alternative label: Extrema sporter (79+) @sv
alternative label: Extreme-lajit (79+)
alternative label: Extremsporter (79+) @sv
alternative label: Idrottsservice (79+) @sv
alternative label: Keinonurmet, hoito (79+)
alternative label: Konstgräs, skötsel (79+) @sv
alternative label: Liikuntapalvelut (79+)
alternative label: Motionsservice (79+) @sv
alternative label: Tekonurmet, hoito (79+) @sv
alternative label: Urheilupalvelut (79+)
alternative label: Äärilajit (79+)
alternative label: Ääriurheilu (79+)
broader: TAITEET. LIIKUNTA
in scheme: YKL - Yleisten kirjastojen luokitusjärjestelmä
narrower: Liikunta. Urheilu
narrower: Voimistelu
narrower: Palloilu
narrower: Retkeily. Ulkoilu
narrower: Lentourheilu. Moottoriurheilu
narrower: Kuntoliikunta. Kuntourheilu
narrower: Muut urheilu- ja liikuntamuodot
narrower: Pelit. Leikit. Keräily
narrower: Julkiset huvit
notation: 79
preferred label: EXERCISE. SPORTS. PLAYS. PASTIMES @en
preferred label: MOTION. IDROTT. LEKAR. NÖJEN @sv
scope note: Hit allmänna verk som gäller både motion eller idrott och lekar eller nöjen @sv
scope note: Tähän yleisteokset, jotka koskevat sekä liikuntaa tai urheilua että leikkejä tai huveja

Liikunta. Urheilu
type: Concept
References: Viheralueiden suunnittelu
References: Urheilulääketiede
References: Rakennukset. Rakennustyypit
References: Seuratanssit. Tanssiurheilu
References: Voimistelu
References: Palloilu
References: Retkeily. Ulkoilu
References: Lentourheilu. Moottoriurheilu
References: Muut urheilu- ja liikuntamuodot
References: Elämäkerrat. Muistelmat, taiteentutkijat ja urheilututkijat
References: Elämäkerralliset hakuteokset, Taiteentutkijat. Urheilututkijat
alternative label: AIF (79.1) @sv
alternative label: Amatöridrott (79.1) @sv
alternative label: Amatööriurheilu (79.1)
alternative label: Ammattilaisurheilu (79.1)
alternative label: Dagböcker, idrottare (79.1 ... 79.7) @sv
alternative label: Dagböcker, idrottare, forskning (79.1 ... 79.7) @sv
alternative label: Elitidrott (79.1) @sv
alternative label: Finlands Idrott FI (79.1) @sv
alternative label: Fysisk fostran (79.1) @sv
alternative label: Fyysinen kasvatus (79.1)
alternative label: Handikappolympiader (79.1) @sv
alternative label: Harjoittelu, urheilu (79.1)
alternative label: Harrastukset, urheilu (79.1 ... 79.7)
alternative label: Hobbyer, idrott (79.1 ... 79.7) @sv
alternative label: Huippu-urheilu (79.1)
alternative label: Idrott (79.1) @sv
alternative label: Idrottsanläggningar, idrott (79.1) @sv
alternative label: Kesäolympialaiset (79.1)
alternative label: Kilpaurheilu (79.1)
alternative label: Liikunnanohjaus (79.1)
alternative label: Liikunta (79.1)
alternative label: Liikuntakasvatus (79.1)
alternative label: Liikuntapolitiikka (79.1)
alternative label: Liikuntapsykologia (79.1)
alternative label: Liikuntasosiologia (79.1)
alternative label: Liikuntatilat, urheilu (79.1)
alternative label: Olympiakisat (79.1)
alternative label: Olympialaiset (79.1)
alternative label: Paralympialaiset (79.1)
alternative label: Päiväkirjat, urheilijat (79.1 ... 79.7)
alternative label: Päiväkirjat, urheilijat, tutkimus (79.1 ... 79.7)
alternative label: SLU (79.1)
alternative label: Sponsorointi, urheilu (79.1)
alternative label: Stadionit, urheilu (79.1)
alternative label: Suomen Liikunta ja Urheilu SLU (79.1)
alternative label: Säännöt, urheilu (79.1)
alternative label: TUL (79.1)
alternative label: Talviolympialaiset (79.1)
alternative label: Urheilu (79.1)
alternative label: Urheilualueet, urheilu (79.1)
alternative label: Urheilujärjestöt (79.1)
alternative label: Urheilukentät, urheilu (79.1)
alternative label: Urheilukeskukset, urheilu (79.1)
alternative label: Urheilukilpailut (79.1)
alternative label: Urheiluopistotoiminta (79.1)
alternative label: Urheilupolitiikka (79.1)
alternative label: Urheilupsykologia (79.1)
alternative label: Urheilurakennukset, urheilu (79.1)
alternative label: Urheilusosiologia (79.1)
alternative label: Urheilutilat, urheilu (79.1)
alternative label: Urheiluvalmennus (79.1)
alternative label: Urheiluvälineet (79.1)
alternative label: Valmennus, urheilu (79.1)
alternative label: Vammaisolympialaiset (79.1)
broader: LIIKUNTA. URHEILU. LEIKIT. HUVIT
in scheme: YKL - Yleisten kirjastojen luokitusjärjestelmä
narrower: Yleisurheilu
narrower: Talviurheilu
narrower: Uinti. Sukellus. Lainelautailu
narrower: Soutu. Melonta. Purjehdus
narrower: Hevosurheilu. Ratsastus
narrower: Miekkailu
narrower: Ammunta
narrower: Voimailu. Kehonrakennus. Fitness-urheilu
narrower: Pyöräily
notation: 79.1
scope note: Hit allmänna verk om motion och idrott. Hit också allmänna verk om både tävlings- och motionsidrott. Hit också allmänna verk om tävlings- och toppidrott. Allmänna verk om motionsidrott till klass 79.6. Olika grenar av tävlings-, topp- och motionsidrott till klasserna 79.11-79.5+ och 79.7. Tävlingar, regler, träning, sportredskap, idrottsplaner, lokaler och byggnader ur motions- och sportsynvinkel förs till klasserna 79.1-79.7. Till klasserna 79.1-79.7 också idrottspsykologi och idrottssociologi och idrottspolitik samt idrottsfostran och fysisk fostran. Till klasserna 79.106-79.706 idrottsföreningar och idrottsorganisationer. Till klasserna 79.109-79.709 motionens och sportens historia samt idrottsmännens personhistoria. Sommar-, vinter och paralympiadernas allmänna historia 79.109 @sv
scope note: Tähän liikunnan ja urheilun yleisteokset. Tähän myös yleisteokset, jotka koskevat sekä kilpa- että kuntourheilua. Tähän myös kilpa- ja huippu-urheilun yleisteokset . Luokkaan 79.6 kuntourheilun yleisteokset . Luokkiin 79.11-79.5+ ja 79.7 kilpa-, huippu- ja kuntourheilun eri lajit. Luokkiin 79.1-79.7 kilpailut, säännöt, valmennus, välineet, kentät, tilat ja rakennukset liikunnan ja urheilun kannalta. Luokkiin 79.1-79.7 myös urheilupsykologia, -sosiologia ja -politiikka sekä urheilu- ja liikuntakasvatus. Luokkiin 79.106-79.706 urheiluseurat ja -järjestöt. Luokkiin 79.109-79.709 liikunnan ja urheilun historia sekä urheilijoiden henkilöhistoria. Kesä-, talvi- ja paralympialaisten yleinen historia 79.109

Yleisurheilu
type: Concept
References: Muut urheilu- ja liikuntamuodot
alternative label: Aitajuoksut (79.11)
alternative label: Amatöridrott, grenvis (79.11 ... 79.7) @sv
alternative label: Amatööriurheilu, lajeittain (79.11 ... 79.7)
alternative label: Ammattilaisurheilu, lajeittain (79.11 ... 79.7)
alternative label: Banlöpning (79.11) @sv
alternative label: Diskuskastning (79.11) @sv
alternative label: Elitidrott, grenvis (79.11 ... 79.7) @sv
alternative label: Estejuoksut (79.11)
alternative label: Femkamp, friidrott (79.11) @sv
alternative label: Friidrott (79.11) @sv
alternative label: Fyysinen kasvatus, urheilu lajeittain (79.11 ... 79.7)
alternative label: Heitot, yleisurheilu (79.11)
alternative label: Huippu-urheilu, lajeittain (79.11 ... 79.7)
alternative label: Hypyt, yleisurheilu (79.11)
alternative label: Hölkkä (79.11)
alternative label: Juoksut, yleisurheilu (79.11)
alternative label: Keihäänheitto (79.11)
alternative label: Kenttälajit, yleisurheilu (79.11)
alternative label: Kestävyysjuoksut (79.11)
alternative label: Kesäolympialaiset, lajeittain (79.11 ... 79.7)
alternative label: Kiekonheitto (79.11)
alternative label: Kilpaurheilu, lajeittain (79.11 ... 79.7)
alternative label: Kolmiloikka (79.11)
alternative label: Korkeushyppy (79.11)
alternative label: Kuulantyöntö (79.11)
alternative label: Kymmenottelu (79.11)
alternative label: Kävely (79.11)
alternative label: Kävely, kuntoliikunta (79.11)
alternative label: Kävelyurheilu (79.11)
alternative label: Liikunnanohjaus, lajeittain (79.11 ... 79.7)
alternative label: Liikunta, lajeittain (79.11 ... 79.7)
alternative label: Liikuntakasvatus, lajeittain (79.11 ... 79.7)
alternative label: Liikuntamuodot, lajeittain (79.11 ... 79.7)
alternative label: Liikuntapolitiikka, lajeittain (79.11 ... 79.7)
alternative label: Liikuntapsykologia, lajeittain (79.11 ... 79.7)
alternative label: Liikuntasosiologia, lajeittain (79.11 ... 79.7)
alternative label: Liikuntatilat, urheilu lajeittain (79.11 ... 79.7)
alternative label: Maastojuoksu (79.11)
alternative label: Maratonjuoksu (79.11)
alternative label: Moniottelut, yleisurheilu (79.11)
alternative label: Moukarinheitto (79.11)
alternative label: Olympiakisat, lajeittain (79.11 ... 79.7)
alternative label: Olympialaiset, lajeittain (79.11 ... 79.7)
alternative label: Paralympialaiset, lajeittain (79.11 ... 79.7)
alternative label: Pikajuoksut (79.11)
alternative label: Pituushyppy (79.11)
alternative label: Ratajuoksut (79.11)
alternative label: Sauvakävely (79.11)
alternative label: Seitsenottelu, yleisurheilu (79.11)
alternative label: Seiväshyppy (79.11)
alternative label: Stadionit, urheilu lajeittain (79.11 ... 79.7)
alternative label: Säännöt, urheilu lajeittain (79.11 ... 79.7)
alternative label: Urheilu, lajeittain (79.11 ... 79.7)
alternative label: Urheilualueet, urheilu lajeittain (79.11 ... 79.7)
alternative label: Urheilujärjestöt, lajeittain (79.11 ... 79.7)
alternative label: Urheilukentät, urheilu lajeittain (79.11 ... 79.7)
alternative label: Urheilukeskukset, urheilu lajeittain (79.11 ... 79.7)
alternative label: Urheilukilpailut, lajeittain (79.11 ... 79.7)
alternative label: Urheilulajit (79.11 ... 79.7)
alternative label: Urheiluopistotoiminta, lajeittain (79.11 ... 79.7)
alternative label: Urheilupolitiikka, lajeittain (79.11 ... 79.7)
alternative label: Urheilupsykologia, lajeittain (79.11 ... 79.7)
alternative label: Urheilurakennukset, urheilu lajeittain (79.11 ... 79.7)
alternative label: Urheilusosiologia, lajeittain (79.11 ... 79.7)
alternative label: Urheiluvalmennus, lajeittain (79.11 ... 79.7)
alternative label: Urheiluvälineet, lajeittain (79.11 ... 79.7)
alternative label: Vammaiskilpaurheilu lajeittain (79.11 ... 79.7)
alternative label: Vammaisolympialaiset, lajeittain (79.11 ... 79.7)
alternative label: Vammaisurheilu lajeittain (79.11 ... 79.7)
alternative label: Vammaisurheilu, kilpaurheilu lajeittain (79.11 ... 79.7)
alternative label: Veteraaniurheilu, lajeittain (79.11 ... 79.7)
alternative label: Viisiottelu, yleisurheilu (79.11)
alternative label: Yleisurheilu (79.11)
broader: Liikunta. Urheilu
in scheme: YKL - Yleisten kirjastojen luokitusjärjestelmä
notation: 79.11
scope note: Juoksu. Kävely. Heitot. Hypyt Yleisurheilun moniottelut Tähän myös juoksu ja kävely kuntoliikunnan kannalta
scope note: Löpning. Gång. Kast. Hopp Mångkamp inom friidrotten Hit också löpning och gång ur motionssynvinkel @sv

Talviurheilu
type: Concept
References: URN:NBN:fi:au:ykl:79.109
References: Ammunta
References: Jääkiekko. Jääpallo
alternative label: Alpin kombination (79.12) @sv
alternative label: Alpin skidåkning (79.12) @sv
alternative label: Alppihiihto (79.12)
alternative label: Alppiyhdistetty (79.12)
alternative label: Amatöridrott, grenvis (79.11 ... 79.7) @sv
alternative label: Amatööriurheilu, lajeittain (79.11 ... 79.7)
alternative label: Ammattilaisurheilu, lajeittain (79.11 ... 79.7)
alternative label: Ampumahiihto (79.12)
alternative label: Backhoppning (79.12) @sv
alternative label: Freestyle, hiihto (79.12)
alternative label: Fyysinen kasvatus, urheilu lajeittain (79.11 ... 79.7)
alternative label: Hiihto (79.12)
alternative label: Hiihtosuunnistus (79.12)
alternative label: Huippu-urheilu, lajeittain (79.11 ... 79.7)
alternative label: Jäähallit, urheilu (79.12)
alternative label: Jääpurjehdus (79.12)
alternative label: Jäätanssi (79.12)
alternative label: Kaunoluistelu (79.12)
alternative label: Kelkkailu (79.12)
alternative label: Kesäolympialaiset, lajeittain (79.11 ... 79.7)
alternative label: Kilpaurheilu, lajeittain (79.11 ... 79.7)
alternative label: Koreografia, taitoluistelu (79.12)
alternative label: Laskettelu (79.12)
alternative label: Liikunnanohjaus, lajeittain (79.11 ... 79.7)
alternative label: Liikunta, lajeittain (79.11 ... 79.7)
alternative label: Liikuntakasvatus, lajeittain (79.11 ... 79.7)
alternative label: Liikuntamuodot, lajeittain (79.11 ... 79.7)
alternative label: Liikuntapolitiikka, lajeittain (79.11 ... 79.7)
alternative label: Liikuntapsykologia, lajeittain (79.11 ... 79.7)
alternative label: Liikuntasosiologia, lajeittain (79.11 ... 79.7)
alternative label: Liikuntatilat, urheilu lajeittain (79.11 ... 79.7)
alternative label: Luistelu (79.12)
alternative label: Luistimet (79.12)
alternative label: Lumikenkäily (79.12)
alternative label: Lumilautailu (79.12)
alternative label: Murtomaahiihto (79.12)
alternative label: Mäkihyppy (79.12)
alternative label: Nopeuslasku (79.12)
alternative label: Olympiakisat, lajeittain (79.11 ... 79.7)
alternative label: Olympialaiset, lajeittain (79.11 ... 79.7)
alternative label: Paralympialaiset, lajeittain (79.11 ... 79.7)
alternative label: Pikaluistelu (79.12)
alternative label: Potkukelkkailu (79.12)
alternative label: Pujottelu, alppihiihto (79.12)
alternative label: Slalom (79.12)
alternative label: Stadionit, urheilu lajeittain (79.11 ... 79.7)
alternative label: Sukset, urheilu (79.12)
alternative label: Syöksylasku (79.12)
alternative label: Säännöt, urheilu lajeittain (79.11 ... 79.7)
alternative label: Taitoluistelu (79.12)
alternative label: Talviolympialaiset, lajeittain (79.12 ... 79.7)
alternative label: Talviurheilu (79.12)
alternative label: Tekojääradat (79.12)
alternative label: Urheilu, lajeittain (79.11 ... 79.7)
alternative label: Urheilualueet, urheilu lajeittain (79.11 ... 79.7)
alternative label: Urheilujärjestöt, lajeittain (79.11 ... 79.7)
alternative label: Urheilukentät, urheilu lajeittain (79.11 ... 79.7)
alternative label: Urheilukeskukset, urheilu lajeittain (79.11 ... 79.7)
alternative label: Urheilukilpailut, lajeittain (79.11 ... 79.7)
alternative label: Urheilulajit (79.11 ... 79.7)
alternative label: Urheiluopistotoiminta, lajeittain (79.11 ... 79.7)
alternative label: Urheilupolitiikka, lajeittain (79.11 ... 79.7)
alternative label: Urheilupsykologia, lajeittain (79.11 ... 79.7)
alternative label: Urheilurakennukset, urheilu lajeittain (79.11 ... 79.7)
alternative label: Urheilusosiologia, lajeittain (79.11 ... 79.7)
alternative label: Urheiluvalmennus, lajeittain (79.11 ... 79.7)
alternative label: Urheiluvälineet, lajeittain (79.11 ... 79.7)
alternative label: Vammaisolympialaiset, lajeittain (79.11 ... 79.7)
alternative label: Vapaalasku (79.12)
alternative label: Veteraaniurheilu, lajeittain (79.11 ... 79.7)
alternative label: Yhdistetty, hiihtourheilu (79.12)
broader: Liikunta. Urheilu
in scheme: YKL - Yleisten kirjastojen luokitusjärjestelmä
notation: 79.12
scope note: Hit allmänna verk om vintersport Skidlöpning. Skridskoåkning. Kälkåkning och bobsleigh. Issegling Längdåkning. Backhoppning. Nordisk kombination Skidskytte. Skidorientering Utförsåkning. Slalom. Freestyle. Störtlopp Hastighetsåkning på skridsko. Konståkning. Isdans Hit ishallar och vintersportcentra ur idrottssynvinkel Hit också skid- och skridskoåkning ur motionssynvinkel Hit också vintersportutrustning @sv
scope note: Tähän talviurheilun yleisteokset Hiihto. Luistelu. Kelkkailu. Jääpurjehdus Murtomaahiihto. Mäkihyppy. Yhdistetty Ampumahiihto. Hiihtosuunnistus Alppihiihto. Laskettelu. Freestyle. Nopeuslasku Pikaluistelu. Taitoluistelu. Jäätanssi Tähän jäähallit ja talviurheilukeskukset urheilun kannalta Tähän myös hiihto ja luistelu kuntoliikunnan kannalta Tähän myös talviurheiluvälineet

Uinti. Sukellus. Lainelautailu
type: Concept
References: Lasten terveydenhoito. Lastentaudit
References: Soutu. Melonta. Purjehdus
References: Palloilu
alternative label: Amatöridrott, grenvis (79.11 ... 79.7) @sv
alternative label: Amatööriurheilu, lajeittain (79.11 ... 79.7)
alternative label: Ammattilaisurheilu, lajeittain (79.11 ... 79.7)
alternative label: Avantouinti (79.13)
alternative label: Dykarens arbete (79.13) @sv
alternative label: Dykarutrustning (79.13) @sv
alternative label: Dyksport (79.13) @sv
alternative label: Dykteknik (79.13) @sv
alternative label: Elitidrott, grenvis (79.11 ... 79.7) @sv
alternative label: Figursimning (79.13) @sv
alternative label: Fysisk fostran, idrott grenvis (79.11 ... 79.7) @sv
alternative label: Fyysinen kasvatus, urheilu lajeittain (79.11 ... 79.7)
alternative label: Handikappolympiader, grenvis (79.11 ... 79.7) @sv
alternative label: Huippu-urheilu, lajeittain (79.11 ... 79.7)
alternative label: Idrott, grenvis (79.11 ... 79.7) @sv
alternative label: Idrottsanläggningar, idrott grenvis (79.11 ... 79.7) @sv
alternative label: Idrottsbyggnader, idrott grenvis (79.11 ... 79.7) @sv
alternative label: Idrottsgrenar (79.11 ... 79.7) @sv
alternative label: Idrottsinstitut, grenvis (79.11 ... 79.7) @sv
alternative label: Idrottsinstruktion, grenvis (79.11 ... 79.7) @sv
alternative label: Idrottsområden, idrott grenvis (79.11 ... 79.7) @sv
alternative label: Idrottsorganisationer, grenvis (79.11 ... 79.7) @sv
alternative label: Kesäolympialaiset, lajeittain (79.11 ... 79.7)
alternative label: Kilpaurheilu, lajeittain (79.11 ... 79.7)
alternative label: Kuviouinti (79.13)
alternative label: Lainelaudat (79.13)
alternative label: Lainelautailu (79.13)
alternative label: Liikunnanohjaus, lajeittain (79.11 ... 79.7)
alternative label: Liikunta, lajeittain (79.11 ... 79.7)
alternative label: Liikuntakasvatus, lajeittain (79.11 ... 79.7)
alternative label: Liikuntamuodot, lajeittain (79.11 ... 79.7)
alternative label: Liikuntapolitiikka, lajeittain (79.11 ... 79.7)
alternative label: Liikuntapsykologia, lajeittain (79.11 ... 79.7)
alternative label: Liikuntasosiologia, lajeittain (79.11 ... 79.7)
alternative label: Liikuntatilat, urheilu lajeittain (79.11 ... 79.7)
alternative label: Olympiakisat, lajeittain (79.11 ... 79.7)
alternative label: Olympialaiset, lajeittain (79.11 ... 79.7)
alternative label: Paralympialaiset, lajeittain (79.11 ... 79.7)
alternative label: Stadionit, urheilu lajeittain (79.11 ... 79.7)
alternative label: Sukellustekniikka (79.13)
alternative label: Sukellusurheilu (79.13)
alternative label: Sukellusvälineet (79.13)
alternative label: Sukeltajan työ (79.13)
alternative label: Säännöt, urheilu lajeittain (79.11 ... 79.7)
alternative label: Taitouinti (79.13)
alternative label: Talviolympialaiset, lajeittain (79.12 ... 79.7)
alternative label: Uimahallit, urheilu (79.13)
alternative label: Uimahypyt (79.13)
alternative label: Uimastadionit, urheilu (79.13)
alternative label: Uinti (79.13)
alternative label: Urheilu, lajeittain (79.11 ... 79.7)
alternative label: Urheilualueet, urheilu lajeittain (79.11 ... 79.7)
alternative label: Urheilujärjestöt, lajeittain (79.11 ... 79.7)
alternative label: Urheilukentät, urheilu lajeittain (79.11 ... 79.7)
alternative label: Urheilukeskukset, urheilu lajeittain (79.11 ... 79.7)
alternative label: Urheilukilpailut, lajeittain (79.11 ... 79.7)
alternative label: Urheilulajit (79.11 ... 79.7)
alternative label: Urheiluopistotoiminta, lajeittain (79.11 ... 79.7)
alternative label: Urheilupolitiikka, lajeittain (79.11 ... 79.7)
alternative label: Urheilupsykologia, lajeittain (79.11 ... 79.7)
alternative label: Urheilurakennukset, urheilu lajeittain (79.11 ... 79.7)
alternative label: Urheilusosiologia, lajeittain (79.11 ... 79.7)
alternative label: Urheilusukellus (79.13)
alternative label: Urheiluvalmennus, lajeittain (79.11 ... 79.7)
alternative label: Urheiluvälineet, lajeittain (79.11 ... 79.7)
alternative label: Vammaisolympialaiset, lajeittain (79.11 ... 79.7)
alternative label: Vesihiihto (79.13)
alternative label: Vesijuoksu (79.13)
alternative label: Vesiliikunta (79.13)
alternative label: Vesisukset (79.13)
alternative label: Veteraaniurheilu, lajeittain (79.11 ... 79.7)
broader: Liikunta. Urheilu
in scheme: YKL - Yleisten kirjastojen luokitusjärjestelmä
notation: 79.13
scope note: Hit också simhopp, vattenskidåkning, dykarutrustning, surfingbrädor och vattenskidor samt simhallar och simstadion ur idrottens synvinkel Hit också simning ur motionssynvinkel @sv
scope note: Tähän myös uimahypyt, vesihiihto, sukellusvälineet, lainelaudat ja vesisukset sekä uimahallit ja -stadionit urheilun kannalta Tähän myös uinti kuntoliikunnan kannalta

Soutu. Melonta. Purjehdus
type: Concept
References: Matkakuvaukset
References: Veneet
References: Vesiliikenne
References: Talviurheilu
References: Uinti. Sukellus. Lainelautailu
References: Moottoriveneurheilu
alternative label: Amatöridrott, grenvis (79.11 ... 79.7) @sv
alternative label: Amatööriurheilu, lajeittain (79.11 ... 79.7)
alternative label: Ammattilaisurheilu, lajeittain (79.11 ... 79.7)
alternative label: Brädsegling (79.14) @sv
alternative label: Båtsport, segelsport (79.14) @sv
alternative label: Elitidrott, grenvis (79.11 ... 79.7) @sv
alternative label: Forsränning (79.14) @sv
alternative label: Fysisk fostran, idrott grenvis (79.11 ... 79.7) @sv
alternative label: Fyysinen kasvatus, urheilu lajeittain (79.11 ... 79.7)
alternative label: Handikappolympiader, grenvis (79.11 ... 79.7) @sv
alternative label: Huippu-urheilu, lajeittain (79.11 ... 79.7)
alternative label: Idrott, grenvis (79.11 ... 79.7) @sv
alternative label: Idrottsanläggningar, idrott grenvis (79.11 ... 79.7) @sv
alternative label: Idrottsbyggnader, idrott grenvis (79.11 ... 79.7) @sv
alternative label: Idrottsgrenar (79.11 ... 79.7) @sv
alternative label: Idrottsinstitut, grenvis (79.11 ... 79.7) @sv
alternative label: Idrottsinstruktion, grenvis (79.11 ... 79.7) @sv
alternative label: Idrottsområden, idrott grenvis (79.11 ... 79.7) @sv
alternative label: Idrottsorganisationer, grenvis (79.11 ... 79.7) @sv
alternative label: Idrottsplaner, idrott grenvis (79.11 ... 79.7) @sv
alternative label: Idrottspolitik, grenvis (79.11 ... 79.7) @sv
alternative label: Idrottspsykologi, grenvis (79.11 ... 79.7) @sv
alternative label: Idrottssociologi, grenvis (79.11 ... 79.7) @sv
alternative label: Idrottsträning, grenvis (79.11 ... 79.7) @sv
alternative label: Idrottstävlingar, grenvis (79.11 ... 79.7) @sv
alternative label: Kesäolympialaiset, lajeittain (79.11 ... 79.7)
alternative label: Kilpaurheilu, lajeittain (79.11 ... 79.7)
alternative label: Koskenlasku (79.14)
alternative label: Liikunnanohjaus, lajeittain (79.11 ... 79.7)
alternative label: Liikunta, lajeittain (79.11 ... 79.7)
alternative label: Liikuntakasvatus, lajeittain (79.11 ... 79.7)
alternative label: Liikuntamuodot, lajeittain (79.11 ... 79.7)
alternative label: Liikuntapolitiikka, lajeittain (79.11 ... 79.7)
alternative label: Liikuntapsykologia, lajeittain (79.11 ... 79.7)
alternative label: Liikuntasosiologia, lajeittain (79.11 ... 79.7)
alternative label: Liikuntatilat, urheilu lajeittain (79.11 ... 79.7)
alternative label: Melonta (79.14)
alternative label: Motion, grenvis (79.11 ... 79.7) @sv
alternative label: Olympiakisat, lajeittain (79.11 ... 79.7)
alternative label: Olympialaiset, lajeittain (79.11 ... 79.7)
alternative label: Paralympialaiset, lajeittain (79.11 ... 79.7)
alternative label: Purjehdus, urheilu (79.14)
alternative label: Purjehdustaidot (79.14)
alternative label: Purjelaudat (79.14)
alternative label: Purjelautailu (79.14)
alternative label: Purjeveneet, purjehdusurheilu (79.14)
alternative label: Soutu (79.14)
alternative label: Stadionit, urheilu lajeittain (79.11 ... 79.7)
alternative label: Surffaus (79.14)
alternative label: Säännöt, urheilu lajeittain (79.11 ... 79.7)
alternative label: Talviolympialaiset, lajeittain (79.12 ... 79.7)
alternative label: Urheilu, lajeittain (79.11 ... 79.7)
alternative label: Urheilualueet, urheilu lajeittain (79.11 ... 79.7)
alternative label: Urheilujärjestöt, lajeittain (79.11 ... 79.7)
alternative label: Urheilukentät, urheilu lajeittain (79.11 ... 79.7)
alternative label: Urheilukeskukset, urheilu lajeittain (79.11 ... 79.7)
alternative label: Urheilukilpailut, lajeittain (79.11 ... 79.7)
alternative label: Urheilulajit (79.11 ... 79.7)
alternative label: Urheiluopistotoiminta, lajeittain (79.11 ... 79.7)
alternative label: Urheilupolitiikka, lajeittain (79.11 ... 79.7)
alternative label: Urheilupsykologia, lajeittain (79.11 ... 79.7)
alternative label: Urheilurakennukset, urheilu lajeittain (79.11 ... 79.7)
alternative label: Urheilusosiologia, lajeittain (79.11 ... 79.7)
alternative label: Urheiluvalmennus, lajeittain (79.11 ... 79.7)
alternative label: Urheiluvälineet, lajeittain (79.11 ... 79.7)
alternative label: Vammaisolympialaiset, lajeittain (79.11 ... 79.7)
alternative label: Veneily, purjehdusurheilu (79.14)
alternative label: Veteraaniurheilu, lajeittain (79.11 ... 79.7)
broader: Liikunta. Urheilu
in scheme: YKL - Yleisten kirjastojen luokitusjärjestelmä
notation: 79.14
scope note: Purjehduskilpailut. Purjehdustaidot Tähän myös purjelautailu ja purjelaudat Tähän myös soutu ja melonta kuntoliikunnan kannalta Jos teoksessa on sekä purjehdusta että merimatkan kuvausta, annetaan etusija luokalle 40.8 Jos teos koskee sekä soutua, melontaa tai purjehdusta että veneitä, annetaan etusija luokalle 79.14
scope note: Seglingstävlingar. Segelkunskap Hit också brädsegling och segelbrädor Hit också rodd och paddling ur motionssynvinkel Om verket innehåller både segling och sjöresor ges företräde åt klass 40.8 Om verket behandlar rodd, paddling eller segling och båtar, ges företräde åt klass 79.14 @sv

Hevosurheilu. Ratsastus
type: Concept
References: Hevosten hoito
References: Arpajaiset. Veikkaus. Uhkapeli
alternative label: Amatöridrott, grenvis (79.11 ... 79.7) @sv
alternative label: Amatööriurheilu, lajeittain (79.11 ... 79.7)
alternative label: Ammattilaisurheilu, lajeittain (79.11 ... 79.7)
alternative label: Banhoppning (79.15) @sv
alternative label: Elitidrott, grenvis (79.11 ... 79.7) @sv
alternative label: Esteratsastus (79.15)
alternative label: Fysisk fostran, idrott grenvis (79.11 ... 79.7) @sv
alternative label: Fyysinen kasvatus, urheilu lajeittain (79.11 ... 79.7)
alternative label: Galopptävlingar (79.15) @sv
alternative label: Handikappolympiader, grenvis (79.11 ... 79.7) @sv
alternative label: Hevoset, ratsastus (79.15)
alternative label: Hevoset, raviurheilu (79.15)
alternative label: Hevosurheilu (79.15)
alternative label: Huippu-urheilu, lajeittain (79.11 ... 79.7)
alternative label: Hästar, ridning (79.15) @sv
alternative label: Hästar, travsport (79.15) @sv
alternative label: Hästsport (79.15) @sv
alternative label: Idrott, grenvis (79.11 ... 79.7) @sv
alternative label: Idrottsanläggningar, idrott grenvis (79.11 ... 79.7) @sv
alternative label: Idrottsbyggnader, idrott grenvis (79.11 ... 79.7) @sv
alternative label: Idrottsgrenar (79.11 ... 79.7) @sv
alternative label: Idrottsinstitut, grenvis (79.11 ... 79.7) @sv
alternative label: Idrottsinstruktion, grenvis (79.11 ... 79.7) @sv
alternative label: Idrottsområden, idrott grenvis (79.11 ... 79.7) @sv
alternative label: Idrottsorganisationer, grenvis (79.11 ... 79.7) @sv
alternative label: Idrottsplaner, idrott grenvis (79.11 ... 79.7) @sv
alternative label: Idrottspolitik, grenvis (79.11 ... 79.7) @sv
alternative label: Idrottspsykologi, grenvis (79.11 ... 79.7) @sv
alternative label: Idrottssociologi, grenvis (79.11 ... 79.7) @sv
alternative label: Idrottsträning, grenvis (79.11 ... 79.7) @sv
alternative label: Idrottstävlingar, grenvis (79.11 ... 79.7) @sv
alternative label: Kesäolympialaiset, lajeittain (79.11 ... 79.7)
alternative label: Kilpa-ajot, hevosurheilu (79.15)
alternative label: Kilpaurheilu, lajeittain (79.11 ... 79.7)
alternative label: Kouluratsastus (79.15)
alternative label: Laukkakilpailut (79.15)
alternative label: Liikunnanohjaus, lajeittain (79.11 ... 79.7)
alternative label: Liikunta, lajeittain (79.11 ... 79.7)
alternative label: Liikuntakasvatus, lajeittain (79.11 ... 79.7)
alternative label: Liikuntamuodot, lajeittain (79.11 ... 79.7)
alternative label: Liikuntapolitiikka, lajeittain (79.11 ... 79.7)
alternative label: Liikuntapsykologia, lajeittain (79.11 ... 79.7)
alternative label: Liikuntasosiologia, lajeittain (79.11 ... 79.7)
alternative label: Liikuntatilat, urheilu lajeittain (79.11 ... 79.7)
alternative label: Motion, grenvis (79.11 ... 79.7) @sv
alternative label: Motionsformer, grenvis (79.11 ... 79.7) @sv
alternative label: Olympiakisat, lajeittain (79.11 ... 79.7)
alternative label: Olympialaiset, lajeittain (79.11 ... 79.7)
alternative label: Paralympialaiset, lajeittain (79.11 ... 79.7)
alternative label: Ratsastus (79.15)
alternative label: Raviurheilu (79.15)
alternative label: Rodeo (79.15)
alternative label: Satulat, ratsastus (79.15)
alternative label: Stadionit, urheilu lajeittain (79.11 ... 79.7)
alternative label: Säännöt, urheilu lajeittain (79.11 ... 79.7)
alternative label: Talviolympialaiset, lajeittain (79.12 ... 79.7)
alternative label: Urheilu, lajeittain (79.11 ... 79.7)
alternative label: Urheilualueet, urheilu lajeittain (79.11 ... 79.7)
alternative label: Urheilujärjestöt, lajeittain (79.11 ... 79.7)
alternative label: Urheilukentät, urheilu lajeittain (79.11 ... 79.7)
alternative label: Urheilukeskukset, urheilu lajeittain (79.11 ... 79.7)
alternative label: Urheilukilpailut, lajeittain (79.11 ... 79.7)
alternative label: Urheilulajit (79.11 ... 79.7)
alternative label: Urheiluopistotoiminta, lajeittain (79.11 ... 79.7)
alternative label: Urheilupolitiikka, lajeittain (79.11 ... 79.7)
alternative label: Urheilupsykologia, lajeittain (79.11 ... 79.7)
alternative label: Urheilurakennukset, urheilu lajeittain (79.11 ... 79.7)
alternative label: Urheilusosiologia, lajeittain (79.11 ... 79.7)
alternative label: Urheiluvalmennus, lajeittain (79.11 ... 79.7)
alternative label: Urheiluvälineet, lajeittain (79.11 ... 79.7)
alternative label: Vammaisolympialaiset, lajeittain (79.11 ... 79.7)
alternative label: Veteraaniurheilu, lajeittain (79.11 ... 79.7)
broader: Liikunta. Urheilu
in scheme: YKL - Yleisten kirjastojen luokitusjärjestelmä
notation: 79.15
scope note: Banhoppning. Dressyrritt. Galopp- och travsport. Rodeo Ridutrustning Om verket innehåller antingen hästsport eller ritt och hästskötsel, ges företräde åt klass 67.41 @sv
scope note: Esteratsastus. Kouluratsastus. Laukka- ja raviurheilu. Rodeo Ratsastusvälineet Jos teoksessa on sekä hevosurheilua tai ratsastusta että hevosten hoitoa, annetaan etusija luokalle 67.41

Miekkailu
type: Concept
References: URN:NBN:fi:au:ykl:39.109
alternative label: Amatöridrott, grenvis (79.11 ... 79.7) @sv
alternative label: Amatööriurheilu, lajeittain (79.11 ... 79.7)
alternative label: Ammattilaisurheilu, lajeittain (79.11 ... 79.7)
alternative label: Elitidrott, grenvis (79.11 ... 79.7) @sv
alternative label: Florettfäktning (79.16) @sv
alternative label: Florettimiekkailu (79.16)
alternative label: Fysisk fostran, idrott grenvis (79.11 ... 79.7) @sv
alternative label: Fyysinen kasvatus, urheilu lajeittain (79.11 ... 79.7)
alternative label: Fäktning (79.16) @sv
alternative label: Handikappolympiader, grenvis (79.11 ... 79.7) @sv
alternative label: Huippu-urheilu, lajeittain (79.11 ... 79.7)
alternative label: Idrott, grenvis (79.11 ... 79.7) @sv
alternative label: Idrottsanläggningar, idrott grenvis (79.11 ... 79.7) @sv
alternative label: Idrottsbyggnader, idrott grenvis (79.11 ... 79.7) @sv
alternative label: Idrottsgrenar (79.11 ... 79.7) @sv
alternative label: Idrottsinstitut, grenvis (79.11 ... 79.7) @sv
alternative label: Idrottsinstruktion, grenvis (79.11 ... 79.7) @sv
alternative label: Idrottsområden, idrott grenvis (79.11 ... 79.7) @sv
alternative label: Idrottsorganisationer, grenvis (79.11 ... 79.7) @sv
alternative label: Idrottsplaner, idrott grenvis (79.11 ... 79.7) @sv
alternative label: Idrottspolitik, grenvis (79.11 ... 79.7) @sv
alternative label: Idrottspsykologi, grenvis (79.11 ... 79.7) @sv
alternative label: Idrottssociologi, grenvis (79.11 ... 79.7) @sv
alternative label: Idrottsträning, grenvis (79.11 ... 79.7) @sv
alternative label: Idrottstävlingar, grenvis (79.11 ... 79.7) @sv
alternative label: Kalpamiekkailu (79.16)
alternative label: Kendo (79.16)
alternative label: Kesäolympialaiset, lajeittain (79.11 ... 79.7)
alternative label: Kilpaurheilu, lajeittain (79.11 ... 79.7)
alternative label: Liikunnanohjaus, lajeittain (79.11 ... 79.7)
alternative label: Liikunta, lajeittain (79.11 ... 79.7)
alternative label: Liikuntakasvatus, lajeittain (79.11 ... 79.7)
alternative label: Liikuntamuodot, lajeittain (79.11 ... 79.7)
alternative label: Liikuntapolitiikka, lajeittain (79.11 ... 79.7)
alternative label: Liikuntapsykologia, lajeittain (79.11 ... 79.7)
alternative label: Liikuntasosiologia, lajeittain (79.11 ... 79.7)
alternative label: Liikuntatilat, urheilu lajeittain (79.11 ... 79.7)
alternative label: Miekkailu (79.16)
alternative label: Motion, grenvis (79.11 ... 79.7) @sv
alternative label: Motionsformer, grenvis (79.11 ... 79.7) @sv
alternative label: Olympiad, grenvis (79.11 ... 79.7) @sv
alternative label: Olympiakisat, lajeittain (79.11 ... 79.7)
alternative label: Olympialaiset, lajeittain (79.11 ... 79.7)
alternative label: Olympiska spelen, grenvis (79.11 ... 79.7) @sv
alternative label: Paralympiader, grenvis (79.11 ... 79.7) @sv
alternative label: Paralympialaiset, lajeittain (79.11 ... 79.7)
alternative label: Professionell idrott, grenvis (79.11 ... 79.7) @sv
alternative label: Regler, idrott grenvis (79.11 ... 79.7) @sv
alternative label: Sabelfäktning (79.16) @sv
alternative label: Sommarolympiader, grenvis (79.11 ... 79.7) @sv
alternative label: Sportartiklar, grenvis (79.11 ... 79.7) @sv
alternative label: Sportcentra, idrott grenvis (79.11 ... 79.7) @sv
alternative label: Stadion, sport grenvis (79.11 ... 79.7) @sv
alternative label: Stadionit, urheilu lajeittain (79.11 ... 79.7)
alternative label: Säilämiekkailu (79.16)
alternative label: Säännöt, urheilu lajeittain (79.11 ... 79.7)
alternative label: Talviolympialaiset, lajeittain (79.12 ... 79.7)
alternative label: Urheilu, lajeittain (79.11 ... 79.7)
alternative label: Urheilualueet, urheilu lajeittain (79.11 ... 79.7)
alternative label: Urheilujärjestöt, lajeittain (79.11 ... 79.7)
alternative label: Urheilukentät, urheilu lajeittain (79.11 ... 79.7)
alternative label: Urheilukeskukset, urheilu lajeittain (79.11 ... 79.7)
alternative label: Urheilukilpailut, lajeittain (79.11 ... 79.7)
alternative label: Urheilulajit (79.11 ... 79.7)
alternative label: Urheiluopistotoiminta, lajeittain (79.11 ... 79.7)
alternative label: Urheilupolitiikka, lajeittain (79.11 ... 79.7)
alternative label: Urheilupsykologia, lajeittain (79.11 ... 79.7)
alternative label: Urheilurakennukset, urheilu lajeittain (79.11 ... 79.7)
alternative label: Urheilusosiologia, lajeittain (79.11 ... 79.7)
alternative label: Urheiluvalmennus, lajeittain (79.11 ... 79.7)
alternative label: Urheiluvälineet, lajeittain (79.11 ... 79.7)
alternative label: Vammaisolympialaiset, lajeittain (79.11 ... 79.7)
alternative label: Veteraaniurheilu, lajeittain (79.11 ... 79.7)
broader: Liikunta. Urheilu
in scheme: YKL - Yleisten kirjastojen luokitusjärjestelmä
notation: 79.16
scope note: Fäktning med sabel, värja och florett Hit också kendo @sv
scope note: Säilä-, kalpa- ja florettimiekkailu Tähän myös kendo

Ammunta
type: Concept
References: Aseistus. Asevarustelu. Asekauppa
References: Metsästys
References: Talviurheilu
alternative label: Amatöridrott, grenvis (79.11 ... 79.7) @sv
alternative label: Amatööriurheilu, lajeittain (79.11 ... 79.7)
alternative label: Ammattilaisurheilu, lajeittain (79.11 ... 79.7)
alternative label: Ammunta (79.17)
alternative label: Ampuma-aseet, urheilu (79.17)
alternative label: Ampumaradat (79.17)
alternative label: Ampumaurheilu (79.17)
alternative label: Aseet, urheilu (79.17)
alternative label: Bågskytte (79.17) @sv
alternative label: Elitidrott, grenvis (79.11 ... 79.7) @sv
alternative label: Fysisk fostran, idrott grenvis (79.11 ... 79.7) @sv
alternative label: Fyysinen kasvatus, urheilu lajeittain (79.11 ... 79.7)
alternative label: Gevärsskytte (79.17) @sv
alternative label: Hagelgevärsskytte (79.17) @sv
alternative label: Handikappolympiader, grenvis (79.11 ... 79.7) @sv
alternative label: Haulikkoammunta (79.17)
alternative label: Huippu-urheilu, lajeittain (79.11 ... 79.7)
alternative label: Idrott, grenvis (79.11 ... 79.7) @sv
alternative label: Idrottsanläggningar, idrott grenvis (79.11 ... 79.7) @sv
alternative label: Idrottsbyggnader, idrott grenvis (79.11 ... 79.7) @sv
alternative label: Idrottsgrenar (79.11 ... 79.7) @sv
alternative label: Idrottsinstitut, grenvis (79.11 ... 79.7) @sv
alternative label: Idrottsinstruktion, grenvis (79.11 ... 79.7) @sv
alternative label: Idrottsområden, idrott grenvis (79.11 ... 79.7) @sv
alternative label: Idrottsorganisationer, grenvis (79.11 ... 79.7) @sv
alternative label: Idrottsplaner, idrott grenvis (79.11 ... 79.7) @sv
alternative label: Idrottspolitik, grenvis (79.11 ... 79.7) @sv
alternative label: Idrottspsykologi, grenvis (79.11 ... 79.7) @sv
alternative label: Idrottssociologi, grenvis (79.11 ... 79.7) @sv
alternative label: Idrottsträning, grenvis (79.11 ... 79.7) @sv
alternative label: Idrottstävlingar, grenvis (79.11 ... 79.7) @sv
alternative label: Jousiammunta (79.17)
alternative label: Kesäolympialaiset, lajeittain (79.11 ... 79.7)
alternative label: Kilpaurheilu, lajeittain (79.11 ... 79.7)
alternative label: Kivääriammunta (79.17)
alternative label: Kyudo (79.17)
alternative label: Liikunnanohjaus, lajeittain (79.11 ... 79.7)
alternative label: Liikunta, lajeittain (79.11 ... 79.7)
alternative label: Liikuntakasvatus, lajeittain (79.11 ... 79.7)
alternative label: Liikuntamuodot, lajeittain (79.11 ... 79.7)
alternative label: Liikuntapolitiikka, lajeittain (79.11 ... 79.7)
alternative label: Liikuntapsykologia, lajeittain (79.11 ... 79.7)
alternative label: Liikuntasosiologia, lajeittain (79.11 ... 79.7)
alternative label: Liikuntatilat, urheilu lajeittain (79.11 ... 79.7)
alternative label: Motion, grenvis (79.11 ... 79.7) @sv
alternative label: Motionsformer, grenvis (79.11 ... 79.7) @sv
alternative label: Olympiad, grenvis (79.11 ... 79.7) @sv
alternative label: Olympiakisat, lajeittain (79.11 ... 79.7)
alternative label: Olympialaiset, lajeittain (79.11 ... 79.7)
alternative label: Paralympialaiset, lajeittain (79.11 ... 79.7)
alternative label: Pistooliammunta (79.17)
alternative label: Skeet-ammunta (79.17)
alternative label: Stadionit, urheilu lajeittain (79.11 ... 79.7)
alternative label: Säännöt, urheilu lajeittain (79.11 ... 79.7)
alternative label: Talviolympialaiset, lajeittain (79.12 ... 79.7)
alternative label: Urheilu, lajeittain (79.11 ... 79.7)
alternative label: Urheilualueet, urheilu lajeittain (79.11 ... 79.7)
alternative label: Urheilujärjestöt, lajeittain (79.11 ... 79.7)
alternative label: Urheilukentät, urheilu lajeittain (79.11 ... 79.7)
alternative label: Urheilukeskukset, urheilu lajeittain (79.11 ... 79.7)
alternative label: Urheilukilpailut, lajeittain (79.11 ... 79.7)
alternative label: Urheilulajit (79.11 ... 79.7)
alternative label: Urheiluopistotoiminta, lajeittain (79.11 ... 79.7)
alternative label: Urheilupolitiikka, lajeittain (79.11 ... 79.7)
alternative label: Urheilupsykologia, lajeittain (79.11 ... 79.7)
alternative label: Urheilurakennukset, urheilu lajeittain (79.11 ... 79.7)
alternative label: Urheilusosiologia, lajeittain (79.11 ... 79.7)
alternative label: Urheiluvalmennus, lajeittain (79.11 ... 79.7)
alternative label: Urheiluvälineet, lajeittain (79.11 ... 79.7)
alternative label: Vammaisolympialaiset, lajeittain (79.11 ... 79.7)
alternative label: Veteraaniurheilu, lajeittain (79.11 ... 79.7)
broader: Liikunta. Urheilu
in scheme: YKL - Yleisten kirjastojen luokitusjärjestelmä
notation: 79.17
scope note: Gevärs-, pistol-, hagelgevärs- och bågskytte Hit också kyudo Hit också vapen ur sportskyttets synvinkel @sv
scope note: Kivääri-, pistooli-, haulikko- ja jousiammunta Tähän myös kyudo Tähän myös aseet ampumaurheilun kannalta

Voimailu. Kehonrakennus. Fitness-urheilu
type: Concept
References: Kuntoliikunta. Kuntourheilu
alternative label: Amatöridrott, grenvis (79.11 ... 79.7) @sv
alternative label: Amatööriurheilu, lajeittain (79.11 ... 79.7)
alternative label: Ammattilaisurheilu, lajeittain (79.11 ... 79.7)
alternative label: Atletiikka (79.18+)
alternative label: Atletik (79.18+) @sv
alternative label: Bodaus (79.18)
alternative label: Bodybuilding (79.18)
alternative label: Crossfit (79.18)
alternative label: Elitidrott, grenvis (79.11 ... 79.7) @sv
alternative label: Faromoment, självförsvar (79.18+) @sv
alternative label: Fitness-sport (79.18) @sv
alternative label: Fitness-urheilu (79.18)
alternative label: Fysisk fostran, idrott grenvis (79.11 ... 79.7) @sv
alternative label: Fyysinen kasvatus, urheilu lajeittain (79.11 ... 79.7)
alternative label: Handikappolympiader, grenvis (79.11 ... 79.7) @sv
alternative label: Henkiinjäämisoppaat, itsepuolustus (79.18+)
alternative label: Huippu-urheilu, lajeittain (79.11 ... 79.7)
alternative label: Idrott, grenvis (79.11 ... 79.7) @sv
alternative label: Idrottsanläggningar, idrott grenvis (79.11 ... 79.7) @sv
alternative label: Idrottsbyggnader, idrott grenvis (79.11 ... 79.7) @sv
alternative label: Idrottsgrenar (79.11 ... 79.7) @sv
alternative label: Idrottsinstitut, grenvis (79.11 ... 79.7) @sv
alternative label: Idrottsinstruktion, grenvis (79.11 ... 79.7) @sv
alternative label: Idrottsområden, idrott grenvis (79.11 ... 79.7) @sv
alternative label: Idrottsorganisationer, grenvis (79.11 ... 79.7) @sv
alternative label: Idrottsplaner, idrott grenvis (79.11 ... 79.7) @sv
alternative label: Idrottspolitik, grenvis (79.11 ... 79.7) @sv
alternative label: Idrottspsykologi, grenvis (79.11 ... 79.7) @sv
alternative label: Kahvakuulat (79.18)
alternative label: Kahvakuulaurheilu (79.18)
alternative label: Kehonrakennus (79.18)
alternative label: Kesäolympialaiset, lajeittain (79.11 ... 79.7)
alternative label: Kilpaurheilu, lajeittain (79.11 ... 79.7)
alternative label: Lihasharjoittelu (79.18+)
alternative label: Liikunnanohjaus, lajeittain (79.11 ... 79.7)
alternative label: Liikunta, lajeittain (79.11 ... 79.7)
alternative label: Liikuntakasvatus, lajeittain (79.11 ... 79.7)
alternative label: Liikuntamuodot, lajeittain (79.11 ... 79.7)
alternative label: Liikuntapolitiikka, lajeittain (79.11 ... 79.7)
alternative label: Liikuntapsykologia, lajeittain (79.11 ... 79.7)
alternative label: Liikuntasosiologia, lajeittain (79.11 ... 79.7)
alternative label: Liikuntatilat, urheilu lajeittain (79.11 ... 79.7)
alternative label: Olympiakisat, lajeittain (79.11 ... 79.7)
alternative label: Olympialaiset, lajeittain (79.11 ... 79.7)
alternative label: Paralympialaiset, lajeittain (79.11 ... 79.7)
alternative label: Selviytymisoppaat, itsepuolustus (79.18+)
alternative label: Stadionit, urheilu lajeittain (79.11 ... 79.7)
alternative label: Säännöt, urheilu lajeittain (79.11 ... 79.7)
alternative label: Talviolympialaiset, lajeittain (79.12 ... 79.7)
alternative label: Urheilu, lajeittain (79.11 ... 79.7)
alternative label: Urheilualueet, urheilu lajeittain (79.11 ... 79.7)
alternative label: Urheilujärjestöt, lajeittain (79.11 ... 79.7)
alternative label: Urheilukentät, urheilu lajeittain (79.11 ... 79.7)
alternative label: Urheilukeskukset, urheilu lajeittain (79.11 ... 79.7)
alternative label: Urheilukilpailut, lajeittain (79.11 ... 79.7)
alternative label: Urheilulajit (79.11 ... 79.7)
alternative label: Urheiluopistotoiminta, lajeittain (79.11 ... 79.7)
alternative label: Urheilupolitiikka, lajeittain (79.11 ... 79.7)
alternative label: Urheilupsykologia, lajeittain (79.11 ... 79.7)
alternative label: Urheilurakennukset, urheilu lajeittain (79.11 ... 79.7)
alternative label: Urheilusosiologia, lajeittain (79.11 ... 79.7)
alternative label: Urheiluvalmennus, lajeittain (79.11 ... 79.7)
alternative label: Urheiluvälineet, lajeittain (79.11 ... 79.7)
alternative label: Vaaratilanteet, itsepuolustus (79.18+)
alternative label: Vammaisolympialaiset, lajeittain (79.11 ... 79.7)
alternative label: Vapaaottelu (79.18)
alternative label: Veteraaniurheilu, lajeittain (79.11 ... 79.7)
alternative label: Voimaharjoittelu (79.18+)
alternative label: Voimailu (79.18+)
broader: Liikunta. Urheilu
in scheme: YKL - Yleisten kirjastojen luokitusjärjestelmä
narrower: Itämaisperäiset lajit ja kamppailulajit
narrower: Paini
narrower: Nyrkkeily
narrower: Painonnosto
notation: 79.18
scope note: Hit allmänna verk om bodybuilding och fitness-sport Hit och till underklasserna också kraftsport ur motionssynvinkel @sv
scope note: Tähän kehonrakennuksen ja fitness-urheilun yleisteokset Tähän ja alaluokkiin myös voimailu kuntoliikunnan kannalta

Itämaisperäiset lajit ja kamppailulajit
type: Concept
References: Itämainen filosofia
References: Miekkailu
References: Ammunta
References: Paini
type: YKL-luokka
alternative label: Aikido (79.181)
alternative label: Budo (79.181)
alternative label: Itsepuolustus (79.181)
alternative label: Itsepuolustuslajit (79.181)
alternative label: Itämaiset itsepuolustusjärjestelmät (79.181)
alternative label: Jiu-jitsu (79.181)
alternative label: Jiujitsu (79.181) @sv
alternative label: Ju-jutsu (79.181)
alternative label: Judo (79.181)
alternative label: Kamppailulajit (79.181)
alternative label: Kampsporter (79.181) @sv
alternative label: Karate (79.181)
alternative label: Kickboxning (79.181) @sv
alternative label: Potkunyrkkeily (79.181)
alternative label: Självförsvar (79.181) @sv
alternative label: Självförsvarsgrenar (79.181) @sv
alternative label: Taekwondo (79.181)
alternative label: Taichi (79.181)
alternative label: Taido (79.181)
alternative label: Taiji (79.181)
alternative label: Thaiboxning (79.181) @sv
alternative label: Thainyrkkeily (79.181)
alternative label: Österländska självförsvarsmetoder (79.181) @sv
broader: Voimailu. Kehonrakennus. Fitness-urheilu
in scheme: YKL - Yleisten kirjastojen luokitusjärjestelmä
notation: 79.181
preferred label: Grenar av österländskt ursprung och kampsporter @sv
preferred label: Martial arts @en
scope note: Itsepuolustuslajit yleensä. Aikido. Jiu-jitsu. Judo. Karate. Taekwondo. Taiji. Krav maga
scope note: Självförsvarsgrenar i allmänhet. Aikido. Jiu-jitsu. Judo. Karate. Taekwon-do. Tai-chi. Krav maga @sv

Paini
type: Concept
type: YKL-luokka
alternative label: Brottning (79.182) @sv
alternative label: Fribrottning (79.182) @sv
alternative label: Grekisk-romersk brottning (79.182) @sv
alternative label: Kreikkalais-roomalainen paini (79.182)
alternative label: Paini (79.182)
alternative label: Sumo (79.182)
alternative label: Vapaapaini (79.182)
broader: Voimailu. Kehonrakennus. Fitness-urheilu
in scheme: YKL - Yleisten kirjastojen luokitusjärjestelmä
notation: 79.182
preferred label: Brottning @sv
preferred label: Wrestling @en
scope note: Grekisk-romersk brottning. Fribrottning Hit också sumo @sv
scope note: Kreikkalais-roomalainen paini. Vapaapaini Tähän myös sumo

Nyrkkeily
type: Concept
type: YKL-luokka
alternative label: Boxning (79.183) @sv
alternative label: Konditionsboxning (79.183) @sv
alternative label: Kuntonyrkkeily (79.183)
alternative label: Nyrkkeily (79.183)
broader: Voimailu. Kehonrakennus. Fitness-urheilu
in scheme: YKL - Yleisten kirjastojen luokitusjärjestelmä
notation: 79.183
preferred label: Boxing @en
preferred label: Boxning @sv

Painonnosto
type: Concept
type: YKL-luokka
alternative label: Painonnosto (79.184)
alternative label: Styrkelyft (79.184) @sv
alternative label: Tyngdlyftning (79.184) @sv
alternative label: Voimanosto (79.184)
broader: Voimailu. Kehonrakennus. Fitness-urheilu
in scheme: YKL - Yleisten kirjastojen luokitusjärjestelmä
notation: 79.184
preferred label: Tyngdlyftning @sv
preferred label: Weight-lifting @en
scope note: Hit också styrkelyft @sv
scope note: Tähän myös voimanosto

Pyöräily
type: Concept
References: Polkupyörät
References: Maaliikenne
alternative label: Amatöridrott, grenvis (79.11 ... 79.7) @sv
alternative label: Amatööriurheilu, lajeittain (79.11 ... 79.7)
alternative label: Ammattilaisurheilu, lajeittain (79.11 ... 79.7)
alternative label: Banåkning, cykling (79.19) @sv
alternative label: Cykelsport (79.19) @sv
alternative label: Cykelutfärder (79.19) @sv
alternative label: Cykelåkning (79.19) @sv
alternative label: Cykling (79.19) @sv
alternative label: Elitidrott, grenvis (79.11 ... 79.7) @sv
alternative label: Fysisk fostran, idrott grenvis (79.11 ... 79.7) @sv
alternative label: Fyysinen kasvatus, urheilu lajeittain (79.11 ... 79.7)
alternative label: Handikappolympiader, grenvis (79.11 ... 79.7) @sv
alternative label: Huippu-urheilu, lajeittain (79.11 ... 79.7)
alternative label: Idrott, grenvis (79.11 ... 79.7) @sv
alternative label: Idrottsanläggningar, idrott grenvis (79.11 ... 79.7) @sv
alternative label: Idrottsbyggnader, idrott grenvis (79.11 ... 79.7) @sv
alternative label: Idrottsgrenar (79.11 ... 79.7) @sv
alternative label: Idrottsinstitut, grenvis (79.11 ... 79.7) @sv
alternative label: Idrottsinstruktion, grenvis (79.11 ... 79.7) @sv
alternative label: Idrottsområden, idrott grenvis (79.11 ... 79.7) @sv
alternative label: Idrottsorganisationer, grenvis (79.11 ... 79.7) @sv
alternative label: Idrottsplaner, idrott grenvis (79.11 ... 79.7) @sv
alternative label: Idrottspolitik, grenvis (79.11 ... 79.7) @sv
alternative label: Idrottspsykologi, grenvis (79.11 ... 79.7) @sv
alternative label: Idrottssociologi, grenvis (79.11 ... 79.7) @sv
alternative label: Idrottsträning, grenvis (79.11 ... 79.7) @sv
alternative label: Idrottstävlingar, grenvis (79.11 ... 79.7) @sv
alternative label: Kesäolympialaiset, lajeittain (79.11 ... 79.7)
alternative label: Kilpapyöräily (79.19)
alternative label: Kilpaurheilu, lajeittain (79.11 ... 79.7)
alternative label: Landsvägscykling (79.19) @sv
alternative label: Liikunnanohjaus, lajeittain (79.11 ... 79.7)
alternative label: Liikunta, lajeittain (79.11 ... 79.7)
alternative label: Liikuntakasvatus, lajeittain (79.11 ... 79.7)
alternative label: Liikuntamuodot, lajeittain (79.11 ... 79.7)
alternative label: Liikuntapolitiikka, lajeittain (79.11 ... 79.7)
alternative label: Liikuntapsykologia, lajeittain (79.11 ... 79.7)
alternative label: Liikuntasosiologia, lajeittain (79.11 ... 79.7)
alternative label: Liikuntatilat, urheilu lajeittain (79.11 ... 79.7)
alternative label: Maantiepyöräily (79.19)
alternative label: Maastoajo, pyöräily (79.19)
alternative label: Maastopyöräily (79.19)
alternative label: Motion, grenvis (79.11 ... 79.7) @sv
alternative label: Motionsformer, grenvis (79.11 ... 79.7) @sv
alternative label: Olympiad, grenvis (79.11 ... 79.7) @sv
alternative label: Olympiakisat, lajeittain (79.11 ... 79.7)
alternative label: Olympialaiset, lajeittain (79.11 ... 79.7)
alternative label: Paralympialaiset, lajeittain (79.11 ... 79.7)
alternative label: Polkupyöräily (79.19)
alternative label: Pyöräily (79.19)
alternative label: Pyöräretkeily (79.19)
alternative label: Ratapyöräily (79.19)
alternative label: Stadionit, urheilu lajeittain (79.11 ... 79.7)
alternative label: Säännöt, urheilu lajeittain (79.11 ... 79.7)
alternative label: Talviolympialaiset, lajeittain (79.12 ... 79.7)
alternative label: Urheilu, lajeittain (79.11 ... 79.7)
alternative label: Urheilualueet, urheilu lajeittain (79.11 ... 79.7)
alternative label: Urheilujärjestöt, lajeittain (79.11 ... 79.7)
alternative label: Urheilukentät, urheilu lajeittain (79.11 ... 79.7)
alternative label: Urheilukeskukset, urheilu lajeittain (79.11 ... 79.7)
alternative label: Urheilukilpailut, lajeittain (79.11 ... 79.7)
alternative label: Urheilulajit (79.11 ... 79.7)
alternative label: Urheiluopistotoiminta, lajeittain (79.11 ... 79.7)
alternative label: Urheilupolitiikka, lajeittain (79.11 ... 79.7)
alternative label: Urheilupsykologia, lajeittain (79.11 ... 79.7)
alternative label: Urheilurakennukset, urheilu lajeittain (79.11 ... 79.7)
alternative label: Urheilusosiologia, lajeittain (79.11 ... 79.7)
alternative label: Urheiluvalmennus, lajeittain (79.11 ... 79.7)
alternative label: Urheiluvälineet, lajeittain (79.11 ... 79.7)
alternative label: Vammaisolympialaiset, lajeittain (79.11 ... 79.7)
alternative label: Velodromit, ratapyöräily (79.19)
alternative label: Veteraaniurheilu, lajeittain (79.11 ... 79.7)
broader: Liikunta. Urheilu
in scheme: YKL - Yleisten kirjastojen luokitusjärjestelmä
notation: 79.19
scope note: Cykelutfärder. Tävlingscykling Landsvägscykling. Banåkning. Terrängcykling Om verket behandlar både cykling och cyklar ges företräde åt klass 79.19 @sv
scope note: Pyöräretkeily. Kilpapyöräily Maantiepyöräily. Ratapyöräily. Maastopyöräily Jos teos koskee sekä pyöräilyä että polkupyöriä, annetaan etusija luokalle 79.19

Voimistelu
type: Concept
References: Fysioterapia. Fysiologiset hoitomuodot
References: Raskaus. Sikiönkehitys. Synnytys
References: Seuratanssit. Tanssiurheilu
References: Leikit
References: Sirkus
type: YKL-luokka
alternative label: Aerobic (79.2)
alternative label: Akrobatia, voimistelu (79.2)
alternative label: Akrobatik, gymnastik (79.2) @sv
alternative label: Cheerleading (79.2)
alternative label: Dagböcker, idrottare (79.1 ... 79.7) @sv
alternative label: Dagböcker, idrottare, forskning (79.1 ... 79.7) @sv
alternative label: Gymnastik (79.2) @sv
alternative label: Gymnastik, sport (79.2) @sv
alternative label: Harrastukset, urheilu (79.1 ... 79.7)
alternative label: Hobbyer, idrott (79.1 ... 79.7) @sv
alternative label: Koreografi, gymnastik (79.2) @sv
alternative label: Koreografi, redskapsgymnastik (79.2) @sv
alternative label: Koreografia, taitovoimistelu (79.2)
alternative label: Koreografia, voimistelu (79.2)
alternative label: Kuntoilu, voimistelu (79.2)
alternative label: Kuntoliikunta, voimistelu (79.2)
alternative label: Kuntourheilu, voimistelu (79.2)
alternative label: Kuntovoimistelu (79.2)
alternative label: Mor och barn -gymnastik (79.2) @sv
alternative label: Motion, gymnastik (79.2) @sv
alternative label: Motionsgymnastik (79.2) @sv
alternative label: Motionsidrott, gymnastik (79.2) @sv
alternative label: Motionssport, gymnastik (79.2) @sv
alternative label: Musiikkiliikunta (79.2)
alternative label: Musiikkiliikunta, voimistelu (79.2)
alternative label: Musikgymnastik (79.2) @sv
alternative label: Musikgymnastik, gymnastik (79.2) @sv
alternative label: Pausgymnastik (79.2) @sv
alternative label: Pilates-menetelmä (79.2)
alternative label: Pilatesmetoden (79.2) @sv
alternative label: Päiväkirjat, urheilijat (79.1 ... 79.7)
alternative label: Päiväkirjat, urheilijat, tutkimus (79.1 ... 79.7)
alternative label: Redskapsgymnastik (79.2) @sv
alternative label: Rytminen voimistelu (79.2)
alternative label: Rytmisk gymnastik (79.2) @sv
alternative label: Sagogymnastik (79.2) @sv
alternative label: Satuvoimistelu (79.2)
alternative label: Stretching (79.2)
alternative label: Stretchning (79.2) @sv
alternative label: Stångdans (79.2) @sv
alternative label: Taitovoimistelu, urheilu (79.2)
alternative label: Tankotanssi (79.2)
alternative label: Taukovoimistelu (79.2)
alternative label: Telinevoimistelu (79.2)
alternative label: Tänjning (79.2) @sv
alternative label: Vattengymnastik (79.2) @sv
alternative label: Venyttely (79.2)
alternative label: Vesivoimistelu (79.2)
alternative label: Voimistelu (79.2)
alternative label: Zumba (79.2)
alternative label: Äiti ja lapsi -voimistelu (79.2)
broader: LIIKUNTA. URHEILU. LEIKIT. HUVIT
in scheme: YKL - Yleisten kirjastojen luokitusjärjestelmä
notation: 79.2
preferred label: Gymnastics @en
preferred label: Gymnastik @sv
scope note: Rytminen voimistelu. Telinevoimistelu Kuntovoimistelu, esim. aerobic, cheerleading, stretching, satuvoimistelu sekä äiti ja lapsi -voimistelu Musiikkiliikunta yleensä
scope note: Rytmisk gymnastik. Redskapsgymnastik Motionsgymnastik, t.ex. aerobic, cheerleading, stretching, sagogymnastik samt mor och barn-gymnastik Musikgymnastik i allmänhet @sv

Palloilu
type: Concept
type: YKL-luokka
alternative label: Boccia (79.3)
alternative label: Bollspel, idrott (79.3+) @sv
alternative label: Curling (79.3)
alternative label: Dagböcker, idrottare (79.1 ... 79.7) @sv
alternative label: Dagböcker, idrottare, forskning (79.1 ... 79.7) @sv
alternative label: Harrastukset, urheilu (79.1 ... 79.7)
alternative label: Hevospoolo (79.3)
alternative label: Hobbyer, idrott (79.1 ... 79.7) @sv
alternative label: Hästpolo (79.3) @sv
alternative label: Innebandy (79.3) @sv
alternative label: Krocket (79.3) @sv
alternative label: Kroketti (79.3)
alternative label: Kyykkä (79.3)
alternative label: Kägelspel (79.3) @sv
alternative label: Landhockey (79.3) @sv
alternative label: Maahockey (79.3)
alternative label: Palloilu (79.3+)
alternative label: Pallopelit, urheilu (79.3+)
alternative label: Pelit, palloilu (79.3+)
alternative label: Petankki (79.3)
alternative label: Petanque (79.3) @sv
alternative label: Päiväkirjat, urheilijat (79.1 ... 79.7)
alternative label: Päiväkirjat, urheilijat, tutkimus (79.1 ... 79.7)
alternative label: Regler, bollgrenar (79.3+) @sv
alternative label: Salibandy (79.3)
alternative label: Spel, bollspel (79.3+) @sv
alternative label: Sähly (79.3)
alternative label: Säännöt, palloilulajit (79.3+)
alternative label: Vattenpolo (79.3) @sv
alternative label: Vesipallo (79.3)
broader: LIIKUNTA. URHEILU. LEIKIT. HUVIT
in scheme: YKL - Yleisten kirjastojen luokitusjärjestelmä
narrower: Jalkapallo
narrower: Pesäpallo
narrower: Koripallo. Käsipallo. Lentopallo
narrower: Golf
narrower: Tennis. Padel. Pöytätennis. Squash. Sulkapallo
narrower: Keilailu
narrower: Jääkiekko. Jääpallo
notation: 79.3
preferred label: Ball games @en
preferred label: Bollsport. Kägelspel @sv
scope note: Hit allmänna verk om bollsport Hit också t.ex. curling, hästpolo, krocket, kägelspel, landhockey, petanque, innebandy och vattenpolo Hit och till underklasserna också bollspel ur motionssynvinkel @sv
scope note: Tähän palloilun yleisteokset Tähän myös esim. curling, hevospoolo, kroketti, kyykkä, maahockey, petankki, salibandy ja vesipallo Tähän ja alaluokkiin myös palloilu kuntoliikunnan kannalta

Jalkapallo
type: Concept
type: YKL-luokka
alternative label: Amerikansk fotboll (79.31) @sv
alternative label: Amerikkalainen jalkapallo (79.31)
alternative label: Australialainen jalkapallo (79.31)
alternative label: Australisk fotboll (79.31) @sv
alternative label: Blixtboll (79.31) @sv
alternative label: Fotboll (79.31) @sv
alternative label: Jalkapallo (79.31)
alternative label: Rugby (79.31)
alternative label: Salamapallo (79.31)
broader: Palloilu
in scheme: YKL - Yleisten kirjastojen luokitusjärjestelmä
notation: 79.31
preferred label: Football @en
preferred label: Fotboll @sv
scope note: Hit också amerikansk och australisk fotboll, rugby och blixtboll @sv
scope note: Tähän myös amerikkalainen ja australialainen jalkapallo, rugby ja salamapallo

Pesäpallo
type: Concept
type: YKL-luokka
alternative label: Baseball (79.32)
alternative label: Boboll (79.32) @sv
alternative label: Cricket (79.32) @sv
alternative label: Kriketti (79.32)
alternative label: Pesäpallo (79.32)
broader: Palloilu
in scheme: YKL - Yleisten kirjastojen luokitusjärjestelmä
notation: 79.32
preferred label: Boboll @sv
preferred label: Finnish baseball @en
scope note: Hit också baseball och cricket @sv
scope note: Tähän myös baseball ja kriketti

Koripallo. Käsipallo. Lentopallo
type: Concept
type: YKL-luokka
alternative label: Basketboll (79.33) @sv
alternative label: Handboll (79.33) @sv
alternative label: Koripallo (79.33)
alternative label: Käsipallo (79.33)
alternative label: Lentopallo (79.33)
alternative label: Volleyboll (79.33) @sv
broader: Palloilu
in scheme: YKL - Yleisten kirjastojen luokitusjärjestelmä
notation: 79.33
preferred label: Basketball. Handball. Volleyball @en
preferred label: Korgboll. Handboll. Volleyboll @sv

Golf
type: Concept
type: YKL-luokka
alternative label: Bangolf (79.34) @sv
alternative label: Golf (79.34)
alternative label: Golfbanor, golf (79.34) @sv
alternative label: Golfkentät, golf (79.34)
alternative label: Minigolf (79.34)
alternative label: Pienoisgolf (79.34)
alternative label: Ratagolf (79.34)
broader: Palloilu
in scheme: YKL - Yleisten kirjastojen luokitusjärjestelmä
notation: 79.34
scope note: Hit också minigolf @sv
scope note: Tähän myös pienoisgolf

Tennis. Padel. Pöytätennis. Squash. Sulkapallo
type: Concept
type: YKL-luokka
alternative label: Badminton (79.35) @sv
alternative label: Bordstennis (79.35) @sv
alternative label: Padel (79.35)
alternative label: Pöytätennis (79.35)
alternative label: Squash (79.35)
alternative label: Sulkapallo (79.35)
alternative label: Tennis (79.35)
alternative label: Tenniskentät (79.35)
alternative label: Tennisplaner (79.35) @sv
broader: Palloilu
in scheme: YKL - Yleisten kirjastojen luokitusjärjestelmä
notation: 79.35
preferred label: Tennis, Padel, Bordstennis, Squash, Badminton @sv
preferred label: Tennis, Padel, Table tennis, Squash, Badminton @en
scope note: Hit också bordtennis, squash och badminton @sv
scope note: Tähän myös pöytätennis, squash ja sulkapallo

Keilailu
type: Concept
type: YKL-luokka
alternative label: Bowling (79.36) @sv
alternative label: Keilailu (79.36)
broader: Palloilu
in scheme: YKL - Yleisten kirjastojen luokitusjärjestelmä
notation: 79.36
preferred label: Bowling @en

Jääkiekko. Jääpallo
type: Concept
type: YKL-luokka
alternative label: Isboll (79.37) @sv
alternative label: Ishockey (79.37) @sv
alternative label: Jääkiekko (79.37)
alternative label: Jääpallo (79.37)
alternative label: Kaukalopallo (79.37)
alternative label: Ringette (79.37)
alternative label: Rinkbandy (79.37) @sv
broader: Palloilu
in scheme: YKL - Yleisten kirjastojen luokitusjärjestelmä
notation: 79.37
preferred label: Ice hockey. Bandy @en
preferred label: Ishockey. Bandy @sv
scope note: Hit också rinkbandy och ringette @sv
scope note: Tähän myös kaukalopallo ja ringette

Retkeily. Ulkoilu
type: Concept
References: Matkailu. Turismi
References: Yleiset matkaoppaat
References: Matkakuvaukset
References: Metsästys. Kalastus
References: Vesiliikenne
References: Pyöräily
type: YKL-luokka
alternative label: Autiotuvat, retkeily ja ulkoilu (79.4+)
alternative label: Bergvandring (79.4) @sv
alternative label: Camping, erä- ja retkeilytaidot (79.4)
alternative label: Camping, vildmarks- och vandringskunskaper (79.4) @sv
alternative label: Dagböcker, idrottare (79.1 ... 79.7) @sv
alternative label: Dagböcker, idrottare, forskning (79.1 ... 79.7) @sv
alternative label: Eräretkeily (79.4)
alternative label: Erätaidot (79.4)
alternative label: Friluftsliv (79.4) @sv
alternative label: Harrastukset, urheilu (79.1 ... 79.7)
alternative label: Henkiinjäämisoppaat, erätaidot (79.4)
alternative label: Hobbyer, idrott (79.1 ... 79.7) @sv
alternative label: Leirintä, erätaidot (79.4)
alternative label: Päiväkirjat, urheilijat (79.1 ... 79.7)
alternative label: Päiväkirjat, urheilijat, tutkimus (79.1 ... 79.7)
alternative label: Raststugor, naturutfärd och friluftsliv (79.4+) @sv
alternative label: Retkeily (79.4)
alternative label: Selviytymisoppaat, erätaidot (79.4)
alternative label: Sportstugor, naturutfärd och friluftsliv (79.4+) @sv
alternative label: Tältning, vildmarkskunskaper (79.4) @sv
alternative label: Ulkoilu (79.4)
alternative label: Ulkoilumajat, retkeily ja ulkoilu (79.4+)
alternative label: Urheilumajat, retkeily ja ulkoilu (79.4+)
alternative label: Utflykter (79.4) @sv
alternative label: Vaellus (79.4)
alternative label: Vandring (79.4) @sv
alternative label: Vildmarkskunskaper (79.4) @sv
alternative label: Vildmarksvandring (79.4) @sv
alternative label: Vuoristoretkeily (79.4)
alternative label: Ödemarksstugor, naturutfärd och friluftsliv (79.4+) @sv
alternative label: Överlevnadsguider, vildmarkskunskaper (79.4) @sv
alternative label: Överlevnadshandböcker, vildmarkskunskaper (79.4) @sv
broader: LIIKUNTA. URHEILU. LEIKIT. HUVIT
in scheme: YKL - Yleisten kirjastojen luokitusjärjestelmä
narrower: Suunnistus
narrower: Vuorikiipeily
notation: 79.4
preferred label: Hiking. Outdoor recreation @en
preferred label: Lägerliv. Friluftsliv @sv
scope note: Hit och till underklasserna hur man klarar sig i naturen och hur man slår läger samt campingutrustning Hit och till underklasserna också handböcker i överlevnad i ödemarken Hit också alpina utflykter @sv
scope note: Tähän ja alaluokkiin erä- ja leiriytymistaidot sekä retkeilyvälineet ja -varusteet Tähän ja alaluokkiin myös erätaitoihin liittyvät henkiinjäämisoppaat Tähän vuoristoretkeily

Suunnistus
type: Concept
References: Vesiliikenne
References: Talviurheilu
References: Autourheilu
type: YKL-luokka
alternative label: GPS, orientering (79.42) @sv
alternative label: GPS, suunnistus (79.42)
alternative label: Geocaching (79.42) @sv
alternative label: Geokätkentä (79.42)
alternative label: Geokätköily (79.42)
alternative label: Kompasser, orientering (79.42) @sv
alternative label: Kompassit, suunnistaminen (79.42)
alternative label: Orientering (79.42) @sv
alternative label: Paikannus, suunnistus (79.42)
alternative label: Paikantimet, suunnistus (79.42)
alternative label: Positioneringsutrustningar, orientering (79.42) @sv
alternative label: Positionsbestämning, orientering (79.42) @sv
alternative label: Satelliittipaikannus, suunnistus (79.42)
alternative label: Satellitnavigering, orientering (79.42) @sv
alternative label: Suunnistus (79.42)
broader: Retkeily. Ulkoilu
in scheme: YKL - Yleisten kirjastojen luokitusjärjestelmä
notation: 79.42
preferred label: Orienteering @en
preferred label: Orientering @sv
scope note: Orienteringstävlingar. Orienteringskunskap. Geocaching Användning av karta, kompass eller GPS vid orientering @sv
scope note: Suunnistuskilpailut. Suunnistustaidot. Geokätköily Kartan, kompassin ja GPS:n käyttö suunnistuksessa

Vuorikiipeily
type: Concept
References: Retkeily. Ulkoilu
type: YKL-luokka
alternative label: Alpinism (79.43) @sv
alternative label: Alppikiipeily (79.43)
alternative label: Bergsbestigning (79.43) @sv
alternative label: Boulder (79.43) @sv
alternative label: Boulderointi (79.43)
alternative label: Kalliokiipeily (79.43)
alternative label: Kiipeily (79.43)
alternative label: Klippklättring (79.43) @sv
alternative label: Klättring (79.43) @sv
alternative label: Seinäkiipeily (79.43)
alternative label: Vuorikiipeily (79.43)
alternative label: Väggklättring (79.43) @sv
broader: Retkeily. Ulkoilu
in scheme: YKL - Yleisten kirjastojen luokitusjärjestelmä
notation: 79.43
preferred label: Bergsbestigning @sv
preferred label: Mountaineering @en
scope note: Bergsbestigarens utrustning Klättring. Klippklättring. Väggklättring. Boulder @sv
scope note: Vuorikiipeilijän välineet Kiipeily. Kalliokiipeily. Seinäkiipeily. Boulderointi

Lentourheilu. Moottoriurheilu
type: Concept
References: Liikennevälineet
type: YKL-luokka
alternative label: Dagböcker, idrottare (79.1 ... 79.7) @sv
alternative label: Dagböcker, idrottare, forskning (79.1 ... 79.7) @sv
alternative label: Harrastukset, urheilu (79.1 ... 79.7)
alternative label: Hobbyer, idrott (79.1 ... 79.7) @sv
alternative label: Kappkörning, motorsport (79.5+) @sv
alternative label: Kelkkailu, moottorikelkkaurheilu (79.5)
alternative label: Kilpa-ajot, moottoriurheilu (79.5+)
alternative label: Moottorikelkkaurheilu (79.5)
alternative label: Moottoriurheilu (79.5+)
alternative label: Motorsport (79.5+) @sv
alternative label: Päiväkirjat, urheilijat (79.1 ... 79.7)
alternative label: Päiväkirjat, urheilijat, tutkimus (79.1 ... 79.7)
alternative label: Snöskotersport (79.5) @sv
alternative label: Tractor pulling (79.5)
alternative label: Tractorpulling (79.5) @sv
alternative label: Traktoriveto (79.5)
broader: LIIKUNTA. URHEILU. LEIKIT. HUVIT
in scheme: YKL - Yleisten kirjastojen luokitusjärjestelmä
narrower: Lentourheilu
narrower: Autourheilu
narrower: Moottoripyöräurheilu
narrower: Moottoriveneurheilu
notation: 79.5
preferred label: Air sports. Motor sports @en
preferred label: Flygsport. Motorsport @sv
scope note: Hit allmänna verk om motorsport. Hit även tractorpulling och liknande motorsportsgrenar. Om verket handlar både om flyg- eller motorsport och flygplan, motorfordon eller motorbåtar ges företräde åt klass 79.5+ @sv
scope note: Tähän moottoriurheilun yleisteokset. Tähän myös kelkkailu, tractor pulling ja vastaavat moottoriurheilun lajit. Jos teos koskee sekä lento- tai moottoriurheilua että lentokoneita, moottoriajoneuvoja tai moottoriveneitä, annetaan etusija luokalle 79.5+

Lentourheilu
type: Concept
References: Ilmavoimat. Ilmasodankäynti
References: Ilmakulkuneuvot
References: Liikennevälineiden pienoismallit
References: KÄSITYÖ. KOTITEOLLISUUS
References: Lentoliikenne
type: YKL-luokka
alternative label: Benji (79.51)
alternative label: Drakar, drakflygning (79.51) @sv
alternative label: Fallskärmar (79.51) @sv
alternative label: Fallskärmshopp (79.51) @sv
alternative label: Fallskärmssport (79.51) @sv
alternative label: Flygsport (79.51) @sv
alternative label: Flyguppvisningar (79.51) @sv
alternative label: Glidflygsport (79.51) @sv
alternative label: Hängflygning (79.51) @sv
alternative label: Hängglidare (79.51) @sv
alternative label: Ilmailu, urheilu (79.51)
alternative label: Konstflygning (79.51) @sv
alternative label: Laskuvarjohypyt (79.51)
alternative label: Laskuvarjot (79.51)
alternative label: Laskuvarjourheilu (79.51)
alternative label: Leijat, lennätys (79.51)
alternative label: Lennokit, lennätys (79.51)
alternative label: Lentonäytökset (79.51)
alternative label: Lentourheilu (79.51)
alternative label: Liitolentourheilu (79.51)
alternative label: Luftfart, sport (79.51) @sv
alternative label: Modellplan, flygning (79.51) @sv
alternative label: Purjelento (79.51)
alternative label: Riippuliitimet (79.51)
alternative label: Riippuliito (79.51)
alternative label: Segelflyg (79.51) @sv
alternative label: Taitolento (79.51)
alternative label: Urheiluilmailu (79.51)
broader: Lentourheilu. Moottoriurheilu
in scheme: YKL - Yleisten kirjastojen luokitusjärjestelmä
notation: 79.51
preferred label: Air sports @en
preferred label: Flygsport @sv
scope note: Sportflygning. Konstflygning. Segelflygning Flygning med drake och modellplan Hit också fallskärmar och hängglidare Om verket behandlar både flyg- eller fallskärmssport och flygplan, ges företräde åt klass 79.51 @sv
scope note: Urheiluilmailu. Taitolento. Purjelento Laskuvarjourheilu. Riippuliito Leijojen ja lennokkien lennätys Tähän myös laskuvarjot ja riippuliitimet Jos teos koskee sekä lento- tai laskuvarjourheilua että lentokoneita, annetaan etusija luokalle 79.51

Autourheilu
type: Concept
References: Autot
References: Maaliikenne
type: YKL-luokka
alternative label: Autoilu, autourheilu (79.52)
alternative label: Autosuunnistus (79.52)
alternative label: Autourheilu (79.52)
alternative label: Banåkning, bilsport (79.52) @sv
alternative label: Bilism, bilsport (79.52) @sv
alternative label: Bilorientering (79.52) @sv
alternative label: Bilsport (79.52) @sv
alternative label: Dragracinglopp, bilsport (79.52) @sv
alternative label: Formel, bilsport (79.52) @sv
alternative label: Formula-ajot, autourheilu (79.52)
alternative label: Go-kartsport (79.52) @sv
alternative label: Kiihdytysajot, autourheilu (79.52)
alternative label: Kilpa-autoilu (79.52)
alternative label: Mikroautourheilu (79.52)
alternative label: Monster-ajot, autourheilu (79.52)
alternative label: Monstertävlingar, bilsport (79.52) @sv
alternative label: Ralliautoilu (79.52)
alternative label: Rallysport (79.52) @sv
alternative label: Rata-ajot, autourheilu (79.52)
broader: Lentourheilu. Moottoriurheilu
in scheme: YKL - Yleisten kirjastojen luokitusjärjestelmä
notation: 79.52
preferred label: Bilsport @sv
preferred label: Motor car sports @en
scope note: Ralli- ja rata-autoilu. Formula-ajot. Mikroautourheilu. Autosuunnistus Jos teos koskee sekä autourheilua että autoja, annetaan etusija luokalle 79.52
scope note: Rally. Bankörning. Formel. Go-kartsport. Bilorientering Om verket behandlar både bilsport och bilar ges företräde åt klass 79.52 @sv

Moottoripyöräurheilu
type: Concept
References: Moottoripyörät. Mopedit. Moottorikelkat. Mönkijät
References: Maaliikenne
type: YKL-luokka
alternative label: Banåkning, motorcykelsport (79.53) @sv
alternative label: Enduro, moottoripyöräurheilu (79.53)
alternative label: Enduro, motorcykelsport (79.53) @sv
alternative label: Maastoajo, moottoripyöräurheilu (79.53)
alternative label: Moottoripyöräurheilu (79.53)
alternative label: Motocross, moottoripyöräuheilu (79.53)
alternative label: Motocross, motorcykelsport (79.53) @sv
alternative label: Motorcykelsport (79.53) @sv
alternative label: Rata-ajot, moottoripyöräurheilu (79.53)
alternative label: Road racing, moottoripyöräurheilu (79.53)
alternative label: Road racing, motorcykelsport (79.53) @sv
alternative label: Speedway, moottoripyöräurheilu (79.53)
alternative label: Speedway, motorcykelsport (79.53) @sv
alternative label: Stadion-cross, moottoripyöräurheilu (79.53)
alternative label: Stadioncross, motorcykelsport (79.53) @sv
alternative label: Terrängkörning, motorcykelsport (79.53) @sv
alternative label: Trial, moottoripyöräurheilu (79.53)
alternative label: Trial, motorcykelsport (79.53) @sv
broader: Lentourheilu. Moottoriurheilu
in scheme: YKL - Yleisten kirjastojen luokitusjärjestelmä
notation: 79.53
preferred label: Motorcycle sports @en
preferred label: Motorcykelsport @sv
scope note: Banåkning och terrängkörning Enduro. Motocross. Speedway. Trial Om verket behandlar både motorcykelsport och motorcyklar, ges företräde åt klass 79.53 @sv
scope note: Rata- ja maastoajo Enduro. Motocross. Speedway. Trial Jos teos koskee sekä moottoripyöräurheilua että moottoripyöriä, annetaan etusija luokalle 79.53

Moottoriveneurheilu
type: Concept
References: Veneet
References: Vesiliikenne
References: Uinti. Sukellus. Lainelautailu
References: Soutu. Melonta. Purjehdus
type: YKL-luokka
alternative label: Båtsport, motorbåtsport (79.55) @sv
alternative label: Moottoriveneurheilu (79.55)
alternative label: Motorbåtsport (79.55) @sv
alternative label: Veneily, moottoriveneurheilu (79.55)
broader: Lentourheilu. Moottoriurheilu
in scheme: YKL - Yleisten kirjastojen luokitusjärjestelmä
notation: 79.55
preferred label: Motorboat sports @en
preferred label: Motorbåtssport @sv
scope note: Jos teos koskee sekä moottoriveneurheilua että moottoriveneitä, annetaan etusija luokalle 79.55
scope note: Om verket behandlar både motorbåtssport och motorbåtar, ges företräde åt klass 79.55 @sv

Kuntoliikunta. Kuntourheilu
type: Concept
References: Koululaitos
References: Henkilökohtainen terveydenhoito
References: Seuratanssit. Tanssiurheilu
References: URN:NBN:fi:au:ykl:79.109
References: Yleisurheilu
References: Talviurheilu
References: Uinti. Sukellus. Lainelautailu
References: Voimailu. Kehonrakennus. Fitness-urheilu
References: Pyöräily
References: Voimistelu
References: Palloilu
References: Retkeily. Ulkoilu
References: Muut urheilu- ja liikuntamuodot
type: YKL-luokka
alternative label: Arbetsplatsidrott (79.6) @sv
alternative label: Arbetsplatsmotion (79.6) @sv
alternative label: Dagböcker, idrottare (79.1 ... 79.7) @sv
alternative label: Dagböcker, idrottare, forskning (79.1 ... 79.7) @sv
alternative label: Erityisliikunta (79.6)
alternative label: Fysisk fostran, motionsidrott (79.6) @sv
alternative label: Fysisk kondition, motionsidrott (79.6) @sv
alternative label: Fyysinen kunto, kuntoliikunta (79.6)
alternative label: Handikappidrott, motionsidrott (79.6) @sv
alternative label: Handikappmotion (79.6) @sv
alternative label: Harrastukset, urheilu (79.1 ... 79.7)
alternative label: Hobbyer, idrott (79.1 ... 79.7) @sv
alternative label: Hälsomotion (79.6) @sv
alternative label: Idrott, motion (79.6) @sv
alternative label: Idrottsinstruktion, motionsidrott (79.6) @sv
alternative label: Idrottspolitik, motion (79.6) @sv
alternative label: Idrottspolitik, motionsidrott (79.6) @sv
alternative label: Idrottspsykologi, motion (79.6) @sv
alternative label: Idrottspsykologi, motionsidrott (79.6) @sv
alternative label: Idrottssociologi, motion (79.6) @sv
alternative label: Idrottssociologi, motionsidrott (79.6) @sv
alternative label: Kuntoilu (79.6)
alternative label: Kuntoliikunta (79.6)
alternative label: Kuntopyörät, käyttö (79.6)
alternative label: Kuntosalitoiminta (79.6)
alternative label: Kuntosalivälineet (79.6)
alternative label: Kuntourheilu (79.6)
alternative label: Liikunnanohjaus, kuntoliikunta (79.6)
alternative label: Liikuntakasvatus, kuntoliikunta (79.6)
alternative label: Liikuntapolitiikka, kuntoliikunta (79.6)
alternative label: Liikuntapsykologia, kuntoliikunta (79.6)
alternative label: Liikuntasosiologia, kuntoliikunta (79.6)
alternative label: Motion (79.6) @sv
alternative label: Motionscyklar, användning (79.6) @sv
alternative label: Motionsidrott (79.6) @sv
alternative label: Motionslokaler, redskap (79.6) @sv
alternative label: Motionslokaler, verksamhet (79.6) @sv
alternative label: Motionssport (79.6) @sv
alternative label: Opiskelijaliikunta (79.6)
alternative label: Päiväkirjat, urheilijat (79.1 ... 79.7)
alternative label: Päiväkirjat, urheilijat, tutkimus (79.1 ... 79.7)
alternative label: Specialmotion (79.6) @sv
alternative label: Studentidrott (79.6) @sv
alternative label: Terveysliikunta (79.6)
alternative label: Työpaikkaliikunta (79.6)
alternative label: Työpaikkaurheilu (79.6)
alternative label: Urheilu, kuntourheilu (79.6)
alternative label: Urheilupolitiikka, kuntourheilu (79.6)
alternative label: Urheilupsykologia, kuntourheilu (79.6)
alternative label: Urheilusosiologia, kuntourheilu (79.6)
alternative label: Vammaisliikunta (79.6)
alternative label: Vammaisurheilu, kuntoliikunta (79.6)
alternative label: Vanhukset, liikunta ja urheilu (79.6)
alternative label: Veteraaniurheilu (79.6)
alternative label: Veteranidrott (79.6) @sv
alternative label: Åldringar, motion och idrott (79.6) @sv
broader: LIIKUNTA. URHEILU. LEIKIT. HUVIT
in scheme: YKL - Yleisten kirjastojen luokitusjärjestelmä
notation: 79.6
preferred label: Motion. Motionsidrott @sv
preferred label: Physical exercise. @en
scope note: Hit allmänna verk om motion och motionsidrott Motionslokaler och deras redskap Motion och sport på arbetsplatsen i allmänhet. Hälsomotion i allmänhet Motion för äldre. Motion för handikappade Hit också idrottspsykologi, idrottssociologi och idrottspolitik i allmänhet ur motionssynvinkel och ur motionsidrottens synvinkel Idkandet av en enskild idrottsgren i motionssyfte förs till respektive grens klass @sv
scope note: Tähän kuntoliikunnan ja kuntourheilun yleisteokset Kuntosalitoiminta. Kuntosalivälineet Työpaikkaliikunta ja -urheilu yleensä. Terveysliikunta yleensä Vanhusten liikunta. Vammaisliikunta Tähän myös urheilupsykologia, -sosiologia ja -politiikka kuntoliikunnan ja kuntourheilun kannalta yleensä Tietyn lajin harrastaminen kuntoilutarkoituksessa luokitetaan ko. lajin luokkaan

Muut urheilu- ja liikuntamuodot
type: Concept
References: Yleisurheilu
References: Talviurheilu
type: YKL-luokka
alternative label: Biljard (79.7) @sv
alternative label: Biljardi (79.7)
alternative label: Bumeranginheitto (79.7)
alternative label: Bumerangkastning (79.7) @sv
alternative label: Dagböcker, idrottare (79.1 ... 79.7) @sv
alternative label: Dagböcker, idrottare, forskning (79.1 ... 79.7) @sv
alternative label: Darts (79.7)
alternative label: Femkamp, modern (79.7) @sv
alternative label: Frisbee (79.7)
alternative label: Harrastukset, urheilu (79.1 ... 79.7)
alternative label: Hobbyer, idrott (79.1 ... 79.7) @sv
alternative label: Kickboardåkning (79.7) @sv
alternative label: Modern femkamp (79.7) @sv
alternative label: Moniottelut, muut (79.7)
alternative label: Mångkamper, övriga (79.7) @sv
alternative label: Nykyaikainen viisiottelu (79.7)
alternative label: Parkour (79.7)
alternative label: Pilkastning (79.7) @sv
alternative label: Potkulaudat (79.7)
alternative label: Potkulautailu (79.7)
alternative label: Päiväkirjat, urheilijat (79.1 ... 79.7)
alternative label: Päiväkirjat, urheilijat, tutkimus (79.1 ... 79.7)
alternative label: Rullalautailu (79.7)
alternative label: Rullaluistelu (79.7)
alternative label: Rullbrädsåkning (79.7) @sv
alternative label: Rullskridskoåkning (79.7) @sv
alternative label: Scoottaus (79.7)
alternative label: Skateboardåkning (79.7) @sv
alternative label: Skeittailu (79.7)
alternative label: Skeittaus (79.7)
alternative label: Skejtande (79.7) @sv
alternative label: Skoottaus (79.7)
alternative label: Snooker (79.7)
alternative label: Sparkbräden (79.7) @sv
alternative label: Sparkcyckelåkning (79.7) @sv
alternative label: Sparkcyclar (79.7) @sv
alternative label: Temppupotkulautailu (79.7)
alternative label: Teräsmieskilpailut (79.7)
alternative label: Tikanheitto (79.7)
alternative label: Triathlon (79.7)
alternative label: Triathlontävlingar (79.7) @sv
alternative label: Viisiottelu, nykyaikainen (79.7)
broader: LIIKUNTA. URHEILU. LEIKIT. HUVIT
in scheme: YKL - Yleisten kirjastojen luokitusjärjestelmä
notation: 79.7
preferred label: Other forms of sports and exercise @en
preferred label: Övriga sport- och motionsformer @sv
scope note: Hit t.ex. modern 5-kamp, triathlon och övriga mångkamper, parkour, skateboardåkning, kickboardåkning och rullskridsko, biljard samt frisbee, bumerang- och pilkastning @sv
scope note: Tähän esim. nykyaikainen 5-ottelu, triathlon ja muut moniottelut, parkour, skeittaus, potkulautailu, ja rullaluistelu, biljardi sekä frisbeen, bumerangin- ja tikanheitto

Pelit. Leikit. Keräily
type: Concept
References: Tekniikka ja sovelletut tieteet harrasteena
References: Liikennevälineiden pienoismallit
References: KÄSITYÖ. KOTITEOLLISUUS
References: Arpajaiset. Veikkaus. Uhkapeli
type: YKL-luokka
alternative label: Aikuisten puuhakirjat (79.8)
alternative label: Aikuisten puuhakirjat, ajanviete, yl. (79.8+)
alternative label: Ajanviete, yl. (79.8)
alternative label: Detektivhandböcker, barnlitteratur (79.8) @sv
alternative label: Harrasteet (79.8)
alternative label: Harrasteoppaat (79.8)
alternative label: Harrastukset (79.8)
alternative label: Hobbies (79.8) @sv
alternative label: Hobbyer (79.8) @sv
alternative label: Hobbyguider (79.8) @sv
alternative label: Lasten puuhakirjat (79.8)
alternative label: Lasten puuhakirjat, ajanviete (79.8+)
alternative label: Mina vänner-böcker (79.8) @sv
alternative label: Målarböcker (79.8) @sv
alternative label: Puuhakirjat, ajanviete (79.8+)
alternative label: Pysselböcker för barn (79.8) @sv
alternative label: Pysselböcker för barn, tidsfördriv (79.8+) @sv
alternative label: Pysselböcker för vuxna (79.8) @sv
alternative label: Pysselböcker för vuxna, tidsfördriv,allm. (79.8+) @sv
alternative label: Pysselböcker, tidsfördriv (79.8+) @sv
alternative label: Salapoliisioppaat, lastenkirjallisuus (79.8)
alternative label: Tehtäväkirjat, ajanviete (79.8+)
alternative label: Tidsfördriv, allm. (79.8) @sv
alternative label: Uppdragsböcker, tidsfördriv (79.8+) @sv
alternative label: Värityskirjat (79.8)
alternative label: Ystäväkirjat (79.8)
broader: LIIKUNTA. URHEILU. LEIKIT. HUVIT
in scheme: YKL - Yleisten kirjastojen luokitusjärjestelmä
narrower: Pelit
narrower: Leikit
narrower: Taikatemput
narrower: Keräily
notation: 79.8
preferred label: Games. Plays. Collecting @en
preferred label: Spel. Lekar. Samlarverksamhet @sv
scope note: Hit allmänna verk om lekar, spel och nöjen Hit också allmänna verk om hobbyer eller tidsfördriv Pysselböcker för barn och vuxna Hobbyverksamhet, tidsfördriv och samlarverksamhet inom specialområden klassificeras enligt område @sv
scope note: Tähän yleisteokset, jotka koskevat sekä leikkejä, pelejä että huveja Tähän myös harrasteita tai ajanvietettä koskevat yleisteokset Lasten ja aikuisten puuhakirjat Erikoisalojen harrasteet, ajanviete ja keräily luokitetaan alan mukaan

Pelit
type: Concept
References: Pelimusiikki
References: Muut urheilu- ja liikuntamuodot
References: Arpajaiset. Veikkaus. Uhkapeli
type: YKL-luokka
alternative label: Flipperit (79.81)
alternative label: Flipprar (79.81) @sv
alternative label: Harrastukset, pelit (79.81+)
alternative label: Hobbyer, spel (79.81+) @sv
alternative label: Palapelit (79.81)
alternative label: Pelisuunnittelu, yl. (79.81+)
alternative label: Pelit (79.81)
alternative label: Pussel (79.81) @sv
alternative label: Spel (79.81) @sv
alternative label: Speldesign, allm. (79.81+) @sv
broader: Pelit. Leikit. Keräily
in scheme: YKL - Yleisten kirjastojen luokitusjärjestelmä
narrower: Korttipelit
narrower: Lautapelit
narrower: Tietokilpailut. Päättelytehtävät
narrower: Pöytäroolipelit. Liveroolipelit. Larppaus
narrower: Mobiilipelit. Tietokonepelit. Interaktiiviset pelit.
notation: 79.81
preferred label: Games @en
preferred label: Spel @sv
scope note: Hit allmänna verk om spel. Hit och till underklasserna spel, spelinstruktioner och spelregler. Instruktioner för spel klassificeras enligt spelets klass. Flipper. @sv
scope note: Tähän pelejä koskevat yleisteokset. Tähän ja alaluokkiin pelit, peliohjeet ja pelien säännöt. Pelien ohjekirjat luokitetaan ko. pelin mukaisen luokkaan. Flipperit.

Korttipelit
type: Concept
References: Okkultismi. Spiritismi. Spiritualismi. Henkimaailma
References: Taikatemput
type: YKL-luokka
alternative label: Bridge (79.812)
alternative label: Canasta (79.812)
alternative label: Kortspel (79.812) @sv
alternative label: Korttipelit (79.812)
alternative label: Pasianssit (79.812)
alternative label: Patienser (79.812) @sv
alternative label: Pelit, korttipelit (79.812)
alternative label: Samba, kortspel (79.812) @sv
alternative label: Samba, korttipeli (79.812)
alternative label: Skruuvipeli (79.812)
alternative label: Skruv, spel (79.812) @sv
alternative label: Spel, kortspel (79.812) @sv
broader: Pelit
in scheme: YKL - Yleisten kirjastojen luokitusjärjestelmä
notation: 79.812
preferred label: Card games @en
preferred label: Kortspel @sv
scope note: Hit också patienser. Hit också kortspel som adapterats för datorer. @sv
scope note: Tähän myös pasianssit. Tähän myös tietokoneelle sovelletut korttipelit.

Lautapelit
type: Concept
References: Korttipelit
References: Tietokilpailut. Päättelytehtävät
type: YKL-luokka
alternative label: Backgammon (79.813)
alternative label: Brädspel (79.813) @sv
alternative label: Damspel (79.813) @sv
alternative label: Domino-peli (79.813)
alternative label: Dominospelet (79.813) @sv
alternative label: Halma-peli (79.813)
alternative label: Halmaspel (79.813) @sv
alternative label: Lautapelit (79.813)
alternative label: Mah-jong (79.813)
alternative label: Mahjong (79.813) @sv
alternative label: Seurapelit (79.813)
alternative label: Sällskapsspel (79.813) @sv
alternative label: Tammipeli (79.813)
broader: Pelit
in scheme: YKL - Yleisten kirjastojen luokitusjärjestelmä
narrower: Shakki
notation: 79.813
preferred label: Board games @en
preferred label: Brädspel @sv
scope note: Hit brädspel såsom backgammon, halma och damspel. Hit också domino och mahjong. Schack till klass 79.8131. @sv
scope note: Tähän lautapelit, kuten backgammon, halma ja tammi. Tähän myös domino ja mah-jong. Shakki luokkaan 79.8131.

Shakki
type: Concept
References: Korttipelit
References: Tietokilpailut. Päättelytehtävät
type: YKL-luokka
alternative label: Brädspel, schack (79.8131) @sv
alternative label: Datorschack (79.8131) @sv
alternative label: Lautapelit, shakki (79.8131)
alternative label: Pelit, shakkipeli (79.8131)
alternative label: Sakkipeli (79.8131)
alternative label: Schack (79.8131) @sv
alternative label: Schackspel (79.8131) @sv
alternative label: Shakkipeli (79.8131)
alternative label: Spel, schackspelet (79.8131) @sv
alternative label: Tietokoneshakki (79.8131)
broader: Lautapelit
in scheme: YKL - Yleisten kirjastojen luokitusjärjestelmä
notation: 79.8131
preferred label: Chess @en
preferred label: Schack @sv
scope note: Schack Hit också datorschack. @sv
scope note: Tähän myös tietokoneshakki.

Tietokilpailut. Päättelytehtävät
type: Concept
References: Sananlaskut. Arvoitukset. Vertaukset. Kaskut
References: Kansanrunouden historia ja tutkimus
type: YKL-luokka
alternative label: Arvoitukset, ajanviete (79.814)
alternative label: Bildgåtor (79.814) @sv
alternative label: Frågesporter (79.814) @sv
alternative label: Frågesportsfrågor (79.814) @sv
alternative label: Frågesportspel (79.814) @sv
alternative label: Gåtor, tidsfördriv (79.814) @sv
alternative label: Intelligensspel (79.814) @sv
alternative label: Korsord (79.814) @sv
alternative label: Kuva-arvoitukset (79.814)
alternative label: Ongelmanratkaisu, ajanviete (79.814)
alternative label: Pelit, tietokilpailupelit (79.814)
alternative label: Problemlösning, tidsfördriv (79.814) @sv
alternative label: Problemlösningsuppgifter @sv
alternative label: Päättelytehtävät, ajanviete (79.814)
alternative label: Ristisanat (79.814)
alternative label: Sanaristikot (79.814)
alternative label: Selviytymispelit (79.814)
alternative label: Slutledningsuppgifter, tidsfördriv (79.814) @sv
alternative label: Spel, frågesportspel (79.814) @sv
alternative label: Tietokilpailupelit (79.814)
alternative label: Tietokilpailut (79.814)
alternative label: Trivial pursuit (79.814)
alternative label: Visailukysymykset (79.814)
alternative label: Älykkyyspelit (79.814)
alternative label: Älypelit (79.814)
alternative label: Överlevnadsspel (79.814) @sv
broader: Pelit
in scheme: YKL - Yleisten kirjastojen luokitusjärjestelmä
notation: 79.814
preferred label: Frågesport. Slutledningsuppgifter @sv
preferred label: Quizzes @en
scope note: Arvoitukset. Ongelmanratkaisutehtävät. Ristisanat. Tietokilpailupelit. Visailukysymykset. Tähän myös tarinalliset päättelytehtävät.
scope note: Frågesportsfrågor. Frågesportspel. Gåtor. Korsord. Problemlösningsuppgifter. Hit även berättelsebaserade problemlösningsspel. @sv

Pöytäroolipelit. Liveroolipelit. Larppaus
type: Concept
type: YKL-luokka
alternative label: Bordsrollspel (79.815) @sv
alternative label: Escape room-spel (79.815) @sv
alternative label: Lajv (79.815) @sv
alternative label: Larppaus (79.815)
alternative label: Levande rollspel (79.815) @sv
alternative label: Liveroolipelit (79.815)
alternative label: Pakohuonepelit (79.815)
alternative label: Pakopelit (79.815)
alternative label: Pöytäroolipelit (79.815)
alternative label: Rollspel, bordsrollspel (79.815) @sv
alternative label: Rollspel, lajv (79.815) @sv
alternative label: Roolipelit, liveroolipelit (79.815)
alternative label: Roolipelit, pöytäroolipelit (79.815)
alternative label: Rymningsspel (79.815) @sv
broader: Pelit
in scheme: YKL - Yleisten kirjastojen luokitusjärjestelmä
notation: 79.815
preferred label: Bordsrollspel. Levande rollspel. Lajv @sv
preferred label: Live action role-playing games. Tabletop role-playing game @en
scope note: Hit rymningsspel och escape room-spel. Digitala rollspel till klass 79.816. @sv
scope note: Tähän pakopelit ja pakohuonepelit. Digitaaliset roolipelit luokkaan 79.816.

Mobiilipelit. Tietokonepelit. Interaktiiviset pelit.
type: Concept
type: YKL-luokka
alternative label: Datorspel (79.816) @sv
alternative label: Digitaaliset pelit (79.816)
alternative label: Digitaaliset roolipelit (79.816)
alternative label: Digitaaliset strategiapelit (79.816)
alternative label: Digitala rollspel (79.816) @sv
alternative label: Digitala spel (79.816) @sv
alternative label: Digitala strategispel (79.816) @sv
alternative label: E-sport (79.816) @sv
alternative label: E-urheilu (79.816)
alternative label: Elektroniikkapelit (79.816)
alternative label: Elektronikspel (79.816) @sv
alternative label: Interaktiiviset pelit (79.816)
alternative label: Interaktiva spel (79.816) @sv
alternative label: Internetspel (79.816) @sv
alternative label: Konsolipelit (79.816)
alternative label: Konsolspel (79.816) @sv
alternative label: Mobiilipelit (79.816)
alternative label: Mobilspel (79.816) @sv
alternative label: Nettipelit (79.816)
alternative label: Nätspel (79.816) @sv
alternative label: Pelikonsolit (79.816)
alternative label: Pelisuunnittelu, tietokonepelit (79.816)
alternative label: Pelit, elektroniikkapelit (79.816)
alternative label: Pelit, tietokonepelit (79.816)
alternative label: Pervasiiviset pelit (79.816)
alternative label: Rollspel, digitala (79.816) @sv
alternative label: Roolipelit, digitaaliset pelit (79.816)
alternative label: Spel, datorspel (79.816) @sv
alternative label: Spel, elektroniska (79.816) @sv
alternative label: Speldesign, datorspel (79.816) @sv
alternative label: Spelkonsoler (79.816) @sv
alternative label: Strategiapelit, digitaaliset pelit (79.816)
alternative label: Strategispel, digitala (79.816) @sv
alternative label: Tietokonepelit (79.816)
alternative label: Verkkopelit (79.816)
alternative label: Verklighetsspel (79.816) @sv
alternative label: Videopelit (79.816)
alternative label: Videospel (79.816) @sv
alternative label: Virtuaalipelit (79.816)
alternative label: Virtualspel (79.816) @sv
broader: Pelit
in scheme: YKL - Yleisten kirjastojen luokitusjärjestelmä
notation: 79.816
preferred label: Mobile games. Computer games. Interactive games. @en
preferred label: Mobilspel. Datorspel. Interaktiva spel. @sv
scope note: Hit även digitala rollspel, konsolspel, videospel och verklighetsspel. @sv
scope note: Tähän myös digitaaliset roolipelit, konsolipelit, videopelit ja pervasiiviset pelit.

Leikit
type: Concept
References: Lapsuuden ja nuoruuden psykologia
References: KANSATIEDE. KULTTUURIANTROPOLOGIA
References: Leikkikalut
References: Lastenlaulut. Lastenmusiikki
References: Etnomusiikki. Kansanmusiikki
References: Voimistelu
type: YKL-luokka
alternative label: Barnkultur, lekar (79.84+) @sv
alternative label: Bollekar (79.84) @sv
alternative label: Bollspel, lekar (79.84) @sv
alternative label: Lastenkulttuuri, leikit (79.84+)
alternative label: Laululeikit (79.84)
alternative label: Laululeikit, ilman nuottia tai äänitettä (79.84)
alternative label: Leikit (79.84+)
alternative label: Leikkikalut, leikkiohjeet (79.84)
alternative label: Leikkiohjeet (79.84+)
alternative label: Lekar (79.84+) @sv
alternative label: Lekinstruktioner (79.84+) @sv
alternative label: Leksaker, lekinstruktioner (79.84) @sv
alternative label: Lelut, leikkiohjeet (79.84)
alternative label: Liikuntaleikit (79.84)
alternative label: Musiikkileikit (79.84)
alternative label: Musiikkiliikunta, leikit (79.84)
alternative label: Musikgymnastik, lekar (79.84) @sv
alternative label: Musiklekar (79.84) @sv
alternative label: Palloleikit (79.84)
alternative label: Pallopelit, leikit (79.84)
alternative label: Piirileikit (79.84)
alternative label: Ringlekar (79.84) @sv
alternative label: Rörelselekar (79.84) @sv
alternative label: Seuraleikit (79.84+)
alternative label: Sällskapslekar (79.84+) @sv
alternative label: Sånglekar (79.84) @sv
alternative label: Sånglekar, utan noter eller musikinspelning (79.84) @sv
broader: Pelit. Leikit. Keräily
in scheme: YKL - Yleisten kirjastojen luokitusjärjestelmä
notation: 79.84
preferred label: Lekar @sv
preferred label: Plays @en
scope note: Hit sällskapslekar, sånglekar, rörelselekar och musiklekar Om verket innehåller både lekinstruktioner och etnologi, ges företräde åt klass 79.84 Om verket behandlar både lekar och leksaker, ges företräde åt klass 79.84+ @sv
scope note: Tähän seuraleikit, laululeikit, liikuntaleikit ja musiikkileikit Jos teoksessa on sekä leikkiohjeita että kansatiedettä, annetaan etusija luokalle 79.84 Jos teos koskee sekä leikkejä että leikkikaluja, annetaan etusija luokalle 79.84+

Taikatemput
type: Concept
References: Korttipelit
References: Sirkus
type: YKL-luokka
alternative label: Korttitemput (79.85)
alternative label: Korttrick (79.85) @sv
alternative label: Taikatemput (79.85)
alternative label: Taikuriohjeet (79.85)
alternative label: Taikurit (79.85)
alternative label: Trollerihandböcker (79.85) @sv
alternative label: Trollkarlar (79.85) @sv
alternative label: Trollkonster (79.85) @sv
broader: Pelit. Leikit. Keräily
in scheme: YKL - Yleisten kirjastojen luokitusjärjestelmä
notation: 79.85
preferred label: Conjuring tricks @en
preferred label: Trollkonster @sv
scope note: Hur man gör trollkonster Hit också korttrick @sv
scope note: Taikatemppuohjeet Tähän myös korttitemput

Keräily
type: Concept
References: Kirjojen keräily. Bibliofilia
References: KASVITIEDE. SIENITIEDE
References: Hyönteiset
References: Postimerkkeily
References: Taidekauppa
References: Käyttögrafiikka
References: Antiikkiesineiden keräily
References: Rahatiede. Mitalitiede
type: YKL-luokka
alternative label: Autografer, samlande (79.86) @sv
alternative label: Glansbilder, samlande (79.86) @sv
alternative label: Harrastukset, keräily (79.86)
alternative label: Hobbyer, samlarverksamhet (79.86) @sv
alternative label: Keräily (79.86)
alternative label: Keräily, kiiltokuvat (79.86)
alternative label: Keräily, nimikirjoitukset (79.86)
alternative label: Kiiltokuvat, keräily (79.86)
alternative label: Nimikirjoitukset, keräily (79.86)
alternative label: Samlarverksamhet (79.86) @sv
alternative label: Samlarverksamhet, autografer (79.86) @sv
alternative label: Samlarverksamhet, glansbilder (79.86) @sv
broader: Pelit. Leikit. Keräily
in scheme: YKL - Yleisten kirjastojen luokitusjärjestelmä
notation: 79.86
preferred label: Collecting @en
preferred label: Samlarverksamhet @sv
scope note: Hit allmänna verk om samlarverksamhet Hit också sådana former av samlarverksamhet som inte kan föras till klassen för specialområden, t.ex. autografer eller glansbilder @sv
scope note: Tähän keräilyharrastusta koskevat yleisteokset Tähän myös sellainen keräily, mitä ei voi sijoittaa erikoisalan luokkaan, esim. nimikirjoitusten tai kiiltokuvien keräily

Julkiset huvit
type: Concept
References: Elämäntapojen sosiologia. Kulttuurisosiologia
References: Juhlien järjestäminen
References: Kemianteollisuus
References: Hevosurheilu. Ratsastus
type: YKL-luokka
alternative label: Ajanviete, julkiset huvit (79.9+)
alternative label: Baler (79.9) @sv
alternative label: Dans, striptease (79.9) @sv
alternative label: Diskon, allm. (79.9) @sv
alternative label: Diskot, yl 79.9
alternative label: Fyrverkerier (79.9) @sv
alternative label: Fyrverkeripjäser, användning (79.9) @sv
alternative label: Huvipuistot (79.9)
alternative label: Huvit, julkiset (79.9+)
alternative label: Härkätaistelut (79.9)
alternative label: Ilotulitukset (79.9)
alternative label: Ilotulitusvälineet, käyttö (79.9)
alternative label: Iltamat (79.9)
alternative label: Julkiset huvit (79.9+)
alternative label: Karnevaalit (79.9)
alternative label: Karnevaler (79.9) @sv
alternative label: Karuseller (79.9) @sv
alternative label: Karusellit (79.9)
alternative label: Kukkotappelut (79.9)
alternative label: Käärmeenlumoojat (79.9)
alternative label: Maskerader (79.9) @sv
alternative label: Musiikkiklubit, yl. (79.9)
alternative label: Musikklubbar, yl. (79.9) @sv
alternative label: Naamiaiset (79.9)
alternative label: Nattklubbar, allm. (79.9) @sv
alternative label: Nöjen, offentliga (79.9+) @sv
alternative label: Nöjesparker (79.9) @sv
alternative label: Offentliga nöjen (79.9+) @sv
alternative label: Ohjelmatoimistot, huvitilaisuudet (79.9+)
alternative label: Ormtjusare (79.9) @sv
alternative label: Pornografi, strip tease (79.9) @sv
alternative label: Pornografia, strip tease (79.9)
alternative label: Programbyråer, nöjestillställningar (79.9+) @sv
alternative label: Samkväm (79.9) @sv
alternative label: Strip tease (79.9)
alternative label: Tanssi, strip tease -tanssi (79.9)
alternative label: Tanssiaiset (79.9)
alternative label: Tidsfördriv, allmänna nöjen (79.9+) @sv
alternative label: Tivolin (79.9) @sv
alternative label: Tivolit (79.9)
alternative label: Tjurfäktningar (79.9) @sv
alternative label: Tuppfäktning (79.9) @sv
alternative label: Yökerhot, yl. (79.9)
broader: LIIKUNTA. URHEILU. LEIKIT. HUVIT
in scheme: YKL - Yleisten kirjastojen luokitusjärjestelmä
narrower: Sirkus
narrower: Arpajaiset. Veikkaus. Uhkapeli
notation: 79.9
preferred label: Offentliga nöjen @sv
preferred label: Public amusements @en
scope note: Hit och till underklasserna offentliga nöjen och ordnandet av dem Karnevaler. Fyrverkerier. Nöjesparker. Tivolin Baler. Soaréer. Maskerader. Strip tease Tjurfäktning. Tuppfäktning. @sv
scope note: Tähän ja alaluokkiin julkiset huvit ja niiden järjestäminen Karnevaalit. Ilotulitukset. Huvipuistot. Tivolit Tanssiaiset. Iltamat. Naamiaiset. Strip tease Härkätaistelut. Kukkotappelut.

Sirkus
type: Concept
References: Voimailu. Kehonrakennus. Fitness-urheilu
References: Voimistelu
References: Taikatemput
type: YKL-luokka
alternative label: Akrobatia, sirkus (79.91)
alternative label: Akrobatik, cirkus (79.91) @sv
alternative label: Buktaleri, cirkus (79.91) @sv
alternative label: Cirkus (79.91) @sv
alternative label: Cirkusartister, biografier och memoarer (79.91) @sv
alternative label: Clowner, cirkus (79.91) @sv
alternative label: Djurtämjare, cirkus (79.91) @sv
alternative label: Eldslukare, cirkus (79.91) @sv
alternative label: Eläintenkesyttäjät, sirkus (79.91)
alternative label: Esittävät taiteet, sirkus (79.91)
alternative label: Esitykset, sirkus (79.91)
alternative label: Experimentell cirkus (79.91) @sv
alternative label: Fakiirit, sirkus (79.91)
alternative label: Fakirer, cirkus (79.91) @sv
alternative label: Föreställande konst, cirkus (79.91) @sv
alternative label: Föreställningar, cirkus (79.91) @sv
alternative label: Gymnastik, cirkus (79.91) @sv
alternative label: Jonglörer, cirkus (79.91) @sv
alternative label: Jonglöörit, sirkus (79.91)
alternative label: Kahlekuninkaat, sirkus (79.91)
alternative label: Klovnit, sirkus (79.91)
alternative label: Kokeellinen sirkus (79.91)
alternative label: Nycirkus (79.91) @sv
alternative label: Nykysirkus (79.91)
alternative label: Sirkus (79.91)
alternative label: Sirkustaiteilijat, elämäkerrat ja muistelmat (79.91)
alternative label: Taitovoimistelu, sirkus (79.91)
alternative label: Trapetsitaiteilijat, sirkus (79.91)
alternative label: Trapetskonstnärer, cirkus (79.91) @sv
alternative label: Tulennielijät, sirkus (79.91)
alternative label: Utbrytarkungar, cirkus (79.91) @sv
alternative label: Uusi sirkus (79.91)
alternative label: Vatsastapuhuminen, sirkus (79.91)
broader: Julkiset huvit
in scheme: YKL - Yleisten kirjastojen luokitusjärjestelmä
notation: 79.91
preferred label: Circus @en
preferred label: Cirkus @sv
scope note: Clowner. Jonglörer. Trapetskonstnärer Hit också t.ex. akrobatik-, atletik- och djurnummer på cirkus @sv
scope note: Klovnit. Jonglöörit. Trapetsitaiteilijat Tähän myös esim. akrobatia-, voimailu- ja eläinnumerot sirkuksessa

Arpajaiset. Veikkaus. Uhkapeli
type: Concept
References: Hevosurheilu. Ratsastus
References: Pelit
type: YKL-luokka
alternative label: Arpajaiset (79.92)
alternative label: Bingo (79.92)
alternative label: Lotterier (79.92) @sv
alternative label: Lotto (79.92)
alternative label: Pajatso (79.92)
alternative label: Pelit, uhkapelit (79.92)
alternative label: Penningautomater (79.92) @sv
alternative label: Penninglotterier (79.92) @sv
alternative label: Raha-arpajaiset (79.92)
alternative label: Raha-automaatit (79.92)
alternative label: Rahapelit (79.92)
alternative label: Raviveikkaus (79.92)
alternative label: Rulett (79.92) @sv
alternative label: Ruletti (79.92)
alternative label: Spel om pengar (79.92) @sv
alternative label: Spel, hasardspel (79.92) @sv
alternative label: Spelautomat (79.92) @sv
alternative label: Tippning (79.92) @sv
alternative label: Totalisatorspel (79.92) @sv
alternative label: Toto (79.92)
alternative label: Uhkapeli (79.92)
alternative label: Vadslagning (79.92) @sv
alternative label: Vedonlyönti (79.92)
alternative label: Veikkaus (79.92)
alternative label: Vågspel (79.92) @sv
broader: Julkiset huvit
in scheme: YKL - Yleisten kirjastojen luokitusjärjestelmä
notation: 79.92
preferred label: Lotterier. Tippning. Hasardspel @sv
preferred label: Lotteries. Pools. Gambling @en
scope note: Bingo. Lotto. Rulett. Toto. Vadslagning. Pajazzo @sv
scope note: Bingo. Lotto. Ruletti. Toto. Vedonlyönti. Pajatso

KAUNOKIRJALLISUUS. KIRJALLISUUSTIEDE. KIELITIEDE
type: Concept
type: YKL-luokka
in scheme: YKL - Yleisten kirjastojen luokitusjärjestelmä
narrower: KAUNOKIRJALLISET SEKASISÄLTÖISET TEOKSET
narrower: KANSANRUNOUS
narrower: RUNOT
narrower: NÄYTELMÄT
narrower: KERTOMAKIRJALLISUUS
narrower: SADUT. KUVAKIRJAT. SARJAKUVAT
narrower: KIRJALLISUUSTIEDE
narrower: KIELITIEDE
narrower: SUOMALAIS-UGRILAISET JA URALILAISET KIELET
narrower: INDOEUROOPPALAISET KIELET. MUUT KIELET
notation: 8
preferred label: FICTION AND POETRY LITERARY STUDIES. LINGUISTICS @en
preferred label: SKÖNLITTERATUR. LITTERATURVETENSKAP SPRÅKVETENSKAP @sv
top concept of: YKL - Yleisten kirjastojen luokitusjärjestelmä

KAUNOKIRJALLISET SEKASISÄLTÖISET TEOKSET
type: Concept
References: YLEISET KOKOOMATEOKSET
References: KANSANRUNOUS
References: RUNOT
References: NÄYTELMÄT
References: KERTOMAKIRJALLISUUS
References: SADUT. KUVAKIRJAT. SARJAKUVAT
References: KIRJALLISUUSTIEDE
References: KIELITIEDE
References: SUOMALAIS-UGRILAISET JA URALILAISET KIELET
References: INDOEUROOPPALAISET KIELET. MUUT KIELET
alternative label: Aapiset (80+)
alternative label: Abc-böcker (80+) @sv
alternative label: Anagram, skönlitteratur (80 ... 85+) @sv
alternative label: Anagrammit, kaunokirjallisuus (80 ... 85+)
alternative label: Animaatioelokuvat, tallenteet, fiktiiviset (80 ... 85+)
alternative label: Animationsfilmer, inspelningar, fiktiva (80 ... 85+) @sv
alternative label: Antologiat, kaunokirjallisuus (80 ... 85+)
alternative label: Antologier, skönlitteratur (80 ... 85+) @sv
alternative label: Barnfilmer, animationsfilmer, fiktiva, inspelningar (80 ... 85+) @sv
alternative label: Barnlitteratur, skönlitteratur (80 ... 85+) @sv
alternative label: Dataprogram, skönlitteratur (80 ... 85+) @sv
alternative label: Dialektlitteratur, skönlitteratur (80 ... 85+) @sv
alternative label: Dockfilmer, fiktiva (80 ... 85+) @sv
alternative label: Elokuvat, animaatioelokuvat, fiktiiviset, tallenteet (80 ... 85+)
alternative label: Fantasiaelokuvat, animaatioelokuvat, tallenteet (80 ... 85+)
alternative label: Fantasyfilmer, animationsfilmer, inspelningar (80 ... 85+) @sv
alternative label: Filmer, animationsfilmer, fiktiva, inspelningar (80 ... 85+) @sv
alternative label: Kaunokirjallisuus (80 ... 85+)
alternative label: Kaunokirjallisuus, sekasisältöiset teokset (80+)
alternative label: Kirjalliset äänitteet, kaunokirjallisuus (80 ... 85+)
alternative label: Kirjallisuusäänitteet, kaunokirjallisuus (80 ... 85+)
alternative label: Kokoomateokset, kaunokirjallisuus (80 ... 85+)
alternative label: Konst, litteratur (80 ... 86+) @sv
alternative label: Konstformer, litteratur (80 ... 86+) @sv
alternative label: Kootut teokset, kaunokirjallisuus (80 ... 85+)
alternative label: Krestomatier, skönlitteratur (80 ... 85+) @sv
alternative label: Lastenelokuvat, animaatioelokuvat, fiktiiviset, tallenteet (80 ... 85+)
alternative label: Lastenkirjallisuus, kaunokirjallisuus (80 ... 85+)
alternative label: Litteraturinspelningar, skönlitteratur (80 ... 85+) @sv
alternative label: Litterära ljudupptagningar, skönlitteratur (80 ... 85+) @sv
alternative label: Ljudupptagningar, skönlitteratur (80 ... 85+) @sv
alternative label: Lukemistot, kaunokirjallisuus (80 ... 85+)
alternative label: Lukukirjat, kaunokirjallisuus (80 ... 85+)
alternative label: Läseböcker, skönlitteratur (80 ... 85+) @sv
alternative label: Murrekirjallisuus, kaunokirjallisuus (80 ... 85+)
alternative label: Musiikkielokuvat, animaatioelokuvat, fiktiiviset, tallenteet (80 ... 85+)
alternative label: Musikfilmer, animationsfilmer, fiktiva, inspelningar (80 ... 85+) @sv
alternative label: Nukke-elokuvat, fiktiiviset (80 ... 85+)
alternative label: Nuortenelokuvat, animaatioelokuvat, fiktiiviset, tallenteet (80 ... 85+)
alternative label: Nuortenkirjallisuus, kaunokirjallisuus (80 ... 85+)
alternative label: Ohjelmistot, kaunokirjallisuus (80 ... 85+)
alternative label: Ordlekar, skönlitteratur (80 ... 85+) @sv
alternative label: Palindromer, skönlitteratur (80 ... 85+) @sv
alternative label: Palindromit, kaunokirjallisuus (80 ... 85+)
alternative label: Piirretyt elokuvat, fiktiiviset (80 ... 85+)
alternative label: Samlade verk, skönlitteratur (80 ... 85+) @sv
alternative label: Samlingsverk, skönlitteratur (80 ... 85+) @sv
alternative label: Sanaleikit, kaunokirjallisuus (80 ... 85+)
alternative label: Skönlitteratur (80 ... 85+) @sv
alternative label: Taide, kirjallisuus (80 ... 86+)
alternative label: Taidemuodot, kirjallisuus (80 ... 86+)
alternative label: Taiteet, kirjallisuus (80 ... 86+)
alternative label: Televisio-ohjelmat, tallenteet, fiktiiviset elokuvat ja sarjat (80 ... 85+)
alternative label: Valitut teokset, kaunokirjallisuus (80 ... 85+)
alternative label: Äänikirjat, kaunokirjallisuus (80 ... 85+)
alternative label: Äänitteet, kaunokirjallisuus (80 ... 85+)
broader: KAUNOKIRJALLISUUS. KIRJALLISUUSTIEDE. KIELITIEDE
in scheme: YKL - Yleisten kirjastojen luokitusjärjestelmä
narrower: Suomenkieliset kaunokirjalliset sekasisältöiset teokset
narrower: Pohjoismaisilla kielillä julkaistut kaunokirjalliset sekasisältöiset teokset
narrower: Saksankieliset kaunokirjalliset sekasisältöiset teokset
narrower: Englanninkieliset kaunokirjalliset sekasisältöiset teokset
narrower: Romaanisilla kielillä julkaistut kaunokirjalliset sekasisältöiset teokse
narrower: Slaavilaisilla ja balttilaisilla kielillä julkaistut kaunokirjalliset sekasisältöiset teokset
narrower: Muilla indoeurooppalaisilla kielillä julkaistut kaunokirjalliset sekasisältöiset teokset
narrower: Muilla kielillä julkaistut kaunokirjalliset sekasisältöiset teokset
notation: 80
scope note: Hit och till underklasserna skönlitterära samlingsverk, urval, antologier, läseböcker, programsamlingar och ABC-böcker med blandat innehåll. Verket klassificeras enligt publikationens språk, inte enligt originalspråk eller publikationsland. Om det ena språket i en tvåspråkig publikation är översättningsspråk klassificeras verket enligt detta språk. Om texterna i ett två- eller flerspråkigt verk inte är översättningar av varandra klassificeras verket enligt publikationens huvudspråk. Om verket inte har något huvudspråk klassificeras det enligt det första språket i publikationen. Om tyngdpunkten i verket ligger på någon speciell skönlitterär genre, ges företräde åt klasserna 81-85. Om verket innehåller texter från olika genrer inom klass 84+, klassificeras verket som 84+. Formtilläggen 01, 02, 03+, 06+, 07, 08+ och 09 används inte i samband med klasserna 80-85+ Formtillägget 04 används inte i samband med klasserna 80-80.991 @sv
scope note: Tähän ja alaluokkiin kaunokirjalliset sekasisältöiset kokoelmat, valikoimat, antologiat, lukemistot, lukukirjat, ohjelmistot ja aapiset. Teokset luokitetaan julkaisun kielen, ei julkaisumaan tai alkuteoksen kielen mukaan. Jos kaksikielisen teoksen toinen kieli on käännöskieli, luokitetaan teos käännöskielen mukaan. Jos kaksi- tai useampikielisen teoksen tekstit eivät ole toistensa käännöksiä, luokitetaan teos julkaisun pääkielen mukaan. Jos teoksella ei ole pääkieltä, se luokitetaan julkaisun ensimmäisen kielen mukaan. Jos teos painottuu johonkin kaunokirjallisuuden lajiin, annetaan etusija luokille 81-85+. Mikäli teos sisältää luokkaan 84+ kuuluvia eri tekstilajeja, teos luokitetaan luokkaan 84+. Muotoluokkia 01, 02, 03+, 06+, 07, 08+ ja 09 ei käytetä luokkien 80-85+ yhteydessä Muotoluokkaa 04 ei käytetä luokkien 80-80.991 yhteydessä

Suomenkieliset kaunokirjalliset sekasisältöiset teokset
type: Concept
type: YKL-luokka
alternative label: Finsk skönlitteratur, verk med blandat innehåll (80.2) @sv
alternative label: Finska, skönlitterära verk med blandat innehåll (80.2) @sv
alternative label: Suomen kieli, kaunokirjalliset sekasisältöiset teokset (80.2)
alternative label: Suomenkielinen kaunokirjallisuus, sekasisältöiset teokset (80.2)
broader: KAUNOKIRJALLISET SEKASISÄLTÖISET TEOKSET
in scheme: YKL - Yleisten kirjastojen luokitusjärjestelmä
narrower: Meänkieliset kaunokirjalliset sekasisältöiset teokset
narrower: Kveeninkieliset kaunokirjalliset sekasisältöiset teokset
narrower: Vironkieliset kaunokirjalliset sekasisältöiset teokset
narrower: Muilla itämerensuomalaisilla kielillä julkaistut kaunokirjalliset sekasisältöiset teokset
narrower: Muilla suomalais-ugrilaisilla ja uralilaisilla kielillä julkaistut kaunokirjalliset sekasisältöiset teokset
notation: 80.2
preferred label: Fictional works of varied contents in Finnish @en
preferred label: Skönlitterära verk på finska med blandat innehåll @sv

Meänkieliset kaunokirjalliset sekasisältöiset teokset
type: Concept
type: YKL-luokka
alternative label: Meänkieli, kaunokirjalliset sekasisältöiset teokset (80.21)
alternative label: Meänkieli, skönlitterära verk med blandat innehåll (80.21) @sv
alternative label: Meänkielinen kaunokirjallisuus, sekasisältöiset teokset (80.21)
alternative label: Tornedalsfinska, skönlitterrära verk med blandat innehåll (80.21) @sv
broader: Suomenkieliset kaunokirjalliset sekasisältöiset teokset
in scheme: YKL - Yleisten kirjastojen luokitusjärjestelmä
notation: 80.21
preferred label: Fictional works of varied contents in Meänkieli @en
preferred label: Skönlitterära verk på meänkieli med blandat innehåll @sv

Kveeninkieliset kaunokirjalliset sekasisältöiset teokset
type: Concept
type: YKL-luokka
alternative label: Kveenin kieli, kaunokirjalliset sekasisältöiset teokset (80.22)
alternative label: Kveeninkielinen kaunokirjallisuus, sekasisältöiset teokset (80.22)
alternative label: Kvänsk skönlitteratur, verk med blandat innehåll (80.22) @sv
alternative label: Kvänska, skönlitterära verk med blandat innehåll (80.22) @sv
broader: Suomenkieliset kaunokirjalliset sekasisältöiset teokset
in scheme: YKL - Yleisten kirjastojen luokitusjärjestelmä
notation: 80.22
preferred label: Fictional works of varied contents in Kven language @en
preferred label: Skönlitterära verk på estniska med blandat innehåll @sv

Vironkieliset kaunokirjalliset sekasisältöiset teokset
type: Concept
type: YKL-luokka
alternative label: Estnisk skönlitteratur, verk med blandat innehåll (80.23) @sv
alternative label: Estniska, skönlitterära verk med blandat innehåll (80.23) @sv
alternative label: Viron kieli, kaunokirjalliset sekasisältöiset teokset (80.23)
alternative label: Vironkielinen kaunokirjallisuus, sekasisältöiset teokset (80.23)
broader: Suomenkieliset kaunokirjalliset sekasisältöiset teokset
in scheme: YKL - Yleisten kirjastojen luokitusjärjestelmä
notation: 80.23
preferred label: Fictional works of varied contents in Estonian @en
preferred label: Skönlitterära verk på estniska med blandat innehåll @sv

Muilla itämerensuomalaisilla kielillä julkaistut kaunokirjalliset sekasisältöiset teokset
type: Concept
type: YKL-luokka
broader: Suomenkieliset kaunokirjalliset sekasisältöiset teokset
in scheme: YKL - Yleisten kirjastojen luokitusjärjestelmä
narrower: Karjalankieliset kaunokirjalliset sekasisältöiset teokset
notation: 80.24
preferred label: Fictional works of varied contents in other Balto-Finnic languages @en
preferred label: Skönlitterära verk på övriga östersjöfinska språk med blandat innehåll @sv

Karjalankieliset kaunokirjalliset sekasisältöiset teokset
type: Concept
type: YKL-luokka
alternative label: Karelsk litteratur, verk med blandat innehåll (80.241) @sv
alternative label: Karelska, verk med blandat innehåll (80.241) @sv
alternative label: Karjalan kieli, kaunokirjalliset sekasisältöiset teokset (80.241)
alternative label: Karjalankielinen kirjallisuus, sekasisältöiset teokset (80.241)
broader: Muilla itämerensuomalaisilla kielillä julkaistut kaunokirjalliset sekasisältöiset teokset
in scheme: YKL - Yleisten kirjastojen luokitusjärjestelmä
notation: 80.241
preferred label: Fictional works of varied contents in Karelian language @en
preferred label: Skönlitterära verk på karelska med blandat innehåll @sv

Muilla suomalais-ugrilaisilla ja uralilaisilla kielillä julkaistut kaunokirjalliset sekasisältöiset teokset
type: Concept
type: YKL-luokka
broader: Suomenkieliset kaunokirjalliset sekasisältöiset teokset
in scheme: YKL - Yleisten kirjastojen luokitusjärjestelmä
narrower: Unkarinkieliset kaunokirjalliset sekasisältöiset teokset
narrower: Saamenkieliset kaunokirjalliset sekasisältöiset teokset
notation: 80.25
preferred label: Fictional works of varied contents in other Finno-Ugric and Uralic languages @en
preferred label: Skönlitterära verk på övriga finsk-ugriska och uraliska språk med blandat innehåll @sv

Unkarinkieliset kaunokirjalliset sekasisältöiset teokset
type: Concept
type: YKL-luokka
alternative label: Ungersk skönlitteratur, verk med blandat innehåll (80.251) @sv
alternative label: Ungerska, skönlitterära verk med blandat innehåll (80.251) @sv
alternative label: Unkarin kieli, kaunokirjalliset sekasisältöiset teokset (80.251)
alternative label: Unkarinkielinen kaunokirjallisuus, sekasisältöiset teokset (80.251)
broader: Muilla suomalais-ugrilaisilla ja uralilaisilla kielillä julkaistut kaunokirjalliset sekasisältöiset teokset
in scheme: YKL - Yleisten kirjastojen luokitusjärjestelmä
notation: 80.251
preferred label: Fictional works of varied contents in Hungarian @en
preferred label: Skönlitterära verk på ungerska med blandat innehåll @sv

Saamenkieliset kaunokirjalliset sekasisältöiset teokset
type: Concept
type: YKL-luokka
alternative label: Saamen kieli, kaunokirjalliset sekasisältöiset teokset (80.252)
alternative label: Saamenkielinen kaunokirjallisuus, sekasisältöiset teokset (80.252)
alternative label: Samisk skönlitteratur, verk med blandat innehåll (80.252) @sv
alternative label: Samiska, skönlitterära verk med blandat innehåll (80.252) @sv
broader: Muilla suomalais-ugrilaisilla ja uralilaisilla kielillä julkaistut kaunokirjalliset sekasisältöiset teokset
in scheme: YKL - Yleisten kirjastojen luokitusjärjestelmä
notation: 80.252
preferred label: Fictional works of varied contents in Sami @en
preferred label: Skönlitterära verk på samiska med blandat innehåll @sv

Pohjoismaisilla kielillä julkaistut kaunokirjalliset sekasisältöiset teokset
type: Concept
type: YKL-luokka
broader: KAUNOKIRJALLISET SEKASISÄLTÖISET TEOKSET
in scheme: YKL - Yleisten kirjastojen luokitusjärjestelmä
narrower: Ruotsinkieliset kaunokirjalliset sekasisältöiset teokset
narrower: Norjankieliset kaunokirjalliset sekasisältöiset teokset
narrower: Tanskankieliset kaunokirjalliset sekasisältöiset teokset
narrower: Islanninkieliset kaunokirjalliset sekasisältöiset teokset
narrower: Fäärinkieliset kaunokirjalliset sekasisältöiset teokset
notation: 80.3
preferred label: Fictional works of varied contents in Nordic languages @en
preferred label: Skönlitterära verk på nordiska språk med blandat innehåll @sv

Ruotsinkieliset kaunokirjalliset sekasisältöiset teokset
type: Concept
type: YKL-luokka
alternative label: Ruotsin kieli, kaunokirjalliset sekasisältöiset teokset (80.31)
alternative label: Ruotsinkielinen kaunokirjallisuus, sekasisältöiset teokset (80.31)
alternative label: Svensk skönlitteratur, verk med blandat innehåll (80.31) @sv
alternative label: Svenska, skönlitterära verk med blandat innehåll (80.31) @sv
broader: Pohjoismaisilla kielillä julkaistut kaunokirjalliset sekasisältöiset teokset
in scheme: YKL - Yleisten kirjastojen luokitusjärjestelmä
notation: 80.31
preferred label: Fictional works of varied contents in Swedish @en
preferred label: Skönlitterära verk på svenska med blandat innehåll @sv

Norjankieliset kaunokirjalliset sekasisältöiset teokset
type: Concept
type: YKL-luokka
alternative label: Norjan kieli, kaunokirjalliset sekasisältöiset teokset (80.32)
alternative label: Norjankielinen kaunokirjallisuus, sekasisältöiset teokset (80.32)
alternative label: Norsk skönlitteratur, verk med blandat innehåll (80.32) @sv
alternative label: Norska, skönlitterära verk med blandat innehåll (80.32) @sv
broader: Pohjoismaisilla kielillä julkaistut kaunokirjalliset sekasisältöiset teokset
in scheme: YKL - Yleisten kirjastojen luokitusjärjestelmä
notation: 80.32
preferred label: Fictional works of varied contents in Norwegian @en
preferred label: Skönlitterära verk på norska med blandat innehåll @sv

Tanskankieliset kaunokirjalliset sekasisältöiset teokset
type: Concept
type: YKL-luokka
alternative label: Dansk skönlitteratur, verk med blandat innehåll (80.33) @sv
alternative label: Danska, skönlitterära verk med blandat innehåll (80.33) @sv
alternative label: Tanskan kieli, kaunokirjalliset sekasisältöiset teokset (80.33)
alternative label: Tanskankielinen kaunokirjallisuus, sekasisältöiset teokset (80.33)
broader: Pohjoismaisilla kielillä julkaistut kaunokirjalliset sekasisältöiset teokset
in scheme: YKL - Yleisten kirjastojen luokitusjärjestelmä
notation: 80.33
preferred label: Fictional works of varied contents in Danish @en
preferred label: Skönlitterära verk på danska med blandat innehåll @sv

Islanninkieliset kaunokirjalliset sekasisältöiset teokset
type: Concept
type: YKL-luokka
alternative label: Islannin kieli, kaunokirjalliset sekasisältöiset teokset (80.34)
alternative label: Islanninkielinen kaunokirjallisuus, sekasisältöiset teokset (80.34)
alternative label: Isländsk skönlitteratur, verk med blandat innehåll (80.34) @sv
alternative label: Isländska, skönlitterära verk med blandat innehåll (80.34) @sv
broader: Pohjoismaisilla kielillä julkaistut kaunokirjalliset sekasisältöiset teokset
in scheme: YKL - Yleisten kirjastojen luokitusjärjestelmä
notation: 80.34
preferred label: Fictional works of varied contents in Icelandic @en
preferred label: Skönlitterära verk på isländska med blandat innehåll @sv

Fäärinkieliset kaunokirjalliset sekasisältöiset teokset
type: Concept
type: YKL-luokka
alternative label: Färöisk skönlitteratur, verk med blandat innehåll (80.35) @sv
alternative label: Färöiska, skönlitterära verk med blandat innehåll (80.35) @sv
alternative label: Fäärin kieli, kaunokirjalliset sekasisältöiset teokset (80.35)
alternative label: Fäärinkielinen kaunokirjallisuus, sekasisältöiset teokset (80.35)
broader: Pohjoismaisilla kielillä julkaistut kaunokirjalliset sekasisältöiset teokset
in scheme: YKL - Yleisten kirjastojen luokitusjärjestelmä
notation: 80.35
preferred label: Fictional works of varied contents in Faeroese @en
preferred label: Skönlitterära verk på färöiska med blandat innehåll @sv

Saksankieliset kaunokirjalliset sekasisältöiset teokset
type: Concept
type: YKL-luokka
alternative label: Saksan kieli, kaunokirjalliset sekasisältöiset teokset (80.4)
alternative label: Saksankielinen kaunokirjallisuus, sekasisältöiset teokset (80.4)
alternative label: Tysk skönlitteratur, verk med blandat innehåll (80.4) @sv
alternative label: Tyska, skönlitterära verk med blandat innehåll (80.4) @sv
broader: KAUNOKIRJALLISET SEKASISÄLTÖISET TEOKSET
in scheme: YKL - Yleisten kirjastojen luokitusjärjestelmä
narrower: Jiddišinkieliset kaunokirjalliset sekasisältöiset teokset
narrower: Friisinkieliset kaunokirjalliset sekasisältöiset teokset
narrower: Hollanninkieliset kaunokirjalliset sekasisältöiset teokset
notation: 80.4
preferred label: Fictional works of varied contents in German @en
preferred label: Skönlitterära verk på tyska med blandat innehåll @sv
scope note: Hit och till underklassen också verk på övriga germanska språk @sv
scope note: Tähän ja alaluokkaan myös muilla germaanisilla kielillä julkaistut

Jiddišinkieliset kaunokirjalliset sekasisältöiset teokset
type: Concept
type: YKL-luokka
alternative label: Jiddisch, skönlitterära verk med blandat innehåll (80.41) @sv
alternative label: Jiddišin kieli, kaunokirjalliset sekasisältöiset teokset (80.41)
broader: Saksankieliset kaunokirjalliset sekasisältöiset teokset
in scheme: YKL - Yleisten kirjastojen luokitusjärjestelmä
notation: 80.41
preferred label: Fictional works of varied contents in Yiddish language @en
preferred label: Skönlitterära verk på jiddisch med blandat innehåll @sv

Friisinkieliset kaunokirjalliset sekasisältöiset teokset
type: Concept
type: YKL-luokka
broader: Saksankieliset kaunokirjalliset sekasisältöiset teokset
in scheme: YKL - Yleisten kirjastojen luokitusjärjestelmä
notation: 80.43
preferred label: Fictional works of varied contents in Frisian @en
preferred label: Skönlitterära verk på frisiska med blandat innehåll @sv

Hollanninkieliset kaunokirjalliset sekasisältöiset teokset
type: Concept
type: YKL-luokka
alternative label: Hollannin kieli, kaunokirjalliset sekasisältöiset teokset (80.48)
alternative label: Hollanninkielinen kaunokirjallisuus, sekasisältöiset teokset (80.48)
alternative label: Nederländsk skönlitteratur, verk med blandat innehåll (80.48) @sv
alternative label: Nederländska, skönlitterära verk med blandat innehåll (80.48) @sv
broader: Saksankieliset kaunokirjalliset sekasisältöiset teokset
in scheme: YKL - Yleisten kirjastojen luokitusjärjestelmä
narrower: Afrikaansinkieliset kaunokirjalliset sekasisältöiset teokset
notation: 80.48
preferred label: Fictional works of varied contents in Dutch @en
preferred label: Skönlitterära verk på holländska med blandat innehåll @sv
scope note: Hit också verk på flamländska @sv
scope note: Tähän myös flaaminkieliset

Afrikaansinkieliset kaunokirjalliset sekasisältöiset teokset
type: Concept
type: YKL-luokka
alternative label: Afrikaans, skönlitterära verk med blandat innehåll (80.481) @sv
alternative label: Afrikaansin kieli, kaunokirjalliset sekasisältöiset teokset (80.481)
broader: Hollanninkieliset kaunokirjalliset sekasisältöiset teokset
in scheme: YKL - Yleisten kirjastojen luokitusjärjestelmä
notation: 80.481
preferred label: Fictional works of varied contents in Afrikaans language @en
preferred label: Skönlitterära verk på afrikaans med blandat innehåll @sv

Englanninkieliset kaunokirjalliset sekasisältöiset teokset
type: Concept
type: YKL-luokka
alternative label: Engelsk skönlitteratur, verk med blandat innehåll (80.5) @sv
alternative label: Engelska, skönlitterära verk med blandat innehåll (80.5) @sv
alternative label: Englannin kieli, kaunokirjalliset sekasisältöiset teokset (80.5)
alternative label: Englanninkielinen kaunokirjallisuus, sekasisältöiset teokset (80.5)
broader: KAUNOKIRJALLISET SEKASISÄLTÖISET TEOKSET
in scheme: YKL - Yleisten kirjastojen luokitusjärjestelmä
notation: 80.5
preferred label: Fictional works of varied contents in English @en
preferred label: Skönlitterära verk på engelska med blandat innehåll @sv

Romaanisilla kielillä julkaistut kaunokirjalliset sekasisältöiset teokse
type: Concept
type: YKL-luokka
broader: KAUNOKIRJALLISET SEKASISÄLTÖISET TEOKSET
in scheme: YKL - Yleisten kirjastojen luokitusjärjestelmä
narrower: Ranskankieliset kaunokirjalliset sekasisältöiset teokset
narrower: Italiankieliset kaunokirjalliset sekasisältöiset teokset
narrower: Espanjankieliset kaunokirjalliset sekasisältöiset teokset
narrower: Portugalinkieliset kaunokirjalliset sekasisältöiset teokset
narrower: Romaniankieliset kaunokirjalliset sekasisältöiset teokset
narrower: Muilla romaanisilla kielillä julkaistut kaunokirjalliset sekasisältöiset teokset
notation: 80.6
preferred label: Fictional works of varied contents in Romanic languages @en
preferred label: Skönlitterära verk på romanska språk med blandat innehåll @sv

Ranskankieliset kaunokirjalliset sekasisältöiset teokset
type: Concept
type: YKL-luokka
alternative label: Fransk skönlitteratur, verk med blandat innehåll (80.61) @sv
alternative label: Franska, skönlitterära verk med blandat innehåll (80.61) @sv
alternative label: Ranskan kieli, kaunokirjalliset sekasisältöiset teokset (80.61)
alternative label: Ranskankielinen kaunokirjallisuus, sekasisältöiset teokset (80.61)
broader: Romaanisilla kielillä julkaistut kaunokirjalliset sekasisältöiset teokse
in scheme: YKL - Yleisten kirjastojen luokitusjärjestelmä
notation: 80.61
preferred label: Fictional works of varied contents in French @en
preferred label: Skönlitterära verk på franska med blandat innehåll @sv

Italiankieliset kaunokirjalliset sekasisältöiset teokset
type: Concept
type: YKL-luokka
alternative label: Italian kieli, kaunokirjalliset sekasisältöiset teokset (80.62)
alternative label: Italiankielinen kaunokirjallisuus, sekasisältöiset teokset (80.62)
alternative label: Italiensk skönlitteratur, verk med blandat innehåll (80.62) @sv
alternative label: Italienska, skönlitterära verk med blandat innehåll (80.62) @sv
broader: Romaanisilla kielillä julkaistut kaunokirjalliset sekasisältöiset teokse
in scheme: YKL - Yleisten kirjastojen luokitusjärjestelmä
notation: 80.62
preferred label: Fictional works of varied contents in Italian @en
preferred label: Skönlitterära verk på italienska med blandat innehåll @sv

Espanjankieliset kaunokirjalliset sekasisältöiset teokset
type: Concept
type: YKL-luokka
alternative label: Espanjan kieli, kaunokirjalliset sekasisältöiset teokset (80.63)
alternative label: Espanjankielinen kaunokirjallisuus, sekasisältöiset teokset (80.63)
alternative label: Spansk skönlitteratur, verk med blandat innehåll (80.63) @sv
alternative label: Spanska, skönlitterära verk med blandat innehåll (80.63) @sv
broader: Romaanisilla kielillä julkaistut kaunokirjalliset sekasisältöiset teokse
in scheme: YKL - Yleisten kirjastojen luokitusjärjestelmä
notation: 80.63
preferred label: Fictional works of varied contents in Spanish @en
preferred label: Skönlitterära verk på spanska med blandat innehåll @sv

Portugalinkieliset kaunokirjalliset sekasisältöiset teokset
type: Concept
type: YKL-luokka
alternative label: Portugalin kieli, kaunokirjalliset sekasisältöiset teokset (80.64)
alternative label: Portugalinkielinen kaunokirjallisuus, sekasisältöiset teokset (80.64)
alternative label: Portugisisk skönlitteratur, verk med blandat innehåll (80.64) @sv
alternative label: Portugisiska, skönlitterära verk med blandat innehåll (80.64) @sv
broader: Romaanisilla kielillä julkaistut kaunokirjalliset sekasisältöiset teokse
in scheme: YKL - Yleisten kirjastojen luokitusjärjestelmä
notation: 80.64
preferred label: Fictional works of varied contents in Portuguese @en
preferred label: Skönlitterära verk på portugisiska med blandat innehåll @sv

Romaniankieliset kaunokirjalliset sekasisältöiset teokset
type: Concept
type: YKL-luokka
alternative label: Romanian kieli, kaunokirjalliset sekasisältöiset teokset (80.65)
alternative label: Romaniankielinen kaunokirjallisuus, sekasisältöiset teokset (80.65)
alternative label: Rumänsk skönlitteratur, verk med blandat innehåll (80.65) @sv
alternative label: Rumänska, skönlitterära verk med blandat innehåll (80.65) @sv
broader: Romaanisilla kielillä julkaistut kaunokirjalliset sekasisältöiset teokse
in scheme: YKL - Yleisten kirjastojen luokitusjärjestelmä
notation: 80.65
preferred label: Fictional works of varied contents in Romanian @en
preferred label: Skönlitterära verk på rumänska med blandat innehåll @sv

Muilla romaanisilla kielillä julkaistut kaunokirjalliset sekasisältöiset teokset
type: Concept
type: YKL-luokka
broader: Romaanisilla kielillä julkaistut kaunokirjalliset sekasisältöiset teokse
in scheme: YKL - Yleisten kirjastojen luokitusjärjestelmä
narrower: Katalaaninkieliset kaunokirjalliset sekasisältöiset teokset
notation: 80.67
preferred label: Fictional works of varied contents In other Romanic languages @en
preferred label: Skönlitterära verk på övriga romanska språk med blandat innehåll @sv

Katalaaninkieliset kaunokirjalliset sekasisältöiset teokset
type: Concept
type: YKL-luokka
alternative label: Katalaanin kieli, kaunokirjalliset sekasisältöiset teokset (80.671)
alternative label: Katalanska, skönlitterära verk med blandat innehåll (80.671) @sv
broader: Muilla romaanisilla kielillä julkaistut kaunokirjalliset sekasisältöiset teokset
in scheme: YKL - Yleisten kirjastojen luokitusjärjestelmä
notation: 80.671
preferred label: Fictional works of varied contents in Catalan language @en
preferred label: Skönlitterära verk på katalanska med blandat innehåll @sv

Slaavilaisilla ja balttilaisilla kielillä julkaistut kaunokirjalliset sekasisältöiset teokset
type: Concept
type: YKL-luokka
broader: KAUNOKIRJALLISET SEKASISÄLTÖISET TEOKSET
in scheme: YKL - Yleisten kirjastojen luokitusjärjestelmä
narrower: Venäjänkieliset kaunokirjalliset sekasisältöiset teokset
narrower: Ukrainan- ja valkovenäjänkieliset kaunokirjalliset sekasisältöiset teokset
narrower: Puolankieliset kaunokirjalliset sekasisältöiset teokset
narrower: Tšekinkieliset kaunokirjalliset sekasisältöiset teokset
narrower: Slovakinkieliset kaunokirjalliset sekasisältöiset teokset
narrower: Eteläslaavilaisilla kielillä julkaistut kaunokirjalliset sekasisältöiset teokset
narrower: Balttilaisilla kielillä julkaistut kaunokirjalliset sekasisältöiset teokset
notation: 80.7
preferred label: Fictional works of varied contents in Slavonic and Baltic languages @en
preferred label: Skönlitterära verk på slaviska och baltiska språk med blandat innehåll @sv

Venäjänkieliset kaunokirjalliset sekasisältöiset teokset
type: Concept
type: YKL-luokka
alternative label: Rysk skönlitteratur, verk med blandat innehåll (80.71) @sv
alternative label: Ryska, skönlitterära verk med blandat innehåll (80.71) @sv
alternative label: Venäjän kieli, kaunokirjalliset sekasisältöiset teokset (80.71)
alternative label: Venäjänkielinen kaunokirjallisuus, sekasisältöiset teokset (80.71)
broader: Slaavilaisilla ja balttilaisilla kielillä julkaistut kaunokirjalliset sekasisältöiset teokset
in scheme: YKL - Yleisten kirjastojen luokitusjärjestelmä
notation: 80.71
preferred label: Fictional works of varied contents in Russian @en
preferred label: Skönlitterära verk på ryska med blandat innehåll @sv

Ukrainan- ja valkovenäjänkieliset kaunokirjalliset sekasisältöiset teokset
type: Concept
type: YKL-luokka
broader: Slaavilaisilla ja balttilaisilla kielillä julkaistut kaunokirjalliset sekasisältöiset teokset
in scheme: YKL - Yleisten kirjastojen luokitusjärjestelmä
narrower: Ukrainankieliset kaunokirjalliset sekasisältöiset teokset
narrower: Valkovenäjänkieliset kaunokirjalliset sekasisältöiset teokset
notation: 80.72
preferred label: Fictional works of varied contents in Ukrainian and in Byelorussian @en
preferred label: Skönlitterära verk på ukrainska och vitryska med blandat innehåll @sv

Ukrainankieliset kaunokirjalliset sekasisältöiset teokset
type: Concept
type: YKL-luokka
alternative label: Ukrainan kieli, kaunokirjalliset sekasisältöiset teokset (80.721)
alternative label: Ukrainska, skönlitterära verk med blandat innehåll (80.721) @sv
broader: Ukrainan- ja valkovenäjänkieliset kaunokirjalliset sekasisältöiset teokset
in scheme: YKL - Yleisten kirjastojen luokitusjärjestelmä
notation: 80.721
preferred label: Fictional works of varied contents in Ukrainian language @en
preferred label: Skönlitterära verk på ukrainska med blandat innehåll @sv

Valkovenäjänkieliset kaunokirjalliset sekasisältöiset teokset
type: Concept
type: YKL-luokka
alternative label: Valkovenäjän kieli, kaunokirjalliset sekasisältöiset teokset (80.722)
alternative label: Vitryska, skönlitterära verk med blandat innehåll (80.722) @sv
broader: Ukrainan- ja valkovenäjänkieliset kaunokirjalliset sekasisältöiset teokset
in scheme: YKL - Yleisten kirjastojen luokitusjärjestelmä
notation: 80.722
preferred label: Fictional works of varied contents in Belarusian language @en
preferred label: Skönlitterära verk på vitryska med blandat innehåll @sv

Puolankieliset kaunokirjalliset sekasisältöiset teokset
type: Concept
type: YKL-luokka
alternative label: Polsk skönlitteratur, verk med blandat innehåll (80.73) @sv
alternative label: Polska, skönlitterära verk med blandat innehåll (80.73) @sv
alternative label: Puolan kieli, kaunokirjalliset sekasisältöiset teokset (80.73)
alternative label: Puolankielinen kaunokirjallisuus, sekasisältöiset teokset (80.73)
broader: Slaavilaisilla ja balttilaisilla kielillä julkaistut kaunokirjalliset sekasisältöiset teokset
in scheme: YKL - Yleisten kirjastojen luokitusjärjestelmä
notation: 80.73
preferred label: Fictional works of varied contents in Polish @en
preferred label: Skönlitterära verk på polska med blandat innehåll @sv

Tšekinkieliset kaunokirjalliset sekasisältöiset teokset
type: Concept
type: YKL-luokka
alternative label: Tjeckisk skönlitteratur, verk med blandat innehåll (80.74) @sv
alternative label: Tjeckiska, skönlitterära verk med blandat innehåll (80.74) @sv
alternative label: Tšekin kieli, kaunokirjalliset sekasisältöiset teokset (80.74)
alternative label: Tšekinkielinen kaunokirjallisuus, sekasisältöiset teokset (80.74)
broader: Slaavilaisilla ja balttilaisilla kielillä julkaistut kaunokirjalliset sekasisältöiset teokset
in scheme: YKL - Yleisten kirjastojen luokitusjärjestelmä
notation: 80.74
preferred label: Fictional works of varied contents in Czech @en
preferred label: Skönlitterära verk på tjeckiska med blandat innehåll @sv

Slovakinkieliset kaunokirjalliset sekasisältöiset teokset
type: Concept
type: YKL-luokka
alternative label: Slovakin kieli, kaunokirjalliset sekasisältöiset teokset (80.75)
alternative label: Slovakinkielinen kaunokirjallisuus, sekasisältöiset teokset (80.75)
alternative label: Slovakisk skönlitteratur, verk med blandat innehåll (80.75) @sv
alternative label: Slovakiska, skönlitterära verk med blandat innehåll (80.75) @sv
broader: Slaavilaisilla ja balttilaisilla kielillä julkaistut kaunokirjalliset sekasisältöiset teokset
in scheme: YKL - Yleisten kirjastojen luokitusjärjestelmä
notation: 80.75
preferred label: Fictional works of varied contents in Slovak @en
preferred label: Skönlitterära verk på slovakiska med blandat innehåll @sv

Eteläslaavilaisilla kielillä julkaistut kaunokirjalliset sekasisältöiset teokset
type: Concept
type: YKL-luokka
broader: Slaavilaisilla ja balttilaisilla kielillä julkaistut kaunokirjalliset sekasisältöiset teokset
in scheme: YKL - Yleisten kirjastojen luokitusjärjestelmä
narrower: Bulgariankieliset kaunokirjalliset sekasisältöiset teokset
narrower: Makedoniankieliset kaunokirjalliset sekasisältöiset teokset
narrower: Sloveeninkieliset kaunokirjalliset sekasisältöiset teokset
narrower: Serbiankieliset kaunokirjalliset sekasisältöiset teokset
narrower: Kroatiankieliset kaunokirjalliset sekasisältöiset teokset
narrower: Bosniankieliset kaunokirjalliset sekasisältöiset teokset
notation: 80.76
preferred label: Fictional works of varied contents in South-Slavonic languages @en
preferred label: Skönlitterära verk på sydslaviska språk med blandat innehåll @sv

Bulgariankieliset kaunokirjalliset sekasisältöiset teokset
type: Concept
type: YKL-luokka
alternative label: Bulgarian kieli, kaunokirjalliset sekasisältöiset teokset (80.761)
alternative label: Bulgariankielinen kaunokirjallisuus, sekasisältöiset teokset (80.761)
alternative label: Bulgarisk skönlitteratur, verk med blandat innehåll (80.761) @sv
alternative label: Bulgariska, skönlitterära verk med blandat innehåll (80.761) @sv
broader: Eteläslaavilaisilla kielillä julkaistut kaunokirjalliset sekasisältöiset teokset
in scheme: YKL - Yleisten kirjastojen luokitusjärjestelmä
notation: 80.761
preferred label: Fictional works of varied contents in Bulgarian @en
preferred label: Skönlitterära verk på bulgariska med blandat innehåll @sv

Makedoniankieliset kaunokirjalliset sekasisältöiset teokset
type: Concept
type: YKL-luokka
alternative label: Makedonian kieli, kaunokirjalliset sekasisältöiset teokset (80.762)
alternative label: Makedoniankielinen kaunokirjallisuus, sekasisältöiset teokset (80.762)
alternative label: Makedonisk skönlitteratur, verk med blandat innehåll (80.762) @sv
alternative label: Makedonska, skönlitterära verk med blandat innehåll (80.762) @sv
broader: Eteläslaavilaisilla kielillä julkaistut kaunokirjalliset sekasisältöiset teokset
in scheme: YKL - Yleisten kirjastojen luokitusjärjestelmä
notation: 80.762
preferred label: Fictional works of varied contents in Macedonian @en
preferred label: Skönlitterära verk på makedonska med blandat innehåll @sv

Sloveeninkieliset kaunokirjalliset sekasisältöiset teokset
type: Concept
type: YKL-luokka
alternative label: Sloveenin kieli, kaunokirjalliset sekasisältöiset teokset (80.763)
alternative label: Sloveeninkielinen kaunokirjallisuus, sekasisältöiset teokset (80.763)
alternative label: Slovensk skönlitteratur, verk med blandat innehåll (80.763) @sv
alternative label: Slovenska, skönlitterära verk med blandat innehåll (80.763) @sv
broader: Eteläslaavilaisilla kielillä julkaistut kaunokirjalliset sekasisältöiset teokset
in scheme: YKL - Yleisten kirjastojen luokitusjärjestelmä
notation: 80.763
preferred label: Fictional works of varied contents in Slovenian @en
preferred label: Skönlitterära verk på slovenska med blandat innehåll @sv

Serbiankieliset kaunokirjalliset sekasisältöiset teokset
type: Concept
type: YKL-luokka
alternative label: Serbian kieli, kaunokirjalliset sekasisältöiset teokset (80.764)
alternative label: Serbiankielinen kaunokirjallisuus, sekasisältöiset teokset (80.764)
alternative label: Serbisk skönlitteratur, verk med blandat innehåll (80.764) @sv
alternative label: Serbiska, skönlitterära verk med blandat innehåll (80.764) @sv
broader: Eteläslaavilaisilla kielillä julkaistut kaunokirjalliset sekasisältöiset teokset
in scheme: YKL - Yleisten kirjastojen luokitusjärjestelmä
notation: 80.764
preferred label: Fictional works of varied contents in Serbian @en
preferred label: Skönlitterära verk på serbiska med blandat innehåll @sv

Kroatiankieliset kaunokirjalliset sekasisältöiset teokset
type: Concept
type: YKL-luokka
alternative label: Kroaatian kieli, kaunokirjalliset sekasisältöiset teokset (80.765)
alternative label: Kroaatin kieli, kaunokirjalliset sekasisältöiset teokset (80.765)
alternative label: Kroaatinkielinen kaunokirjallisuus, sekasisältöiset teokset (80.765)
alternative label: Kroatiankielinen kaunokirjallisuus, sekasisältöiset teokset (80.765)
alternative label: Kroatisk skönlitteratur, verk med blandat innehåll (80.765) @sv
alternative label: Kroatiska, skönlitterära verk med blandat innehåll (80.765) @sv
broader: Eteläslaavilaisilla kielillä julkaistut kaunokirjalliset sekasisältöiset teokset
in scheme: YKL - Yleisten kirjastojen luokitusjärjestelmä
notation: 80.765
preferred label: Fictional works of varied contents in Croatian @en
preferred label: Skönlitterära verk på kroatiska med blandat innehåll @sv

Bosniankieliset kaunokirjalliset sekasisältöiset teokset
type: Concept
type: YKL-luokka
alternative label: Bosnian kieli, kaunokirjalliset sekasisältöiset teokset (80.766)
alternative label: Bosniankielinen kaunokirjallisuus, sekasisältöiset teokset (80.766)
alternative label: Bosnisk skönlitteratur, verk med blandat innehåll (80.766) @sv
alternative label: Bosniska, skönlitterära verk med blandat innehåll (80.766) @sv
broader: Eteläslaavilaisilla kielillä julkaistut kaunokirjalliset sekasisältöiset teokset
in scheme: YKL - Yleisten kirjastojen luokitusjärjestelmä
notation: 80.766
preferred label: Fictional works of varied contents in Bosnian @en
preferred label: Skönlitterära verk på bosniska med blandat innehåll @sv

Balttilaisilla kielillä julkaistut kaunokirjalliset sekasisältöiset teokset
type: Concept
type: YKL-luokka
broader: Slaavilaisilla ja balttilaisilla kielillä julkaistut kaunokirjalliset sekasisältöiset teokset
in scheme: YKL - Yleisten kirjastojen luokitusjärjestelmä
narrower: Latviankieliset kaunokirjalliset sekasisältöiset teokset
narrower: Liettuankieliset kaunokirjalliset sekasisältöiset teokset
notation: 80.78
preferred label: Fictional works of varied contents in Baltic languages @en
preferred label: Skönlitterära verk på baltiska språk med blandat innehåll @sv

Latviankieliset kaunokirjalliset sekasisältöiset teokset
type: Concept
type: YKL-luokka
alternative label: Latvian kieli, kaunokirjalliset sekasisältöiset teokset (80.781)
alternative label: Latviankielinen kaunokirjallisuus, sekasisältöiset teokset (80.781)
alternative label: Lettisk skönlitteratur, verk med blandat innehåll (80.781) @sv
alternative label: Lettiska, skönlitterära verk med blandat innehåll (80.781) @sv
broader: Balttilaisilla kielillä julkaistut kaunokirjalliset sekasisältöiset teokset
in scheme: YKL - Yleisten kirjastojen luokitusjärjestelmä
notation: 80.781
preferred label: Fictional works of varied contents in Latvian @en
preferred label: Skönlitterära verk på lettiska med blandat innehåll @sv

Liettuankieliset kaunokirjalliset sekasisältöiset teokset
type: Concept
type: YKL-luokka
alternative label: Liettuan kieli, kaunokirjalliset sekasisältöiset teokset (80.782)
alternative label: Liettuankielinen kaunokirjallisuus, sekasisältöiset teokset (80.782)
alternative label: Litauisk skönlitteratur, verk med blandat innehåll (80.782) @sv
alternative label: Litauiska, skönlitterära verk med blandat innehåll (80.782) @sv
broader: Balttilaisilla kielillä julkaistut kaunokirjalliset sekasisältöiset teokset
in scheme: YKL - Yleisten kirjastojen luokitusjärjestelmä
notation: 80.782
preferred label: Fictional works of varied contents in Lithuanian @en
preferred label: Skönlitterära verk på litauiska med blandat innehåll @sv

Muilla indoeurooppalaisilla kielillä julkaistut kaunokirjalliset sekasisältöiset teokset
type: Concept
type: YKL-luokka
broader: KAUNOKIRJALLISET SEKASISÄLTÖISET TEOKSET
in scheme: YKL - Yleisten kirjastojen luokitusjärjestelmä
narrower: Kreikankieliset kaunokirjalliset sekasisältöiset teokset
narrower: Latinankieliset kaunokirjalliset sekasisältöiset teokset
narrower: Indoiraanisilla kielillä julkaistut kaunokirjalliset sekasisältöiset teokset
narrower: Albaniankieliset kaunokirjalliset sekasisältöiset teokset
narrower: Armeniankieliset kaunokirjalliset sekasisältöiset teokset
narrower: Kelttiläisillä kielillä julkaistut kaunokirjalliset sekasisältöiset teokset
notation: 80.8
preferred label: Fictional works of varied contents in other Indo-European languages @en
preferred label: Skönlitterära verk på övriga indoeuropeiska med blandat innehåll @sv

Kreikankieliset kaunokirjalliset sekasisältöiset teokset
type: Concept
type: YKL-luokka
alternative label: Grekisk skönlitteratur, forngrekiska, verk med blandat innehåll (80.81) @sv
alternative label: Grekiska, forngrekiska, skönlitterära verk med blandat innehåll (80.81) @sv
alternative label: Kreikan kieli, muinaiskreikka, kaunokirjalliset sekasisältöiset teokset (80.81)
alternative label: Kreikankielinen kaunokirjallisuus, muinaiskreikka, sekasisältöiset teokset (80.81)
broader: Muilla indoeurooppalaisilla kielillä julkaistut kaunokirjalliset sekasisältöiset teokset
in scheme: YKL - Yleisten kirjastojen luokitusjärjestelmä
narrower: Nykykreikankieliset kaunokirjalliset sekasisältöiset teokset
notation: 80.81
preferred label: Fictional works of varied contents in Greek @en
preferred label: Skönlitterära verk på grekiska med blandat innehåll @sv

Nykykreikankieliset kaunokirjalliset sekasisältöiset teokset
type: Concept
type: YKL-luokka
alternative label: Grekisk skönlitteratur, nygrekiska, verk med blandat innehåll (80.812) @sv
alternative label: Grekiska, nygrekiska, skönlitterära verk med blandat innehåll (80.812) @sv
alternative label: Kreikan kieli, nykykreikka, kaunokirjalliset sekasisältöiset teokset (80.812)
alternative label: Kreikankielinen kaunokirjallisuus, nykykreikka, sekasisältöiset teokset (80.812)
broader: Kreikankieliset kaunokirjalliset sekasisältöiset teokset
in scheme: YKL - Yleisten kirjastojen luokitusjärjestelmä
notation: 80.812
preferred label: Fictional works of varied contents in Modern Greek @en
preferred label: Skönlitterära verk på nygrekiska med blandat innehåll @sv

Latinankieliset kaunokirjalliset sekasisältöiset teokset
type: Concept
type: YKL-luokka
alternative label: Latin, skönlitterära verk med blandat innehåll (80.82) @sv
alternative label: Latinan kieli, kaunokirjalliset sekasisältöiset teokset (80.82)
alternative label: Latinankielinen kaunokirjallisuus, sekasisältöiset teokset (80.82)
alternative label: Latinsk skönlitteratur, verk med blandat innehåll (80.82) @sv
broader: Muilla indoeurooppalaisilla kielillä julkaistut kaunokirjalliset sekasisältöiset teokset
in scheme: YKL - Yleisten kirjastojen luokitusjärjestelmä
notation: 80.82
preferred label: Fictional works of varied contents in Latin @en
preferred label: Skönlitterära verk på latin med blandat innehåll @sv

Indoiraanisilla kielillä julkaistut kaunokirjalliset sekasisältöiset teokset
type: Concept
type: YKL-luokka
broader: Muilla indoeurooppalaisilla kielillä julkaistut kaunokirjalliset sekasisältöiset teokset
in scheme: YKL - Yleisten kirjastojen luokitusjärjestelmä
narrower: Persiankieliset kaunokirjalliset sekasisältöiset teokset
narrower: Kurdinkieliset kaunokirjalliset sekasisältöiset teokset
narrower: Paštunkieliset kaunokirjalliset sekasisältöiset teokset
narrower: Indoarjalaisilla kielillä julkaistut kaunokirjalliset sekasisältöiset teokset
notation: 80.83
preferred label: Fictional works of varied contents in Indo-Iranian languages @en
preferred label: Skönlitterära verk på indoiranska med blandat innehåll @sv
scope note: Intialaisilla ja iranilaisilla kielillä julkaistut
scope note: Verk på indiska och iranska @sv

Persiankieliset kaunokirjalliset sekasisältöiset teokset
type: Concept
type: YKL-luokka
alternative label: Persian kieli, kaunokirjalliset sekasisältöiset teokset (80.831)
alternative label: Persiankielinen kaunokirjallisuus, sekasisältöiset teokset (80.831)
alternative label: Persisk skönlitteratur, verk med blandat innehåll (80.831) @sv
alternative label: Persiska, skönlitterära verk med blandat innehåll (80.831) @sv
broader: Indoiraanisilla kielillä julkaistut kaunokirjalliset sekasisältöiset teokset
in scheme: YKL - Yleisten kirjastojen luokitusjärjestelmä
narrower: Darinkieliset kaunokirjalliset sekasisältöiset teokset
notation: 80.831
preferred label: Fictional works of varied contents in Persian @en
preferred label: Skönlitterära verk på persiska med blandat innehåll @sv

Darinkieliset kaunokirjalliset sekasisältöiset teokset
type: Concept
type: YKL-luokka
alternative label: Dari, skönlitterära verk med blandat innehåll (80.8311) @sv
alternative label: Darin kieli, kaunokirjalliset sekasisältöiset teokset (80.8311)
alternative label: Darinkielinen kaunokirjallisuus, sekasisältöiset teokset (80.8311)
alternative label: Skönlitteratur på dari, verk med blandat innehåll (80.8311) @sv
broader: Persiankieliset kaunokirjalliset sekasisältöiset teokset
in scheme: YKL - Yleisten kirjastojen luokitusjärjestelmä
notation: 80.8311
preferred label: Fictional works of varied contents in Dari language @en
preferred label: Skönlitterära verk på dari med blandat innehåll @sv

Kurdinkieliset kaunokirjalliset sekasisältöiset teokset
type: Concept
type: YKL-luokka
alternative label: Kurdin kieli, kaunokirjalliset sekasisältöiset teokset (80.832)
alternative label: Kurdinkielinen kaunokirjallisuus, sekasisältöiset teokset (80.832)
alternative label: Kurdisk skönlitteratur, verk med blandat innehåll (80.832) @sv
alternative label: Kurdiska, skönlitterära verk med blandat innehåll (80.832) @sv
broader: Indoiraanisilla kielillä julkaistut kaunokirjalliset sekasisältöiset teokset
in scheme: YKL - Yleisten kirjastojen luokitusjärjestelmä
narrower: Kurmandžinkieliset kaunokirjalliset sekasisältöiset teokset
narrower: Soraninkieliset kaunokirjalliset sekasisältöiset teokset
notation: 80.832
preferred label: Fictional works of varied contents in Kurdish @en
preferred label: Skönlitterära verk på kurdiska med blandat innehåll @sv

Kurmandžinkieliset kaunokirjalliset sekasisältöiset teokset
type: Concept
type: YKL-luokka
alternative label: Kurmandžin kieli, kaunokirjalliset sekasisältöiset teokset (80.8321)
alternative label: Kurmanji, skönlitterära verk med blandat innehåll (80.8321) @sv
broader: Kurdinkieliset kaunokirjalliset sekasisältöiset teokset
in scheme: YKL - Yleisten kirjastojen luokitusjärjestelmä
notation: 80.8321
preferred label: Fictional works of varied contents in Kurmanji language @en
preferred label: Skönlitterära verk på kurmanji med blandat innehåll @sv

Soraninkieliset kaunokirjalliset sekasisältöiset teokset
type: Concept
type: YKL-luokka
alternative label: Sorani, skönlitterära verk med blandat innehåll (80.8322) @sv
alternative label: Soranin kieli, kaunokirjalliset sekasisältöiset teokset (80.8322)
broader: Kurdinkieliset kaunokirjalliset sekasisältöiset teokset
in scheme: YKL - Yleisten kirjastojen luokitusjärjestelmä
notation: 80.8322
preferred label: Fictional works of varied contents in Sorani language @en
preferred label: Skönlitterära verk på sorani med blandat innehåll @sv

Paštunkieliset kaunokirjalliset sekasisältöiset teokset
type: Concept
type: YKL-luokka
alternative label: Pashto, skönlitterära verk med blandat innehåll (80.833) @sv
alternative label: Paštun kieli, kaunokirjalliset sekasisältöiset teokset (80.833)
broader: Indoiraanisilla kielillä julkaistut kaunokirjalliset sekasisältöiset teokset
in scheme: YKL - Yleisten kirjastojen luokitusjärjestelmä
notation: 80.833
preferred label: Fictional works of varied contents in Pushto language @en
preferred label: Skönlitterära verk på pashto med blandat innehåll @sv

Indoarjalaisilla kielillä julkaistut kaunokirjalliset sekasisältöiset teokset
type: Concept
type: YKL-luokka
broader: Indoiraanisilla kielillä julkaistut kaunokirjalliset sekasisältöiset teokset
in scheme: YKL - Yleisten kirjastojen luokitusjärjestelmä
narrower: Bengalinkieliset kaunokirjalliset sekasisältöiset teokset
narrower: Gudžaratinkieliset kaunokirjalliset sekasisältöiset teokset
narrower: Hindinkieliset kaunokirjalliset sekasisältöiset teokset
narrower: Pandžabinkieliset kaunokirjalliset sekasisältöiset teokset
narrower: Romanikieliset kaunokirjalliset sekasisältöiset teokset
narrower: Urdunkieliset kaunokirjalliset sekasisältöiset teokset
narrower: Nepalinkieliset kaunokirjalliset sekasisältöiset teokset
narrower: Sinhalankieliset kaunokirjalliset sekasisältöiset teokset
notation: 80.836
preferred label: Fictional works of varied contents in Indo-Aryan languages @en
preferred label: Skönlitterära verk på indoariska språk med blandat innehåll @sv

Bengalinkieliset kaunokirjalliset sekasisältöiset teokset
type: Concept
type: YKL-luokka
alternative label: Bengali, skönlitterära verk med blandat innehåll (80.8361) @sv
alternative label: Bengalin kieli, kaunokirjalliset sekasisältöiset teokset (80.8361)
broader: Indoarjalaisilla kielillä julkaistut kaunokirjalliset sekasisältöiset teokset
in scheme: YKL - Yleisten kirjastojen luokitusjärjestelmä
notation: 80.8361
preferred label: Fictional works of varied contents in Bengali language @en
preferred label: Skönlitterära verk på bengali med blandat innehåll @sv

Gudžaratinkieliset kaunokirjalliset sekasisältöiset teokset
type: Concept
type: YKL-luokka
alternative label: Gudžaratin kieli, kaunokirjalliset sekasisältöiset teokset (80.8362)
alternative label: Gujarati, skönlitterära verk med blandat innehåll (80.8362) @sv
broader: Indoarjalaisilla kielillä julkaistut kaunokirjalliset sekasisältöiset teokset
in scheme: YKL - Yleisten kirjastojen luokitusjärjestelmä
notation: 80.8362
preferred label: Fictional works of varied contents in Gujarati language @en
preferred label: Skönlitterära verk på gujarati med blandat innehåll @sv

Hindinkieliset kaunokirjalliset sekasisältöiset teokset
type: Concept
type: YKL-luokka
alternative label: Hindi, skönlitterära verk med blandat innehåll (80.8363) @sv
alternative label: Hindin kieli, kaunokirjalliset sekasisältöiset teokset (80.8363)
broader: Indoarjalaisilla kielillä julkaistut kaunokirjalliset sekasisältöiset teokset
in scheme: YKL - Yleisten kirjastojen luokitusjärjestelmä
notation: 80.8363
preferred label: Fictional works of varied contents in Hindi language @en
preferred label: Skönlitterära verk på hindi med blandat innehåll @sv

Pandžabinkieliset kaunokirjalliset sekasisältöiset teokset
type: Concept
type: YKL-luokka
alternative label: Pandžabin kieli, kaunokirjalliset sekasisältöiset teokset (80.8364)
alternative label: Panjabi, skönlitterära verk med blandat innehåll (80.8364) @sv
broader: Indoarjalaisilla kielillä julkaistut kaunokirjalliset sekasisältöiset teokset
in scheme: YKL - Yleisten kirjastojen luokitusjärjestelmä
notation: 80.8364
preferred label: Fictional works of varied contents in Punjabi language @en
preferred label: Skönlitterära verk på panjabi med blandat innehåll @sv

Romanikieliset kaunokirjalliset sekasisältöiset teokset
type: Concept
type: YKL-luokka
alternative label: Romani, skönlitterära verk med blandat innehåll (80.8365) @sv
alternative label: Romanikieli, kaunokirjalliset sekasisältöiset teokset (80.8365)
broader: Indoarjalaisilla kielillä julkaistut kaunokirjalliset sekasisältöiset teokset
in scheme: YKL - Yleisten kirjastojen luokitusjärjestelmä
notation: 80.8365
preferred label: Fictional works of varied contents in Romani language @en
preferred label: Skönlitterära verk på romani med blandat innehåll @sv

Urdunkieliset kaunokirjalliset sekasisältöiset teokset
type: Concept
type: YKL-luokka
alternative label: Urdu, skönlitterära verk med blandat innehåll (80.8366) @sv
alternative label: Urdun kieli, kaunokirjalliset sekasisältöiset teokset (80.8366)
broader: Indoarjalaisilla kielillä julkaistut kaunokirjalliset sekasisältöiset teokset
in scheme: YKL - Yleisten kirjastojen luokitusjärjestelmä
notation: 80.8366
preferred label: Fictional works of varied contents in Urdu language @en
preferred label: Skönlitterära verk på urdu med blandat innehåll @sv

Nepalinkieliset kaunokirjalliset sekasisältöiset teokset
type: Concept
type: YKL-luokka
alternative label: Nepali, skönlitterära verk med blandat innehåll (80.8367) @sv
alternative label: Nepalin kieli, kaunokirjalliset sekasisältöiset teokset (80.8367)
broader: Indoarjalaisilla kielillä julkaistut kaunokirjalliset sekasisältöiset teokset
in scheme: YKL - Yleisten kirjastojen luokitusjärjestelmä
notation: 80.8367
preferred label: Fictional works of varied contents in Nepali language @en
preferred label: Skönlitterära verk på nepali med blandat innehåll @sv

Sinhalankieliset kaunokirjalliset sekasisältöiset teokset
type: Concept
type: YKL-luokka
alternative label: Singalesiska, skönlitterära verk med blandat innehåll (80.8368) @sv
alternative label: Sinhala kieli, kaunokirjalliset sekasisältöiset teokset (80.8368)
broader: Indoarjalaisilla kielillä julkaistut kaunokirjalliset sekasisältöiset teokset
in scheme: YKL - Yleisten kirjastojen luokitusjärjestelmä
notation: 80.8368
preferred label: Fictional works of varied contents in Sinhalese language @en
preferred label: Skönlitterära verk på singalesiska med blandat innehåll @sv

Albaniankieliset kaunokirjalliset sekasisältöiset teokset
type: Concept
type: YKL-luokka
alternative label: Albanian kieli, kaunokirjalliset sekasisältöiset teokset (80.84)
alternative label: Albaniankielinen kaunokirjallisuus, sekasisältöiset teokset (80.84)
alternative label: Albansk skönlitteratur, verk med blandat innehåll (80.84) @sv
alternative label: Albanska, skönlitterära verk med blandat innehåll (80.84) @sv
broader: Muilla indoeurooppalaisilla kielillä julkaistut kaunokirjalliset sekasisältöiset teokset
in scheme: YKL - Yleisten kirjastojen luokitusjärjestelmä
notation: 80.84
preferred label: Fictional works of varied contents in Albanian @en
preferred label: Skönlitterära verk på albanska med blandat innehåll @sv

Armeniankieliset kaunokirjalliset sekasisältöiset teokset
type: Concept
type: YKL-luokka
alternative label: Armenian kieli, kaunokirjalliset sekasisältöiset teokset (80.85)
alternative label: Armeniska, skönlitterära verk med blandat innehåll (80.85) @sv
broader: Muilla indoeurooppalaisilla kielillä julkaistut kaunokirjalliset sekasisältöiset teokset
in scheme: YKL - Yleisten kirjastojen luokitusjärjestelmä
notation: 80.85
preferred label: Fictional works of varied contents in Armenian language @en
preferred label: Skönlitterära verk på armeniska med blandat innehåll @sv

Kelttiläisillä kielillä julkaistut kaunokirjalliset sekasisältöiset teokset
type: Concept
type: YKL-luokka
broader: Muilla indoeurooppalaisilla kielillä julkaistut kaunokirjalliset sekasisältöiset teokset
in scheme: YKL - Yleisten kirjastojen luokitusjärjestelmä
notation: 80.88
preferred label: Fictional works of varied contents in Celtic languages @en
preferred label: Skönlitterära verk på keltiska språk med blandat innehåll @sv

Muilla kielillä julkaistut kaunokirjalliset sekasisältöiset teokset
type: Concept
type: YKL-luokka
broader: KAUNOKIRJALLISET SEKASISÄLTÖISET TEOKSET
in scheme: YKL - Yleisten kirjastojen luokitusjärjestelmä
narrower: Turkkilaisilla kielillä julkaistut kaunokirjalliset sekasisältöiset teokset
narrower: Afroaasialaisilla kielillä julkaistut kaunokirjalliset sekasisältöiset teokset
narrower: Sinotiibetiläisillä ja austroaasialaisilla kielillä julkaistut kaunokirjalliset sekasisältöiset teokset
narrower: Japanin- ja koreankieliset kaunokirjalliset sekasisältöiset teokset
narrower: Afrikkalaisilla kielillä julkaistut, kaunokirjalliset sekasisältöiset teokset
narrower: Kaukasialaisilla kielillä julkaistut, kaunokirjalliset sekasisältöiset teokset
narrower: Eskimo- ja intiaanikielillä julkaistut, kaunokirjalliset sekasisältöiset teokset
narrower: Muilla ei-indoeurooppalaisilla kielillä julkaistut, kaunokirjalliset sekasisältöiset teokset
notation: 80.9
preferred label: Fictional works of varied contents in other languages @en
preferred label: Skönlitterära verk på övriga språk med blandat innehåll @sv

Turkkilaisilla kielillä julkaistut kaunokirjalliset sekasisältöiset teokset
type: Concept
type: YKL-luokka
broader: Muilla kielillä julkaistut kaunokirjalliset sekasisältöiset teokset
in scheme: YKL - Yleisten kirjastojen luokitusjärjestelmä
narrower: Turkinkieliset kaunokirjalliset sekasisältöiset teokset
narrower: Azerinkieliset kaunokirjalliset sekasisältöiset teokset
narrower: Turkmeeninkieliset kaunokirjalliset sekasisältöiset teokset
narrower: Uiguurinkieliset kaunokirjalliset sekasisältöiset teokset
narrower: Uzbekinkieliset kaunokirjalliset sekasiltöiset teokset
notation: 80.91
preferred label: Fictional works of varied contents in Turkic languages @en
preferred label: Skönlitterära verk på turkiska språk med blandat innehåll @sv

Turkinkieliset kaunokirjalliset sekasisältöiset teokset
type: Concept
type: YKL-luokka
alternative label: Turkin kieli, kaunokirjalliset sekasisältöiset teokset (80.911)
alternative label: Turkiska, skönlitterära verk med blandat innehåll (80.911) @sv
broader: Turkkilaisilla kielillä julkaistut kaunokirjalliset sekasisältöiset teokset
in scheme: YKL - Yleisten kirjastojen luokitusjärjestelmä
notation: 80.911
preferred label: Fictional works of varied contents in Turkish language @en
preferred label: Skönlitterära verk på turkiska med blandat innehåll @sv

Azerinkieliset kaunokirjalliset sekasisältöiset teokset
type: Concept
type: YKL-luokka
alternative label: Azerbajdzjanska, skönlitterära verk med blandat innehåll (80.912) @sv
alternative label: Azerin kieli, kaunokirjalliset sekasisältöiset teokset (80.912)
broader: Turkkilaisilla kielillä julkaistut kaunokirjalliset sekasisältöiset teokset
in scheme: YKL - Yleisten kirjastojen luokitusjärjestelmä
notation: 80.912
preferred label: Fictional works of varied contents in Azerbaijani language @en
preferred label: Skönlitterära verk på azerbajdzjanska med blandat innehåll @sv

Turkmeeninkieliset kaunokirjalliset sekasisältöiset teokset
type: Concept
type: YKL-luokka
alternative label: Turkmeenin kieli, kaunokirjalliset sekasisältöiset teokset (80.913)
alternative label: Turkmeniska, skönlitterära verk med blandat innehåll (80.913) @sv
broader: Turkkilaisilla kielillä julkaistut kaunokirjalliset sekasisältöiset teokset
in scheme: YKL - Yleisten kirjastojen luokitusjärjestelmä
notation: 80.913
preferred label: Fictional works of varied contents in Turkmen language @en
preferred label: Skönlitterära verk på turkmeniska med blandat innehåll @sv

Uiguurinkieliset kaunokirjalliset sekasisältöiset teokset
type: Concept
type: YKL-luokka
alternative label: Uiguriska, skönlitterära verk med blandat innehåll (80.914) @sv
alternative label: Uiguurin kieli, kaunokirjalliset sekasisältöiset teokset (80.914)
broader: Turkkilaisilla kielillä julkaistut kaunokirjalliset sekasisältöiset teokset
in scheme: YKL - Yleisten kirjastojen luokitusjärjestelmä
notation: 80.914
preferred label: Fictional works of varied contents in Uighur language @en
preferred label: Skönlitterära verk på uiguriska med blandat innehåll @sv

Uzbekinkieliset kaunokirjalliset sekasiltöiset teokset
type: Concept
type: YKL-luokka
alternative label: Uzbekin kieli, kaunokirjalliset sekasisältöiset teokset (80.915)
alternative label: Uzbekiska, skönlitterära verk med blandat innehåll (80.915) @sv
broader: Turkkilaisilla kielillä julkaistut kaunokirjalliset sekasisältöiset teokset
in scheme: YKL - Yleisten kirjastojen luokitusjärjestelmä
notation: 80.915
preferred label: Fictional works of varied contents in Uzbek language @en
preferred label: Skönlitterära verk på uzbekiska med blandat innehåll @sv

Afroaasialaisilla kielillä julkaistut kaunokirjalliset sekasisältöiset teokset
type: Concept
type: YKL-luokka
broader: Muilla kielillä julkaistut kaunokirjalliset sekasisältöiset teokset
in scheme: YKL - Yleisten kirjastojen luokitusjärjestelmä
narrower: Hepreankieliset kaunokirjalliset sekasisältöiset teokset
narrower: Arabiankieliset kaunokirjalliset sekasisältöiset teokset
narrower: Amharankieliset kaunokirjalliset sekasisältöiset teokset
narrower: Tigrinjankieliset kaunokirjalliset sekasisältöiset teokset
narrower: Somalinkieliset kaunokirjalliset sekasisältöiset teokset
notation: 80.92
preferred label: Fictional works of varied contents in Afroasiatic languages @en
preferred label: Skönlitterära verk på afroasiatiska språk med blandat innehåll @sv

Hepreankieliset kaunokirjalliset sekasisältöiset teokset
type: Concept
type: YKL-luokka
alternative label: Hebreisk skönlitteratur, verk med blandat innehåll (80.922) @sv
alternative label: Hebreiska, skönlitterära verk med blandat innehåll (80.922) @sv
alternative label: Heprean kieli, kaunokirjalliset sekasisältöiset teokset (80.922)
alternative label: Hepreankielinen kaunokirjallisuus, sekasisältöiset teokset (80.922)
broader: Afroaasialaisilla kielillä julkaistut kaunokirjalliset sekasisältöiset teokset
in scheme: YKL - Yleisten kirjastojen luokitusjärjestelmä
notation: 80.922
preferred label: Fictional works of varied contents in Hebrew @en
preferred label: Skönlitterära verk på hebreiska med blandat innehåll @sv

Arabiankieliset kaunokirjalliset sekasisältöiset teokset
type: Concept
type: YKL-luokka
alternative label: Arabian kieli, kaunokirjalliset sekasisältöiset teokset (80.923)
alternative label: Arabiankielinen kaunokirjallisuus, sekasisältöiset teokset (80.923)
alternative label: Arabisk skönlitteratur, verk med blandat innehåll (80.923) @sv
alternative label: Arabiska, skönlitterära verk med blandat innehåll (80.923) @sv
broader: Afroaasialaisilla kielillä julkaistut kaunokirjalliset sekasisältöiset teokset
in scheme: YKL - Yleisten kirjastojen luokitusjärjestelmä
notation: 80.923
preferred label: Fictional works of varied contents in Arabic @en
preferred label: Skönlitterära verk på arabiska med blandat innehåll @sv

Amharankieliset kaunokirjalliset sekasisältöiset teokset
type: Concept
type: YKL-luokka
alternative label: Amharan kieli, kaunokirjalliset sekasisältöiset teokset (80.924)
alternative label: Amhariska, skönlitterära verk med blandat innehåll (80.924) @sv
broader: Afroaasialaisilla kielillä julkaistut kaunokirjalliset sekasisältöiset teokset
in scheme: YKL - Yleisten kirjastojen luokitusjärjestelmä
notation: 80.924
preferred label: Fictional works of varied contents in Amharic language @en
preferred label: Skönlitterära verk på amhariska med blandat innehåll @sv

Tigrinjankieliset kaunokirjalliset sekasisältöiset teokset
type: Concept
type: YKL-luokka
alternative label: Tigrinja, skönlitterära verk med blandat innehåll (80.925) @sv
alternative label: Tigrinjan kieli, kaunokirjalliset sekasisältöiset teokset (80.925)
broader: Afroaasialaisilla kielillä julkaistut kaunokirjalliset sekasisältöiset teokset
in scheme: YKL - Yleisten kirjastojen luokitusjärjestelmä
notation: 80.925
preferred label: Fictional works of varied contents in Tigrinya language @en
preferred label: Skönlitterära verk på tigrinja med blandat innehåll @sv

Somalinkieliset kaunokirjalliset sekasisältöiset teokset
type: Concept
type: YKL-luokka
alternative label: Somalin kieli, kaunokirjalliset sekasisältöiset teokset (80.926)
alternative label: Somaliska, skönlitterära verk med blandat innehåll (80.926) @sv
broader: Afroaasialaisilla kielillä julkaistut kaunokirjalliset sekasisältöiset teokset
in scheme: YKL - Yleisten kirjastojen luokitusjärjestelmä
notation: 80.926
preferred label: Fictional works of varied contents in Somali language @en
preferred label: Skönlitterära verk på somaliska med blandat innehåll @sv

Sinotiibetiläisillä ja austroaasialaisilla kielillä julkaistut kaunokirjalliset sekasisältöiset teokset
type: Concept
type: YKL-luokka
broader: Muilla kielillä julkaistut kaunokirjalliset sekasisältöiset teokset
in scheme: YKL - Yleisten kirjastojen luokitusjärjestelmä
narrower: Kiinankieliset kaunokirjalliset sekasisältöiset teokset
narrower: Burmankieliset kaunokirjalliset sekasisältöiset teokset
narrower: Kareninkieliset kaunokirjalliset sekasisältöiset teokset
narrower: Thainkieliset, kaunokirjalliset sekasisältöiset teokset
narrower: Vietnaminkieliset kaunokirjalliset sekasisältöiset teokset
narrower: Khmerinkieliset kaunokirjalliset sekasisältöiset teokset
notation: 80.94
preferred label: Fictional works of varied contents in Sino-Tibetan and Austroasiatic languages @en
preferred label: Skönlitterära verk på sinotibetanska och austroasiatiska språk med blandat innehåll @sv

Kiinankieliset kaunokirjalliset sekasisältöiset teokset
type: Concept
type: YKL-luokka
alternative label: Kiinan kieli, kaunokirjalliset sekasisältöiset teokset (80.943)
alternative label: Kiinankielinen kaunokirjallisuus, sekasisältöiset teokset (80.943)
alternative label: Kinesisk skönlitteratur, verk med blandat innehåll (80.943) @sv
alternative label: Kinesiska, skönlitterära verk med blandat innehåll (80.943) @sv
broader: Sinotiibetiläisillä ja austroaasialaisilla kielillä julkaistut kaunokirjalliset sekasisältöiset teokset
in scheme: YKL - Yleisten kirjastojen luokitusjärjestelmä
notation: 80.943
preferred label: Fictional works of varied contents in Chinese @en
preferred label: Skönlitterära verk på kinesiska med blandat innehåll @sv

Burmankieliset kaunokirjalliset sekasisältöiset teokset
type: Concept
type: YKL-luokka
alternative label: Burman kieli, kaunokirjalliset sekasisältöiset teokset (80.944)
alternative label: Burmesiska, skönlitterära verk med blandat innehåll (80.944) @sv
broader: Sinotiibetiläisillä ja austroaasialaisilla kielillä julkaistut kaunokirjalliset sekasisältöiset teokset
in scheme: YKL - Yleisten kirjastojen luokitusjärjestelmä
notation: 80.944
preferred label: Fictional works of varied contents in Burmese language @en
preferred label: Skönlitterära verk på burmesiska med blandat innehåll @sv

Kareninkieliset kaunokirjalliset sekasisältöiset teokset
type: Concept
type: YKL-luokka
alternative label: Karenin kieli, kaunokirjalliset sekasisältöiset teokset (80.945)
alternative label: Karenska, skönlitterära verk med blandat innehåll (80.945) @sv
broader: Sinotiibetiläisillä ja austroaasialaisilla kielillä julkaistut kaunokirjalliset sekasisältöiset teokset
in scheme: YKL - Yleisten kirjastojen luokitusjärjestelmä
notation: 80.945
preferred label: Fictional works of varied contents in Karen languages @en
preferred label: Skönlitterära verk på karenska med blandat innehåll @sv

Thainkieliset, kaunokirjalliset sekasisältöiset teokset
type: Concept
type: YKL-luokka
alternative label: Thai, skönlitterära verk med blandat innehåll (80.946) @sv
alternative label: Thailändsk skönlitteratur, verk med blandat innehåll (80.946) @sv
alternative label: Thain kieli, kaunokirjalliset sekasisältöiset teokset (80.946)
alternative label: Thainkielinen kaunokirjallisuus, sekasisältöiset teokset (80.946)
broader: Sinotiibetiläisillä ja austroaasialaisilla kielillä julkaistut kaunokirjalliset sekasisältöiset teokset
in scheme: YKL - Yleisten kirjastojen luokitusjärjestelmä
notation: 80.946
preferred label: Fictional works of varied contents in Thai @en
preferred label: Skönlitterära verk på thailändska med blandat innehåll @sv

Vietnaminkieliset kaunokirjalliset sekasisältöiset teokset
type: Concept
type: YKL-luokka
alternative label: Vietnamesisk skönlitteratur, verk med blandat innehåll (80.948) @sv
alternative label: Vietnamesiska, skönlitterära verk med blandat innehåll (80.948) @sv
alternative label: Vietnamin kieli, kaunokirjalliset sekasisältöiset teokset (80.948)
alternative label: Vietnaminkielinen kaunokirjallisuus, sekasisältöiset teokset (80.948)
broader: Sinotiibetiläisillä ja austroaasialaisilla kielillä julkaistut kaunokirjalliset sekasisältöiset teokset
in scheme: YKL - Yleisten kirjastojen luokitusjärjestelmä
notation: 80.948
preferred label: Fictional works of varied contents in Vietnamese @en
preferred label: Skönlitterära verk på vietnamesiska med blandat innehåll @sv

Khmerinkieliset kaunokirjalliset sekasisältöiset teokset
type: Concept
type: YKL-luokka
alternative label: Khmer, skönlitterära verk med blandat innehåll (80.949) @sv
alternative label: Khmerin kieli, kaunokirjalliset sekasisältöiset teokset (80.949)
broader: Sinotiibetiläisillä ja austroaasialaisilla kielillä julkaistut kaunokirjalliset sekasisältöiset teokset
in scheme: YKL - Yleisten kirjastojen luokitusjärjestelmä
notation: 80.949
preferred label: Fictional works of varied contents in Khmer language @en
preferred label: Skönlitterära verk på khmer med blandat innehåll @sv

Japanin- ja koreankieliset kaunokirjalliset sekasisältöiset teokset
type: Concept
type: YKL-luokka
broader: Muilla kielillä julkaistut kaunokirjalliset sekasisältöiset teokset
in scheme: YKL - Yleisten kirjastojen luokitusjärjestelmä
narrower: Japaninkieliset kaunokirjalliset sekasisältöiset teokset (80.951)
narrower: Koreankieliset kaunokirjalliset sekasisältöiset teokset (80.955)
notation: 80.95
preferred label: Fictional works of varied contents in Japanese and in Korean @en
preferred label: Skönlitterära verk på japanska och koreanska med blandat innehåll @sv

Japaninkieliset kaunokirjalliset sekasisältöiset teokset (80.951)
type: Concept
type: YKL-luokka
alternative label: Japanin kieli, kaunokirjalliset sekasisältöiset teokset (80.951)
alternative label: Japaninkielinen kaunokirjallisuus, sekasisältöiset teokset (80.951)
alternative label: Japansk skönlitteratur, verk med blandat innehåll (80.951) @sv
alternative label: Japanska, skönlitterära verk med blandat innehåll (80.951) @sv
broader: Japanin- ja koreankieliset kaunokirjalliset sekasisältöiset teokset
in scheme: YKL - Yleisten kirjastojen luokitusjärjestelmä
notation: 80.951
preferred label: Fictional works of varied contents in Japanese @en
preferred label: Skönlitterära verk på japanska med blandat innehåll @sv

Koreankieliset kaunokirjalliset sekasisältöiset teokset (80.955)
type: Concept
type: YKL-luokka
alternative label: Korean kieli, kaunokirjalliset sekasisältöiset teokset (80.955)
alternative label: Koreankielinen kaunokirjallisuus, sekasisältöiset teokset (80.955)
alternative label: Koreansk skönlitteratur, verk med blandat innehåll (80.955) @sv
alternative label: Koreanska, skönlitterära verk med blandat innehåll (80.955) @sv
broader: Japanin- ja koreankieliset kaunokirjalliset sekasisältöiset teokset
in scheme: YKL - Yleisten kirjastojen luokitusjärjestelmä
notation: 80.955
preferred label: Fictional works of varied contents in Korean @en
preferred label: Skönlitterära verk på koreanska med blandat innehåll @sv

Afrikkalaisilla kielillä julkaistut, kaunokirjalliset sekasisältöiset teokset
type: Concept
type: YKL-luokka
broader: Muilla kielillä julkaistut kaunokirjalliset sekasisältöiset teokset
in scheme: YKL - Yleisten kirjastojen luokitusjärjestelmä
narrower: Swahilinkieliset kaunokirjalliset sekasisältöiset teokset
narrower: Lingalankieliset kaunokirjalliset sekasisältöiset teokset
notation: 80.96
preferred label: Fictional works of varied contents in African languages @en
preferred label: Skönlitterära verk på afrikanska språk med blandat innehåll @sv
scope note: Hit verk som publicerats på afrikanska språk som talas söder om Sahara, Etiopien och Somalia @sv
scope note: Tähän Saharan, Etiopian ja Somalian eteläpuolella puhutuilla afrikkalaisilla kielillä julkaistut

Swahilinkieliset kaunokirjalliset sekasisältöiset teokset
type: Concept
type: YKL-luokka
alternative label: Swahili, skönlitterära verk med blandat innehåll (80.961) @sv
alternative label: Swahilin kieli, kaunokirjalliset sekasisältöiset teokset (80.961)
broader: Afrikkalaisilla kielillä julkaistut, kaunokirjalliset sekasisältöiset teokset
in scheme: YKL - Yleisten kirjastojen luokitusjärjestelmä
notation: 80.961
preferred label: Fictional works of varied contents in Swahili language @en
preferred label: Skönlitterära verk på swahili med blandat innehåll @sv

Lingalankieliset kaunokirjalliset sekasisältöiset teokset
type: Concept
type: YKL-luokka
alternative label: Lingala, skönlitterära verk med blandat innehåll (80.962) @sv
alternative label: Lingalan kieli, kaunokirjalliset sekasisältöiset teokset (80.962)
broader: Afrikkalaisilla kielillä julkaistut, kaunokirjalliset sekasisältöiset teokset
in scheme: YKL - Yleisten kirjastojen luokitusjärjestelmä
notation: 80.962
preferred label: Fictional works of varied contents in Lingala language @en
preferred label: Skönlitterära verk på lingala med blandat innehåll @sv

Kaukasialaisilla kielillä julkaistut, kaunokirjalliset sekasisältöiset teokset
type: Concept
type: YKL-luokka
broader: Muilla kielillä julkaistut kaunokirjalliset sekasisältöiset teokset
in scheme: YKL - Yleisten kirjastojen luokitusjärjestelmä
narrower: Georgiankieliset kaunokirjalliset sekasisältöiset teokset
narrower: Abhaasin, kabardin ja adygenkieliset kaunokirjalliset sekasisältöiset teokset
narrower: Tšetšeeninkieliset kaunokirjalliset sekasisältöiset teokset
notation: 80.97
preferred label: Fictional works of varied contents in Caucasian languages @en
preferred label: Skönlitterära verk på kaukasiska språk med blandat innehåll @sv

Georgiankieliset kaunokirjalliset sekasisältöiset teokset
type: Concept
type: YKL-luokka
alternative label: Georgian kieli, kaunokirjalliset sekasisältöiset teokset (80.971)
alternative label: Georgiska, skönlitterära verk med blandat innehåll (80.971) @sv
broader: Kaukasialaisilla kielillä julkaistut, kaunokirjalliset sekasisältöiset teokset
in scheme: YKL - Yleisten kirjastojen luokitusjärjestelmä
notation: 80.971
preferred label: Fictional works of varied contents in Georgian language @en
preferred label: Skönlitterära verk på georgiska med blandat innehåll @sv

Abhaasin, kabardin ja adygenkieliset kaunokirjalliset sekasisältöiset teokset
type: Concept
type: YKL-luokka
alternative label: Abchaziska, skönlitterära verk med blandat innehåll (80.972) @sv
alternative label: Abhaasin kieli, kaunokirjalliset sekasisältöiset teokset (80.972)
alternative label: Adygeiska, skönlitterära verk med blandat innehåll (80.972) @sv
alternative label: Adygen kieli, kaunokirjalliset sekasisältöiset teokset (80.972)
alternative label: Kabardin kieli, kaunokirjalliset sekasisältöiset teokset (80.972)
alternative label: Kabardinska, skönlitterära verk med blandat innehåll (80.972) @sv
broader: Kaukasialaisilla kielillä julkaistut, kaunokirjalliset sekasisältöiset teokset
in scheme: YKL - Yleisten kirjastojen luokitusjärjestelmä
notation: 80.972
preferred label: Fictional works of varied contents in Abkhaz, Kabardian and Adyghe languages @en
preferred label: Skönlitterära verk på abchaziska, kabardinska och adygeiska med blandat innehåll @sv

Tšetšeeninkieliset kaunokirjalliset sekasisältöiset teokset
type: Concept
type: YKL-luokka
alternative label: Tjetjenska, skönlitterära verk med blandat innehåll (80.973) @sv
alternative label: Tšetšeenin kieli, kaunokirjalliset sekasisältöiset teokset (80.973)
broader: Kaukasialaisilla kielillä julkaistut, kaunokirjalliset sekasisältöiset teokset
in scheme: YKL - Yleisten kirjastojen luokitusjärjestelmä
notation: 80.973
preferred label: Fictional works of varied contents in Chechen language @en
preferred label: Skönlitterära verk på tjetjenska med blandat innehåll @sv

Eskimo- ja intiaanikielillä julkaistut, kaunokirjalliset sekasisältöiset teokset
type: Concept
type: YKL-luokka
broader: Muilla kielillä julkaistut kaunokirjalliset sekasisältöiset teokset
in scheme: YKL - Yleisten kirjastojen luokitusjärjestelmä
narrower: Grönlanninkieliset kaunokirjalliset sekasisältöiset teokset
notation: 80.98
preferred label: Fictional works of varied contents in Eskimo and Indian languages @en
preferred label: Skönlitterära verk på eskimåiska och indianska språk med blandat innehåll @sv

Grönlanninkieliset kaunokirjalliset sekasisältöiset teokset
type: Concept
type: YKL-luokka
alternative label: Grönlannin kieli, kaunokirjalliset sekasisältöiset teokset (80.981)
alternative label: Grönländska, skönlitterära verk med blandat innehåll (80.981) @sv
broader: Eskimo- ja intiaanikielillä julkaistut, kaunokirjalliset sekasisältöiset teokset
in scheme: YKL - Yleisten kirjastojen luokitusjärjestelmä
notation: 80.981
preferred label: Fictional works of varied contents in Greenlandic language @en
preferred label: Skönlitterära verk på grönländska med blandat innehåll @sv

Muilla ei-indoeurooppalaisilla kielillä julkaistut, kaunokirjalliset sekasisältöiset teokset
type: Concept
type: YKL-luokka
alternative label: Mongolin kieli, kaunokirjalliset sekasisältöiset teokset (80.99)
alternative label: Mongoliska skönlitterära verk med blandat innehåll (80.99) @sv
broader: Muilla kielillä julkaistut kaunokirjalliset sekasisältöiset teokset
in scheme: YKL - Yleisten kirjastojen luokitusjärjestelmä
narrower: Keinotekoisilla kielillä julkaistut kaunokirjalliset sekasisältöiset teokset
narrower: Baskinkieliset kaunokirjalliset sekasisältöiset teokset
narrower: Dravidakieliset kaunokirjalliset sekasisältöiset teokset
narrower: Austronesialaisilla kielillä julkaistut sekasisältöiset teokset
notation: 80.99
preferred label: Fictional works of varied contents in other Non-Indoeuropean languages @en
preferred label: Skönlitterära verk på övriga icke-indoeuropeiska språk med blandat innehåll @sv

Keinotekoisilla kielillä julkaistut kaunokirjalliset sekasisältöiset teokset
type: Concept
type: YKL-luokka
broader: Muilla ei-indoeurooppalaisilla kielillä julkaistut, kaunokirjalliset sekasisältöiset teokset
in scheme: YKL - Yleisten kirjastojen luokitusjärjestelmä
notation: 80.991
preferred label: Fictional works of varied contents in artificial languages @en
preferred label: Skönlitterära verk på artificiella språk med blandat innehåll @sv

Baskinkieliset kaunokirjalliset sekasisältöiset teokset
type: Concept
type: YKL-luokka
alternative label: Baskin kieli, kaunokirjalliset sekasisältöiset teokset (80.992)
alternative label: Baskiska, skönlitterära verk med blandat innehåll (80.992) @sv
broader: Muilla ei-indoeurooppalaisilla kielillä julkaistut, kaunokirjalliset sekasisältöiset teokset
in scheme: YKL - Yleisten kirjastojen luokitusjärjestelmä
notation: 80.992
preferred label: Fictional works of varied contents in Basque language @en
preferred label: Skönlitterära verk på baskiska med blandat innehåll @sv

Dravidakieliset kaunokirjalliset sekasisältöiset teokset
type: Concept
type: YKL-luokka
broader: Muilla ei-indoeurooppalaisilla kielillä julkaistut, kaunokirjalliset sekasisältöiset teokset
in scheme: YKL - Yleisten kirjastojen luokitusjärjestelmä
narrower: Malajalaminkieliset kaunokirjalliset sekasisältöiset teokset
narrower: Kannadankieliset kaunokirjalliset sekasisältöiset teokset
narrower: Tamilinkieliset kaunokirjalliset sekasisältöiset teokset
narrower: Telugunkieliset kaunokirjalliset sekasisältöiset teokset
notation: 80.994
preferred label: Fictional works of varied contents in Dravidian languages @en
preferred label: Skönlitterära verk på dravidiska spåk med blandat innehåll @sv

Malajalaminkieliset kaunokirjalliset sekasisältöiset teokset
type: Concept
type: YKL-luokka
alternative label: Malajalamin kieli, kaunokirjalliset sekasisältöiset teokset (80.9941)
alternative label: Malayalam, skönlitterära verk med blandat innehåll (80.9941) @sv
broader: Dravidakieliset kaunokirjalliset sekasisältöiset teokset
in scheme: YKL - Yleisten kirjastojen luokitusjärjestelmä
notation: 80.9941
preferred label: Fictional works of varied contents in Malayalam language @en
preferred label: Skönlitterära verk på malayalam med blandat innehåll @sv

Kannadankieliset kaunokirjalliset sekasisältöiset teokset
type: Concept
type: YKL-luokka
alternative label: Kannada, skönlitterära verk med blandat innehåll (80.9942) @sv
alternative label: Kannadan kieli, kaunokirjalliset sekasisältöiset teokset (80.9942)
broader: Dravidakieliset kaunokirjalliset sekasisältöiset teokset
in scheme: YKL - Yleisten kirjastojen luokitusjärjestelmä
notation: 80.9942
preferred label: Fictional works of varied contents in Kannada language @en
preferred label: Skönlitterära verk på kannada med blandat innehåll @sv

Tamilinkieliset kaunokirjalliset sekasisältöiset teokset
type: Concept
type: YKL-luokka
alternative label: Tamil, skönlitterära verk med blandat innehåll (80.9943) @sv
alternative label: Tamilin kieli, kaunokirjalliset sekasisältöiset teokset (80.9943)
broader: Dravidakieliset kaunokirjalliset sekasisältöiset teokset
in scheme: YKL - Yleisten kirjastojen luokitusjärjestelmä
notation: 80.9943
preferred label: Fictional works of varied contents in Tamil language @en
preferred label: Skönlitterära verk på tamil med blandat innehåll @sv

Telugunkieliset kaunokirjalliset sekasisältöiset teokset
type: Concept
type: YKL-luokka
alternative label: Telugu, skönlitterära verk med blandat innehåll (80.9944) @sv
alternative label: Telugun kieli, kaunokirjalliset sekasisältöiset teokset (80.9944)
broader: Dravidakieliset kaunokirjalliset sekasisältöiset teokset
in scheme: YKL - Yleisten kirjastojen luokitusjärjestelmä
notation: 80.9944
preferred label: Fictional works of varied contents in Telugu language @en
preferred label: Skönlitterära verk på telugu med blandat innehåll @sv

Austronesialaisilla kielillä julkaistut sekasisältöiset teokset
type: Concept
type: YKL-luokka
broader: Muilla ei-indoeurooppalaisilla kielillä julkaistut, kaunokirjalliset sekasisältöiset teokset
in scheme: YKL - Yleisten kirjastojen luokitusjärjestelmä
narrower: Tagaloginkieliset kaunokirjalliset sekasisältöiset teokset
narrower: Malaijinkieliset kaunokirjalliset sekasisältöiset teokset
narrower: Indonesiankieliset kaunokirjalliset sekasisältöiset teokset
notation: 80.995
preferred label: Fictional works of varied contents in Austronesian languages @en
preferred label: Skönlitterära verk på austronesiska språk med blandat innehåll @sv

Tagaloginkieliset kaunokirjalliset sekasisältöiset teokset
type: Concept
type: YKL-luokka
alternative label: Tagalog, skönlitterära verk med blandat innehåll (80.9951) @sv
alternative label: Tagalogin kieli, kaunokirjalliset sekasisältöiset teokset (80.9951)
broader: Austronesialaisilla kielillä julkaistut sekasisältöiset teokset
in scheme: YKL - Yleisten kirjastojen luokitusjärjestelmä
notation: 80.9951
preferred label: Fictional works of varied contents in Tagalog language @en
preferred label: Skönlitterära verk på tagalog med blandat innehåll @sv

Malaijinkieliset kaunokirjalliset sekasisältöiset teokset
type: Concept
type: YKL-luokka
alternative label: Malaijin kieli, kaunokirjalliset sekasisältöiset teokset (80.9952)
alternative label: Malajiska, skönlitterära verk med blandat innehåll (80.9952) @sv
broader: Austronesialaisilla kielillä julkaistut sekasisältöiset teokset
in scheme: YKL - Yleisten kirjastojen luokitusjärjestelmä
notation: 80.9952
preferred label: Fictional works of varied contents in Malay language @en
preferred label: Skönlitterära verk på malajiska med blandat innehåll @sv

Indonesiankieliset kaunokirjalliset sekasisältöiset teokset
type: Concept
type: YKL-luokka
alternative label: Indonesian kieli, kaunokirjalliset sekasisältöiset teokset (80.9953)
alternative label: Indonesiska, skönlitterära verk med blandat innehåll (80.9953) @sv
broader: Austronesialaisilla kielillä julkaistut sekasisältöiset teokset
in scheme: YKL - Yleisten kirjastojen luokitusjärjestelmä
notation: 80.9953
preferred label: Fictional works of varied contents in Indonesian language @en
preferred label: Skönlitterära verk på indonesiska med blandat innehåll @sv

KANSANRUNOUS
type: Concept
References: KANSATIEDE. KULTTUURIANTROPOLOGIA
References: Etnomusiikki. Kansanmusiikki
References: Etnomusiikki. Kansanmusiikki, Eurooppa
References: RUNOT
References: Kansanrunouden historia ja tutkimus
References: Suomen, suomalais-ugrilaisten ja uralilaisten kielten kirjallisuuden historia ja tutkimus
alternative label: Albanian kieli, kansanrunous (81+)
alternative label: Albaniankielinen kaunokirjallisuus, kansanrunous (81+)
alternative label: Anagrammit, kaunokirjallisuus (80 ... 85+)
alternative label: Animaatioelokuvat, tallenteet, fiktiiviset (80 ... 85+)
alternative label: Antologiat, kaunokirjallisuus (80 ... 85+)
alternative label: Arabian kieli, kansanrunous (81+)
alternative label: Arabiankielinen kaunokirjallisuus, kansanrunous (81+)
alternative label: Arkkiveisut, kansanrunous (81)
alternative label: Balladit, kansanrunous (81)
alternative label: Bosnian kieli, kansanrunous (81+)
alternative label: Bosniankielinen kaunokirjallisuus, kansanrunous (81+)
alternative label: Bulgarian kieli, kansanrunous (81+)
alternative label: Bulgariankielinen kaunokirjallisuus, kansanrunous (81+)
alternative label: Darin kieli, kansanrunous (81+)
alternative label: Elokuvat, animaatioelokuvat, fiktiiviset, tallenteet (80 ... 85+)
alternative label: Englannin kieli, kansanrunous (81+)
alternative label: Englanninkielinen kaunokirjallisuus, kansanrunous (81+)
alternative label: Espanjan kieli, kansanrunous (81+)
alternative label: Espanjankielinen kaunokirjallisuus, kansanrunous (81+)
alternative label: Fantasiaelokuvat, animaatioelokuvat, tallenteet (80 ... 85+)
alternative label: Fäärin kieli, kansanrunous (81+)
alternative label: Fäärinkielinen kaunokirjallisuus, kansanrunous (81+)
alternative label: Heprean kieli, kansanrunous (81+)
alternative label: Hepreankielinen kaunokirjallisuus, kansanrunous (81+)
alternative label: Hollannin kieli, kansanrunous (81+)
alternative label: Hollanninkielinen kaunokirjallisuus, kansanrunous (81+)
alternative label: Islannin kieli, kansanrunous (81+)
alternative label: Islanninkielinen kaunokirjallisuus, kansanrunous (81+)
alternative label: Italian kieli, kansanrunous (81+)
alternative label: Italiankielinen kaunokirjallisuus, kansanrunous (81+)
alternative label: Itkut, kansanrunous (81)
alternative label: Japanin kieli, kansanrunous (81+)
alternative label: Japaninkielinen kaunokirjallisuus, kansanrunous (81+)
alternative label: Kansanperinne, kansanrunous (81+)
alternative label: Kansanrunous (81+)
alternative label: Kanteletar (81)
alternative label: Kaunokirjallisuus (80 ... 85+)
alternative label: Kiinan kieli, kansanrunous (81+)
alternative label: Kiinankielinen kaunokirjallisuus, kansanrunous (81+)
alternative label: Kirjalliset äänitteet, kaunokirjallisuus (80 ... 85+)
alternative label: Kirjallisuusäänitteet, kaunokirjallisuus (80 ... 85+)
alternative label: Kokoomateokset, kaunokirjallisuus (80 ... 85+)
alternative label: Kootut teokset, kaunokirjallisuus (80 ... 85+)
alternative label: Korean kieli, kansanrunous (81+)
alternative label: Koreankielinen kaunokirjallisuus, kansanrunous (81+)
alternative label: Kreikan kieli, muinaiskreikka, kansanrunous (81+)
alternative label: Kreikan kieli, nykykreikka, kansanrunous (81+)
alternative label: Kreikankielinen kaunokirjallisuus, muinaiskreikka, kansanrunous (81+)
alternative label: Kreikankielinen kaunokirjallisuus, nykykreikka, kansanrunous (81+)
alternative label: Kroaatin kieli, kansanrunous (81+)
alternative label: Kroaatinkielinen kaunokirjallisuus, kansanrunous (81+)
alternative label: Kroatian kieli, kansanrunous (81+)
alternative label: Kroatiankielinen kaunokirjallisuus, kansanrunous (81+)
alternative label: Kurdin kieli, kansanrunous (81+)
alternative label: Kurdinkielinen kaunokirjallisuus, kansanrunous (81+)
alternative label: Lastenelokuvat, animaatioelokuvat, fiktiiviset, tallenteet (80 ... 85+)
alternative label: Lastenkirjallisuus, kaunokirjallisuus (80 ... 85+)
alternative label: Latinan kieli, kansanrunous (81+)
alternative label: Latinankielinen kaunokirjallisuus, kansanrunous (81+)
alternative label: Latvian kieli, kansanrunous (81+)
alternative label: Latviankielinen kaunokirjallisuus, kansanrunous (81+)
alternative label: Liettuan kieli, kansanrunous (81+)
alternative label: Liettuankielinen kaunokirjallisuus, kansanrunous (81+)
alternative label: Loitsut, kansanrunous (81)
alternative label: Lorut, kansanrunous (81)
broader: KAUNOKIRJALLISUUS. KIRJALLISUUSTIEDE. KIELITIEDE
in scheme: YKL - Yleisten kirjastojen luokitusjärjestelmä
narrower: Kansansadut. Kansantarinat
narrower: Sananlaskut. Arvoitukset. Vertaukset. Kaskut
narrower: Kansaneepokset
notation: 81
scope note: Hit oavsett språk samlingsverk av folkdiktning med blandat innehåll Hit oavsett språk även folkdikter och forndikter samt samlingar av sådana Hit också trollkväden, gråtkväden, skillingtryck samt folklore såsom rim och ramsor Formtilläggen 01, 02, 03+, 06+, 07, 08+ och 09 används inte i samband med klasserna 80-85+ @sv
scope note: Tähän kielestä riippumatta kokoomateokset, jotka sisältävät kansanrunouden eri lajeja Tähän kielestä riippumatta myös kansan- ja muinaisrunot sekä kansan- ja muinaisrunokokoelmat Tähän myös loitsut, taiat, itkuvirret, arkkiveisut ja kansanperinteeseen kuuluvat lorut Muotoluokkia 01, 02, 03+, 06+, 07, 08+ ja 09 ei käytetä luokkien 80-85+ yhteydessä

Kansansadut. Kansantarinat
type: Concept
References: YLEINEN USKONTOTIEDE
References: MUUT USKONNOT JA MYTOLOGIAT
References: KANSATIEDE. KULTTUURIANTROPOLOGIA
References: Kansaneepokset
References: KERTOMAKIRJALLISUUS
References: SADUT
References: KUVAKIRJAT
References: SARJAKUVAT
References: Kansanrunouden historia ja tutkimus
References: Suomen, suomalais-ugrilaisten ja uralilaisten kielten kirjallisuuden historia ja tutkimus
type: YKL-luokka
alternative label: Berättelser, folkdiktning (81.2) @sv
alternative label: Didaktiska berättelser, folkdiktning (81.2) @sv
alternative label: Folkliga trosföreställningar (81.2) @sv
alternative label: Folksagor (81.2) @sv
alternative label: Folksägner (81.2) @sv
alternative label: Helgonlegender, folkdiktning (81.2) @sv
alternative label: Kansansadut (81.2)
alternative label: Kansantarinat (81.2)
alternative label: Kansanuskomukset (81.2)
alternative label: Kaupunkilegendat (81.2)
alternative label: Kertomukset, kansanrunous (81.2)
alternative label: Legendat, kansanrunous (81.2)
alternative label: Legender, folkdiktning (81.2) @sv
alternative label: Moderna sägner (81.2) @sv
alternative label: Nykytarinat (81.2)
alternative label: Opetustarinat, kansanrunous (81.2)
alternative label: Pyhimystarut, kansanrunous (81.2)
alternative label: Saagat (81.2)
alternative label: Sadut, kansansadut (81.2)
alternative label: Sagor (81.2) @sv
alternative label: Sagor, folksagor (81.2) @sv
alternative label: Skapelseberättelser, folkdiktning (81.2) @sv
alternative label: Stadslegender (81.2) @sv
alternative label: Syntytarinat, kansanrunous (81.2)
alternative label: Sägner, folkberättelser (81.2) @sv
alternative label: Tarinat, kansantarinat (81.2)
alternative label: Tuhat ja yksi yötä (81.2)
alternative label: Tusen och en natt (81.2) @sv
alternative label: Urbaanilegendat (81.2)
alternative label: Urbana legender (81.2) @sv
alternative label: Uskomustarinat, kansanrunous (81.2)
alternative label: Varningsberättelser, folkdiktning (81.2) @sv
alternative label: Varoitustarinat, kansanrunous (81.2)
alternative label: Vittnessägner, folkdiktning (81.2) @sv
broader: KANSANRUNOUS
in scheme: YKL - Yleisten kirjastojen luokitusjärjestelmä
notation: 81.2
preferred label: Folk tales. Folk legends @en
preferred label: Folksagor. Folksägner @sv
scope note: Hit oavsett språk sagor, berättelser och historier som ingår i folklig tradition Legender. Vittnessägner Sägner med etiologisk, didaktisk eller varningsfunktion @sv
scope note: Tähän kielestä riippumatta kansanperinteeseen kuuluvat sadut, tarinat ja kertomukset Legendat. Uskomustarinat Synty-, varoitus- ja opetustarinat

Sananlaskut. Arvoitukset. Vertaukset. Kaskut
type: Concept
References: Leikit
References: KERTOMAKIRJALLISUUS
References: Kansanrunouden historia ja tutkimus
References: Suomen, suomalais-ugrilaisten ja uralilaisten kielten kirjallisuuden historia ja tutkimus
type: YKL-luokka
alternative label: Anekdoter, folkdiktning (81.3) @sv
alternative label: Arvoitukset, kansanrunous (81.3)
alternative label: Gåtor, folkdiktning (81.3) @sv
alternative label: Kaskut, kansanrunous (81.3)
alternative label: Liknelser, folkdiktning (81.3) @sv
alternative label: Ordspråk (81.3) @sv
alternative label: Ordstäv (81.3) @sv
alternative label: Sananlaskut (81.3)
alternative label: Sananparret (81.3)
alternative label: Vertaukset, kansanrunous (81.3)
alternative label: Vitsar, folkminne (81.3) @sv
alternative label: Vitsit, kansanperinne (81.3)
broader: KANSANRUNOUS
in scheme: YKL - Yleisten kirjastojen luokitusjärjestelmä
notation: 81.3
preferred label: Ordspråk. Gåtor. Parabler. Anekdoter @sv
preferred label: Proverbs. Riddles. Parables. Anecdotes @en
scope note: Hit oavsett språk ordspråk, gåtor, parabler och anekdoter som ingår i folkdiktningen @sv
scope note: Tähän kielestä riippumatta kansanperinteeseen kuuluvat sananlaskut, arvoitukset, vertaukset ja kaskut

Kansaneepokset
type: Concept
References: YLEINEN USKONTOTIEDE
References: MUUT USKONNOT JA MYTOLOGIAT
References: Kansansadut. Kansantarinat
References: KERTOMAKIRJALLISUUS
References: KUVAKIRJAT
References: SARJAKUVAT
References: Kansanrunouden historia ja tutkimus
References: Suomen, suomalais-ugrilaisten ja uralilaisten kielten kirjallisuuden historia ja tutkimus
type: YKL-luokka
alternative label: Beowulf (81.4)
alternative label: Bylinat (81.4)
alternative label: Bylinor (81.4) @sv
alternative label: Cid, Sången om El Cid (81.4) @sv
alternative label: Cidin laulu (81.4)
alternative label: Edda (81.4)
alternative label: Eepokset, kansanrunous (81.4)
alternative label: Epos, folkdiktning (81.4) @sv
alternative label: Gilgames (81.4)
alternative label: Gilgamesh (81.4) @sv
alternative label: Iliaden (81.4) @sv
alternative label: Ilias (81.4)
alternative label: Kalevala (81.4)
alternative label: Kalevipoeg (81.4)
alternative label: Kansaneepokset (81.4)
alternative label: Nationalepos (81.4) @sv
alternative label: Nibelungenlied (81.4)
alternative label: Odysseia (81.4)
alternative label: Odyssén (81.4) @sv
alternative label: Rolandin laulu (81.4)
alternative label: Rolandssången (81.4) @sv
broader: KANSANRUNOUS
in scheme: YKL - Yleisten kirjastojen luokitusjärjestelmä
notation: 81.4
preferred label: Folk epics @en
preferred label: Folkepos @sv
scope note: Hit folkepos och förkortningar av dem oavsett språk Hit t.ex. Beowulf, El Cid, Eddan, Gilgamesh, Iliaden, Kalevala, Kalevipoeg, Nibelungenlied, Odyssén och Rolandssången @sv
scope note: Tähän kielestä riippumatta kansaneepokset ja niiden lyhenteet Tähän esim. Beowulf, Cidin laulu, Edda, Gilgames, Ilias, Kalevala, Kalevipoeg, Nibelungenlied, Odysseia ja Rolandin laulu

RUNOT
type: Concept
References: KANSANRUNOUS
References: NÄYTELMÄT
References: KUVAKIRJAT
References: Kirjallisuuden estetiikka. Runousoppi
References: Yleinen kirjallisuudenhistoria
References: Suomen, suomalais-ugrilaisten ja uralilaisten kielten kirjallisuuden historia ja tutkimus
References: Pohjoismaisten kielten kirjallisuuden historia ja tutkimus
References: Saksankielisen kirjallisuuden historia ja tutkimus
References: Englanninkielisen kirjallisuuden historia ja tutkimus
References: Romaanisten kielten kirjallisuuden historia ja tutkimus
References: Slaavilaisten ja balttilaisten kielten kirjallisuuden historia ja tutkimus
References: Muiden indoeurooppalaisten kielten kirjallisuuden historia ja tutkimus
References: Muiden kielten kirjallisuuden historia ja tutkimus
alternative label: Anagram, skönlitteratur (80 ... 85+) @sv
alternative label: Anagrammit, kaunokirjallisuus (80 ... 85+)
alternative label: Animaatioelokuvat, tallenteet, fiktiiviset (80 ... 85+)
alternative label: Animationsfilmer, inspelningar, fiktiva (80 ... 85+) @sv
alternative label: Antologiat, kaunokirjallisuus (80 ... 85+)
alternative label: Antologier, skönlitteratur (80 ... 85+) @sv
alternative label: Ballader, poesi (82+) @sv
alternative label: Balladit, runous (82+)
alternative label: Barnfilmer, animationsfilmer, fiktiva, inspelningar (80 ... 85+) @sv
alternative label: Barnlitteratur, skönlitteratur (80 ... 85+) @sv
alternative label: Dataprogram, skönlitteratur (80 ... 85+) @sv
alternative label: Dialektlitteratur, skönlitteratur (80 ... 85+) @sv
alternative label: Dikter (82+) @sv
alternative label: Elokuvat, animaatioelokuvat, fiktiiviset, tallenteet (80 ... 85+)
alternative label: Epigrammit (82+)
alternative label: Fantasiaelokuvat, animaatioelokuvat, tallenteet (80 ... 85+)
alternative label: Haikut (82+)
alternative label: Iskelmälyriikka, ilman nuotteja (82+)
alternative label: Kaunokirjallisuus (80 ... 85+)
alternative label: Kirjalliset äänitteet, kaunokirjallisuus (80 ... 85+)
alternative label: Kirjallisuusäänitteet, kaunokirjallisuus (80 ... 85+)
alternative label: Kokoomateokset, kaunokirjallisuus (80 ... 85+)
alternative label: Kootut teokset, kaunokirjallisuus (80 ... 85+)
alternative label: Lastenelokuvat, animaatioelokuvat, fiktiiviset, tallenteet (80 ... 85+)
alternative label: Lastenkirjallisuus, kaunokirjallisuus (80 ... 85+)
alternative label: Laululyriikka, ilman nuotteja (82+)
alternative label: Limerikit (82+)
alternative label: Lukemistot, kaunokirjallisuus (80 ... 85+)
alternative label: Lukukirjat, kaunokirjallisuus (80 ... 85+)
alternative label: Lyriikka (82+)
alternative label: Murrekirjallisuus, kaunokirjallisuus (80 ... 85+)
alternative label: Musiikkielokuvat, animaatioelokuvat, fiktiiviset, tallenteet (80 ... 85+)
alternative label: Nukke-elokuvat, fiktiiviset (80 ... 85+)
alternative label: Nuortenelokuvat, animaatioelokuvat, fiktiiviset, tallenteet (80 ... 85+)
alternative label: Nuortenkirjallisuus, kaunokirjallisuus (80 ... 85+)
alternative label: Ohjelmistot, kaunokirjallisuus (80 ... 85+)
alternative label: Oodit, runot (82+)
alternative label: Palindromit, kaunokirjallisuus (80 ... 85+)
alternative label: Piirretyt elokuvat, fiktiiviset (80 ... 85+)
alternative label: Proosarunot (82+)
alternative label: Rocklyriikka, ilman nuotteja (82+)
alternative label: Runonlausuntaesitykset, taltioinnit (82+)
alternative label: Runot (82+)
alternative label: Sanaleikit, kaunokirjallisuus (80 ... 85+)
alternative label: Sonetit, runot (82+)
alternative label: Taide, kirjallisuus (80 ... 86+)
alternative label: Taidemuodot, kirjallisuus (80 ... 86+)
alternative label: Taiteet, kirjallisuus (80 ... 86+)
alternative label: Tankat (82+)
alternative label: Televisio-ohjelmat, tallenteet, fiktiiviset elokuvat ja sarjat (80 ... 85+)
alternative label: Valitut teokset, kaunokirjallisuus (80 ... 85+)
alternative label: Äänikirjat, kaunokirjallisuus (80 ... 85+)
alternative label: Äänitteet, kaunokirjallisuus (80 ... 85+)
broader: KAUNOKIRJALLISUUS. KIRJALLISUUSTIEDE. KIELITIEDE
in scheme: YKL - Yleisten kirjastojen luokitusjärjestelmä
narrower: Suomenkieliset runot
narrower: Pohjoismaisilla kielillä julkaistut runot
narrower: Saksankieliset runot
narrower: Englanninkieliset runot
narrower: Romaanisilla kielillä julkaistut runot
narrower: Slaavilaisilla ja balttilaisilla kielillä julkaistut runot
narrower: Muilla indoeurooppalaisilla kielillä julkaistut runot
narrower: Muilla kielillä julkaistut runot
notation: 82
scope note: Hit och till underklasserna dikter och diktsamlingar Verken klassificeras enligt publikationens språk, inte efter originalspråk eller publikationsland Om det ena språket i ett tvåspråkigt verk är översättningsspråk klassificeras verket efter detta språk Om texterna i en två- eller flerspråkig publikation inte är översättningar av varandra, klassificeras verket efter huvudspråket Om verket inte har något huvudspråk klassificeras det efter publikationens första språk Formtilläggen 01, 02, 03+, 06+, 07, 08+ och 09 används inte i samband med klasserna 80-85+ @sv
scope note: Tähän ja alaluokkiin runot ja runokokoelmat Teokset luokitetaan julkaisun kielen, ei julkaisumaan tai alkuteoksen kielen mukaan Jos kaksikielisen teoksen toinen kieli on käännöskieli, luokitetaan teos käännöskielen mukaan Jos kaksi- tai useampikielisen teoksen tekstit eivät ole toistensa käännöksiä, luokitetaan teos julkaisun pääkielen mukaan Jos teoksella ei ole pääkieltä, se luokitetaan julkaisun ensimmäisen kielen mukaan Muotoluokkia 01, 02, 03+, 06+, 07, 08+ ja 09 ei käytetä luokkien 80-85+ yhteydessä

Suomenkieliset runot
type: Concept
type: YKL-luokka
alternative label: Finsk skönlitteratur, poesi (82.2) @sv
alternative label: Finska, poesi (82.2) @sv
alternative label: Suomen kieli, runot (82.2)
alternative label: Suomenkielinen kaunokirjallisuus, runot (82.2)
broader: RUNOT
in scheme: YKL - Yleisten kirjastojen luokitusjärjestelmä
narrower: Meänkieliset runot
narrower: Kveeninkieliset runot
narrower: Vironkieliset runot
narrower: Muilla itämerensuomalaisilla kielillä julkaistut runot
narrower: Muilla suomalais-ugrilaisilla ja uralilaisilla kielillä julkaistut runot
notation: 82.2
preferred label: Poems in Finnish @en
preferred label: Poesi på finska @sv

Meänkieliset runot
type: Concept
type: YKL-luokka
alternative label: Meänkieli, poesi (82.21) @sv
alternative label: Meänkieli, runot (82.21)
alternative label: Meänkielinen kaunokirjallisuus, runot (82.21)
alternative label: Skönlitteratur på meänkieli, poesi (82.21) @sv
broader: Suomenkieliset runot
in scheme: YKL - Yleisten kirjastojen luokitusjärjestelmä
notation: 82.21
preferred label: Poems in Meänkieli @en
preferred label: Poesi på meänkieli @sv

Kveeninkieliset runot
type: Concept
type: YKL-luokka
alternative label: Kveenin kieli, runot (82.22)
alternative label: Kveeninkielinen kaunokirjallisuus, runot (82.22)
alternative label: Kvänsk skönlitteratur, poesi (82.22) @sv
alternative label: Kvänska, poesi (82.22) @sv
broader: Suomenkieliset runot
in scheme: YKL - Yleisten kirjastojen luokitusjärjestelmä
notation: 82.22
preferred label: Poems in Kven language @en
preferred label: Poesi på kvänska @sv

Vironkieliset runot
type: Concept
type: YKL-luokka
alternative label: Estnisk skönlitteratur, poesi (82.23) @sv
alternative label: Estniska, poesi (82.23) @sv
alternative label: Viron kieli, runot (82.23)
alternative label: Vironkielinen kaunokirjallisuus, runot (82.23)
broader: Suomenkieliset runot
in scheme: YKL - Yleisten kirjastojen luokitusjärjestelmä
notation: 82.23
preferred label: Poems in Estonian @en
preferred label: Poesi på estniska @sv

Muilla itämerensuomalaisilla kielillä julkaistut runot
type: Concept
type: YKL-luokka
broader: Suomenkieliset runot
in scheme: YKL - Yleisten kirjastojen luokitusjärjestelmä
narrower: Karjalankieliset runot
notation: 82.24
preferred label: Poems in other Balto-Finnic languages @en
preferred label: Poesi på övriga östersjöfinska språk @sv

Karjalankieliset runot
type: Concept
type: YKL-luokka
alternative label: Karelska, poesi (82.241) @sv
alternative label: Karjalan kieli, runot (82.241)
broader: Muilla itämerensuomalaisilla kielillä julkaistut runot
in scheme: YKL - Yleisten kirjastojen luokitusjärjestelmä
notation: 82.241
preferred label: Poems in Karelian language @en
preferred label: Poesi på karelska @sv

Muilla suomalais-ugrilaisilla ja uralilaisilla kielillä julkaistut runot
type: Concept
type: YKL-luokka
broader: Suomenkieliset runot
in scheme: YKL - Yleisten kirjastojen luokitusjärjestelmä
narrower: Unkarinkieliset runot
narrower: Saamenkieliset runot
notation: 82.25
preferred label: Poems in other Finno-Ugric and Uralic languages @en
preferred label: Poesi på övriga finsk-ugriska och uraliska språk @sv

Unkarinkieliset runot
type: Concept
type: YKL-luokka
alternative label: Ungersk skönlitteratur, poesi (82.251) @sv
alternative label: Ungerska, poesi (82.251) @sv
alternative label: Unkarin kieli, runot (82.251)
alternative label: Unkarinkielinen kaunokirjallisuus, runot (82.251)
broader: Muilla suomalais-ugrilaisilla ja uralilaisilla kielillä julkaistut runot
in scheme: YKL - Yleisten kirjastojen luokitusjärjestelmä
notation: 82.251
preferred label: Poems in Hungarian @en
preferred label: Poesi på ungerska @sv

Saamenkieliset runot
type: Concept
type: YKL-luokka
alternative label: Saamen kieli, runot (82.252)
alternative label: Saamenkielinen kaunokirjallisuus, runot (82.252)
alternative label: Samisk skönlitteratur, poesi (82.252) @sv
alternative label: Samiska, poesi (82.252) @sv
broader: Muilla suomalais-ugrilaisilla ja uralilaisilla kielillä julkaistut runot
in scheme: YKL - Yleisten kirjastojen luokitusjärjestelmä
notation: 82.252
preferred label: Poems in Sami @en
preferred label: Poesi på samiska @sv

Pohjoismaisilla kielillä julkaistut runot
type: Concept
type: YKL-luokka
broader: RUNOT
in scheme: YKL - Yleisten kirjastojen luokitusjärjestelmä
narrower: Ruotsinkieliset runot
narrower: Norjankieliset runot
narrower: Tanskankieliset runot
narrower: Islanninkieliset runot
narrower: Fäärinkieliset runot
notation: 82.3
preferred label: Poems in Nordic languages @en
preferred label: Poesi på nordiska språk @sv

Ruotsinkieliset runot
type: Concept
type: YKL-luokka
alternative label: Ruotsin kieli, runot (82.31)
alternative label: Ruotsinkielinen kaunokirjallisuus, runot (82.31)
alternative label: Svensk skönlitteratur, poesi (82.31) @sv
alternative label: Svenska, poesi (82.31) @sv
broader: Pohjoismaisilla kielillä julkaistut runot
in scheme: YKL - Yleisten kirjastojen luokitusjärjestelmä
notation: 82.31
preferred label: Poems in Swedish @en
preferred label: Poesi på svenska @sv

Norjankieliset runot
type: Concept
type: YKL-luokka
alternative label: Norjan kieli, runot (82.32)
alternative label: Norjankielinen kaunokirjallisuus, runot (82.32)
alternative label: Norsk skönlitteratur, poesi (82.32) @sv
alternative label: Norska, poesi (82.32) @sv
broader: Pohjoismaisilla kielillä julkaistut runot
in scheme: YKL - Yleisten kirjastojen luokitusjärjestelmä
notation: 82.32
preferred label: Poems in Norwegian @en
preferred label: Poesi på norska @sv

Tanskankieliset runot
type: Concept
type: YKL-luokka
alternative label: Dansk skönlitteratur, poesi (82.33) @sv
alternative label: Danska, poesi (82.33) @sv
alternative label: Tanskan kieli, runot (82.33)
alternative label: Tanskankielinen kaunokirjallisuus, runot (82.33)
broader: Pohjoismaisilla kielillä julkaistut runot
in scheme: YKL - Yleisten kirjastojen luokitusjärjestelmä
notation: 82.33
preferred label: Poems in Danish @en
preferred label: Poesi på danska @sv

Islanninkieliset runot
type: Concept
type: YKL-luokka
alternative label: Islannin kieli, runot (82.34)
alternative label: Islanninkielinen kaunokirjallisuus, runot (82.34)
alternative label: Isländsk skönlitteratur, poesi (82.34) @sv
alternative label: Isländska, poesi (82.34) @sv
broader: Pohjoismaisilla kielillä julkaistut runot
in scheme: YKL - Yleisten kirjastojen luokitusjärjestelmä
notation: 82.34
preferred label: Poems in Icelandic @en
preferred label: Poesi på isländska @sv

Fäärinkieliset runot
type: Concept
type: YKL-luokka
alternative label: Färöisk skönlitteratur, poesi (82.35) @sv
alternative label: Färöiska, poesi (82.35) @sv
alternative label: Fäärin kieli, runot (82.35)
alternative label: Fäärinkielinen kaunokirjallisuus, runot (82.35)
broader: Pohjoismaisilla kielillä julkaistut runot
in scheme: YKL - Yleisten kirjastojen luokitusjärjestelmä
notation: 82.35
preferred label: Poems in Faeroese @en
preferred label: Poesi på färöiska @sv

Saksankieliset runot
type: Concept
type: YKL-luokka
alternative label: Saksan kieli, runot (82.4)
alternative label: Saksankielinen kaunokirjallisuus, runot (82.4)
alternative label: Tysk skönlitteratur, poesi (82.4) @sv
alternative label: Tyska, poesi (82.4) @sv
broader: RUNOT
in scheme: YKL - Yleisten kirjastojen luokitusjärjestelmä
narrower: Jiddišinkieliset runot
narrower: Friisinkieliset runot
narrower: Hollanninkieliset runot
notation: 82.4
preferred label: Poems in German @en
preferred label: Poesi på tyska @sv
scope note: Hit och till underklassen också poesi på andra germanska språk @sv
scope note: Tähän ja alaluokkaan myös muilla germaanisilla kielillä julkaistut runot

Jiddišinkieliset runot
type: Concept
type: YKL-luokka
alternative label: Jiddisch, poesi (82.41) @sv
alternative label: Jiddišin kieli, runot (82.41)
broader: Saksankieliset runot
in scheme: YKL - Yleisten kirjastojen luokitusjärjestelmä
notation: 82.41
preferred label: Poems in Yiddish language @en
preferred label: Poesi på jiddisch @sv

Friisinkieliset runot
type: Concept
type: YKL-luokka
broader: Saksankieliset runot
in scheme: YKL - Yleisten kirjastojen luokitusjärjestelmä
notation: 82.43
preferred label: Poems in Frisian @en
preferred label: Poesi på frisiska @sv

Hollanninkieliset runot
type: Concept
type: YKL-luokka
alternative label: Hollannin kieli, runot (82.48)
alternative label: Hollanninkielinen kaunokirjallisuus, runot (82.48)
alternative label: Nederländsk skönlitteratur, poesi (82.48) @sv
alternative label: Nederländska, poesi (82.48) @sv
broader: Saksankieliset runot
in scheme: YKL - Yleisten kirjastojen luokitusjärjestelmä
narrower: Afrikaansinkieliset runot
notation: 82.48
preferred label: Poems in Dutch @en
preferred label: Poesi på holländska @sv
scope note: Hit också poesi på flamländska @sv
scope note: Tähän myös flaaminkieliset runot

Afrikaansinkieliset runot
type: Concept
type: YKL-luokka
alternative label: Afrikaans, poesi (82.481) @sv
alternative label: Afrikaansin kieli, runot (82.481)
broader: Hollanninkieliset runot
in scheme: YKL - Yleisten kirjastojen luokitusjärjestelmä
notation: 82.481
preferred label: Poems in Afrikaans language @en
preferred label: Poesi på afrikaans @sv

Englanninkieliset runot
type: Concept
type: YKL-luokka
alternative label: Engelsk skönlitteratur, poesi (82.5) @sv
alternative label: Engelska, poesi (82.5) @sv
alternative label: Englannin kieli, runot (82.5)
alternative label: Englanninkielinen kaunokirjallisuus, runot (82.5)
broader: RUNOT
in scheme: YKL - Yleisten kirjastojen luokitusjärjestelmä
notation: 82.5
preferred label: Poems in English @en
preferred label: Poesi på engelska @sv

Romaanisilla kielillä julkaistut runot
type: Concept
type: YKL-luokka
broader: RUNOT
in scheme: YKL - Yleisten kirjastojen luokitusjärjestelmä
narrower: Ranskankieliset runot
narrower: Italiankieliset runot
narrower: Espanjankieliset runot
narrower: Portugalinkieliset runot
narrower: Romaniankieliset runot
narrower: Muilla romaanisilla kielillä julkaistut runot
notation: 82.6
preferred label: Poems in Romanic languages @en
preferred label: Poesi på romanska språk @sv

Ranskankieliset runot
type: Concept
type: YKL-luokka
alternative label: Fransk skönlitteratur, poesi (82.61) @sv
alternative label: Franska, poesi (82.61) @sv
alternative label: Ranskan kieli, runot (82.61)
alternative label: Ranskankielinen kaunokirjallisuus, runot (82.61)
broader: Romaanisilla kielillä julkaistut runot
in scheme: YKL - Yleisten kirjastojen luokitusjärjestelmä
notation: 82.61
preferred label: Poems in French @en
preferred label: Poesi på franska @sv

Italiankieliset runot
type: Concept
type: YKL-luokka
alternative label: Italian kieli, runot (82.62)
alternative label: Italiankielinen kaunokirjallisuus, runot (82.62)
alternative label: Italiensk skönlitteratur, poesi (82.62) @sv
alternative label: Italienska, poesi (82.62) @sv
broader: Romaanisilla kielillä julkaistut runot
in scheme: YKL - Yleisten kirjastojen luokitusjärjestelmä
notation: 82.62
preferred label: Poems in Italy @en
preferred label: Poesi på italienska @sv

Espanjankieliset runot
type: Concept
type: YKL-luokka
alternative label: Espanjan kieli, runot (82.63)
alternative label: Espanjankielinen kaunokirjallisuus, runot (82.63)
alternative label: Spansk skönlitteratur, poesi (82.63) @sv
alternative label: Spanska, poesi (82.63) @sv
broader: Romaanisilla kielillä julkaistut runot
in scheme: YKL - Yleisten kirjastojen luokitusjärjestelmä
notation: 82.63
preferred label: Poems in Spanish @en
preferred label: Poesi på spanska @sv

Portugalinkieliset runot
type: Concept
type: YKL-luokka
alternative label: Portugalin kieli, runot (82.64)
alternative label: Portugalinkielinen kaunokirjallisuus, runot (82.64)
alternative label: Portugisisk skönlitteratur, poesi (82.64) @sv
alternative label: Portugisiska, poesi (82.64) @sv
broader: Romaanisilla kielillä julkaistut runot
in scheme: YKL - Yleisten kirjastojen luokitusjärjestelmä
notation: 82.64
preferred label: Poems in Portuguese @en
preferred label: Poesi på portugisiska @sv

Romaniankieliset runot
type: Concept
type: YKL-luokka
alternative label: Romanian kieli, runot (82.65)
alternative label: Romaniankielinen kaunokirjallisuus, runot (82.65)
alternative label: Rumänsk skönlitteratur, poesi (82.65) @sv
alternative label: Rumänska, poesi (82.65) @sv
broader: Romaanisilla kielillä julkaistut runot
in scheme: YKL - Yleisten kirjastojen luokitusjärjestelmä
notation: 82.65
preferred label: Poems in Romanian @en
preferred label: Poesi på rumänska @sv

Muilla romaanisilla kielillä julkaistut runot
type: Concept
type: YKL-luokka
broader: Romaanisilla kielillä julkaistut runot
in scheme: YKL - Yleisten kirjastojen luokitusjärjestelmä
narrower: Katalaaninkieliset runot
notation: 82.67
preferred label: Poems in other Romanic languages @en
preferred label: Poesi på övriga romanska språk @sv

Katalaaninkieliset runot
type: Concept
type: YKL-luokka
alternative label: Katalaanin kieli, runot (82.671)
alternative label: Katalanska, poesi (82.671) @sv
broader: Muilla romaanisilla kielillä julkaistut runot
in scheme: YKL - Yleisten kirjastojen luokitusjärjestelmä
notation: 82.671
preferred label: Poems in Catalan language @en
preferred label: Poesi på katalanska @sv

Slaavilaisilla ja balttilaisilla kielillä julkaistut runot
type: Concept
type: YKL-luokka
broader: RUNOT
in scheme: YKL - Yleisten kirjastojen luokitusjärjestelmä
narrower: Venäjänkieliset runot
narrower: Ukrainankieliset runot. Valkovenäjänkieliset runot
narrower: Puolankieliset runot
narrower: Tšekinkinkieliset runot
narrower: Slovakinkieliset runot
narrower: Eteläslaavilaisilla kielillä julkaistut runot
narrower: Balttilaisilla kielillä julkaistut runot
notation: 82.7
preferred label: Poems in Slavonic and Baltic languages @en
preferred label: Poesi på slaviska och baltiska språk @sv

Venäjänkieliset runot
type: Concept
type: YKL-luokka
alternative label: Rysk skönlitteratur, poesi (82.71) @sv
alternative label: Ryska, poesi (82.71) @sv
alternative label: Venäjän kieli, runot (82.71)
alternative label: Venäjänkielinen kaunokirjallisuus, runot (82.71)
broader: Slaavilaisilla ja balttilaisilla kielillä julkaistut runot
in scheme: YKL - Yleisten kirjastojen luokitusjärjestelmä
notation: 82.71
preferred label: Poems in Russian @en
preferred label: Poesi på ryska @sv

Ukrainankieliset runot. Valkovenäjänkieliset runot
type: Concept
type: YKL-luokka
broader: Slaavilaisilla ja balttilaisilla kielillä julkaistut runot
in scheme: YKL - Yleisten kirjastojen luokitusjärjestelmä
narrower: Ukrainankieliset runot
narrower: Valkovenäjänkieliset runot
notation: 82.72
preferred label: Poems in Ukrainian. Poems in Byelorussian @en
preferred label: Poesi på ukrainska. Poesi på vitryska @sv

Ukrainankieliset runot
type: Concept
type: YKL-luokka
alternative label: Ukrainan kieli, runot (82.721)
alternative label: Ukrainska, poesi (82.721) @sv
broader: Ukrainankieliset runot. Valkovenäjänkieliset runot
in scheme: YKL - Yleisten kirjastojen luokitusjärjestelmä
notation: 82.721
preferred label: Poems in Ukrainian @en
preferred label: Poesi på ukrainska @sv

Valkovenäjänkieliset runot
type: Concept
type: YKL-luokka
alternative label: Valkovenäjän kieli, runot (82.722)
alternative label: Vitryska, poesi (82.722) @sv
broader: Ukrainankieliset runot. Valkovenäjänkieliset runot
in scheme: YKL - Yleisten kirjastojen luokitusjärjestelmä
notation: 82.722
preferred label: Poems in Belarusian language @en
preferred label: Poesi på vitryska @sv

Puolankieliset runot
type: Concept
type: YKL-luokka
alternative label: Polsk skönlitteratur, poesi (82.73) @sv
alternative label: Polska, poesi (82.73) @sv
alternative label: Puolan kieli, runot (82.73)
alternative label: Puolankielinen kaunokirjallisuus, runot (82.73)
broader: Slaavilaisilla ja balttilaisilla kielillä julkaistut runot
in scheme: YKL - Yleisten kirjastojen luokitusjärjestelmä
notation: 82.73
preferred label: Poems in Polish @en
preferred label: Poesi på polska @sv

Tšekinkinkieliset runot
type: Concept
type: YKL-luokka
alternative label: Tjeckisk skönlitteratur, poesi (82.74) @sv
alternative label: Tjeckiska, poesi (82.74) @sv
alternative label: Tšekin kieli, runot (82.74)
alternative label: Tšekinkielinen kaunokirjallisuus, runot (82.74)
broader: Slaavilaisilla ja balttilaisilla kielillä julkaistut runot
in scheme: YKL - Yleisten kirjastojen luokitusjärjestelmä
notation: 82.74
preferred label: Poems in Czech @en
preferred label: Poesi på tjeckiska @sv

Slovakinkieliset runot
type: Concept
type: YKL-luokka
alternative label: Slovakin kieli, runot (82.75)
alternative label: Slovakinkielinen kaunokirjallisuus, runot (82.75)
alternative label: Slovakisk skönlitteratur, poesi (82.75) @sv
alternative label: Slovakiska, poesi (82.75) @sv
broader: Slaavilaisilla ja balttilaisilla kielillä julkaistut runot
in scheme: YKL - Yleisten kirjastojen luokitusjärjestelmä
notation: 82.75
preferred label: Poems in Slovak @en
preferred label: Poesi på slovakiska @sv

Eteläslaavilaisilla kielillä julkaistut runot
type: Concept
type: YKL-luokka
broader: Slaavilaisilla ja balttilaisilla kielillä julkaistut runot
in scheme: YKL - Yleisten kirjastojen luokitusjärjestelmä
narrower: Bulgariankieliset runot
narrower: Makedoniankieliset runot
narrower: Sloveeninkieliset runot
narrower: Serbiankieliset runot
narrower: Kroatiankieliset runot
narrower: Bosniankieliset runot
notation: 82.76
preferred label: Poems in South-Slavonic languages @en
preferred label: Poesi på sydslaviska språk @sv

Bulgariankieliset runot
type: Concept
type: YKL-luokka
alternative label: Bulgarian kieli, runot (82.761)
alternative label: Bulgariankielinen kaunokirjallisuus, runot (82.761)
alternative label: Bulgarisk skönlitteratur, poesi (82.761) @sv
alternative label: Bulgariska, poesi (82.761) @sv
broader: Eteläslaavilaisilla kielillä julkaistut runot
in scheme: YKL - Yleisten kirjastojen luokitusjärjestelmä
notation: 82.761
preferred label: Poems in Bulgarian @en
preferred label: Poesi på bulgariska @sv

Makedoniankieliset runot
type: Concept
type: YKL-luokka
alternative label: Makedonian kieli, runot (82.762)
alternative label: Makedoniankielinen kaunokirjallisuus, runot (82.762)
alternative label: Makedonsk skönlitteratur, poesi (82.762) @sv
alternative label: Makedonska, poesi (82.762) @sv
broader: Eteläslaavilaisilla kielillä julkaistut runot
in scheme: YKL - Yleisten kirjastojen luokitusjärjestelmä
notation: 82.762
preferred label: Poems in Macedonian @en
preferred label: Poesi på makedonska @sv

Sloveeninkieliset runot
type: Concept
type: YKL-luokka
alternative label: Sloveenin kieli, runot (82.763)
alternative label: Sloveeninkielinen kaunokirjallisuus, runot (82.763)
alternative label: Slovensk skönlitteratur, poesi (82.763) @sv
alternative label: Slovenska, poesi (82.763) @sv
broader: Eteläslaavilaisilla kielillä julkaistut runot
in scheme: YKL - Yleisten kirjastojen luokitusjärjestelmä
notation: 82.763
preferred label: Poems in Slovenian @en
preferred label: Poesi på slovenska @sv

Serbiankieliset runot
type: Concept
type: YKL-luokka
alternative label: Serbian kieli, runot (82.764)
alternative label: Serbiankielinen kaunokirjallisuus, runot (82.764)
alternative label: Serbisk skönlitteratur, poesi (82.764) @sv
alternative label: Serbiska, poesi (82.764) @sv
broader: Eteläslaavilaisilla kielillä julkaistut runot
in scheme: YKL - Yleisten kirjastojen luokitusjärjestelmä
notation: 82.764
preferred label: Poems in Serbian @en
preferred label: Poesi på serbiska @sv

Kroatiankieliset runot
type: Concept
type: YKL-luokka
alternative label: Kroaatin kieli, runot (82.765)
alternative label: Kroaatinkielinen kaunokirjallisuus, runot (82.765)
alternative label: Kroatian kieli, runot (82.765)
alternative label: Kroatiankielinen kaunokirjallisuus, runot (82.765)
alternative label: Kroatisk skönlitteratur, poesi (82.765) @sv
alternative label: Kroatiska, poesi (82.765) @sv
broader: Eteläslaavilaisilla kielillä julkaistut runot
in scheme: YKL - Yleisten kirjastojen luokitusjärjestelmä
notation: 82.765
preferred label: Poems in Croatian @en
preferred label: Poesi på kroatiska @sv

Bosniankieliset runot
type: Concept
type: YKL-luokka
alternative label: Bosnian kieli, runot (82.766)
alternative label: Bosniankielinen kaunokirjallisuus, runot (82.766)
alternative label: Bosnisk skönlitteratur, poesi (82.766) @sv
alternative label: Bosniska, poesi (82.766) @sv
broader: Eteläslaavilaisilla kielillä julkaistut runot
in scheme: YKL - Yleisten kirjastojen luokitusjärjestelmä
notation: 82.766
preferred label: Poems in Bosnian @en
preferred label: Poesi på bosniska @sv

Balttilaisilla kielillä julkaistut runot
type: Concept
type: YKL-luokka
broader: Slaavilaisilla ja balttilaisilla kielillä julkaistut runot
in scheme: YKL - Yleisten kirjastojen luokitusjärjestelmä
narrower: Latviankieliset runot
narrower: Liettuankieliset runot
notation: 82.78
preferred label: Poems in Baltic languages @en
preferred label: Poesi på baltiska språk @sv

Latviankieliset runot
type: Concept
type: YKL-luokka
alternative label: Latvian kieli, runot (82.781)
alternative label: Latviankielinen kaunokirjallisuus, runot (82.781)
alternative label: Lettisk skönlitteratur, poesi (82.781) @sv
alternative label: Lettiska, poesi (82.781) @sv
broader: Balttilaisilla kielillä julkaistut runot
in scheme: YKL - Yleisten kirjastojen luokitusjärjestelmä
notation: 82.781
preferred label: Poems in Latvian @en
preferred label: Poesi på lettiska @sv

Liettuankieliset runot
type: Concept
type: YKL-luokka
alternative label: Liettuan kieli, runot (82.782)
alternative label: Liettuankielinen kaunokirjallisuus, runot (82.782)
alternative label: Litauisk skönlitteratur, poesi (82.782) @sv
alternative label: Litauiska, poesi (82.782) @sv
broader: Balttilaisilla kielillä julkaistut runot
in scheme: YKL - Yleisten kirjastojen luokitusjärjestelmä
notation: 82.782
preferred label: Poems in Lithuanian @en
preferred label: Poesi på litauiska @sv

Muilla indoeurooppalaisilla kielillä julkaistut runot
type: Concept
type: YKL-luokka
broader: RUNOT
in scheme: YKL - Yleisten kirjastojen luokitusjärjestelmä
narrower: Kreikankieliset runot
narrower: Latinankieliset runot
narrower: Indoiraanisilla kielillä julkaistut runot
narrower: Albaniankieliset runot
narrower: Armeniankieliset runot
narrower: Kelttiläisillä kielillä julkaistut runot
notation: 82.8
preferred label: Poems in other Indo-European languages @en
preferred label: Poesi på övriga indoeuropeiska språk @sv

Kreikankieliset runot
type: Concept
type: YKL-luokka
alternative label: Grekisk skönlitteratur, forngrekiska, poesi (82.81) @sv
alternative label: Grekiska, forngrekiska, poesi (82.81) @sv
alternative label: Kreikan kieli, muinaiskreikka, runot (82.81)
alternative label: Kreikankielinen kaunokirjallisuus, muinaiskreikka, runot (82.81)
broader: Muilla indoeurooppalaisilla kielillä julkaistut runot
in scheme: YKL - Yleisten kirjastojen luokitusjärjestelmä
narrower: Nykykreikankieliset runot
notation: 82.81
preferred label: Poems in Greek @en
preferred label: Poesi på grekiska @sv

Nykykreikankieliset runot
type: Concept
type: YKL-luokka
alternative label: Grekisk skönlitteratur, nygrekiska, poesi (82.812) @sv
alternative label: Grekiska, nygrekiska, poesi (82.812) @sv
alternative label: Kreikan kieli, nykykreikka, runot (82.812)
alternative label: Kreikankielinen kaunokirjallisuus, nykykreikka, runot (82.812)
broader: Kreikankieliset runot
in scheme: YKL - Yleisten kirjastojen luokitusjärjestelmä
notation: 82.812
preferred label: Poems in Modern Greek @en
preferred label: Poesi på nygrekiska @sv

Latinankieliset runot
type: Concept
type: YKL-luokka
alternative label: Latin, poesi (82.82) @sv
alternative label: Latinan kieli, runot (82.82)
alternative label: Latinankielinen kaunokirjallisuus, runot (82.82)
alternative label: Latinsk skönlitteratur, poesi (82.82) @sv
broader: Muilla indoeurooppalaisilla kielillä julkaistut runot
in scheme: YKL - Yleisten kirjastojen luokitusjärjestelmä
notation: 82.82
preferred label: Poems in Latin @en
preferred label: Poesi på latin @sv

Indoiraanisilla kielillä julkaistut runot
type: Concept
type: YKL-luokka
broader: Muilla indoeurooppalaisilla kielillä julkaistut runot
in scheme: YKL - Yleisten kirjastojen luokitusjärjestelmä
narrower: Persiankieliset runot
narrower: Kurdinkieliset runot
narrower: Paštunkieliset runot
narrower: Indoarjalaisilla kielillä julkaistut runot
notation: 82.83
preferred label: Poems in Indo-Iranian languages @en
preferred label: Poesi på indoiranska språk @sv
scope note: Intialaisilla ja iranilaisilla kielillä julkaistut runot
scope note: Poesi på indiska och iranska språk @sv

Persiankieliset runot
type: Concept
type: YKL-luokka
alternative label: Persian kieli, runot (82.831)
alternative label: Persiankielinen kaunokirjallisuus, runot (82.831)
alternative label: Persisk skönlitteratur, poesi (82.831) @sv
alternative label: Persiska, poesi (82.831) @sv
broader: Indoiraanisilla kielillä julkaistut runot
in scheme: YKL - Yleisten kirjastojen luokitusjärjestelmä
narrower: Darinkieliset runot
notation: 82.831
preferred label: Poems in Persian @en
preferred label: Poesi på persiska @sv

Darinkieliset runot
type: Concept
type: YKL-luokka
alternative label: Dari, poesi (82.8311) @sv
alternative label: Darin kieli, runot (82.8311)
alternative label: Darinkielinen kaunokirjallisuus, runot (82.8311)
alternative label: Skönlitteratur på dari, poesi (82.8311) @sv
broader: Persiankieliset runot
in scheme: YKL - Yleisten kirjastojen luokitusjärjestelmä
notation: 82.8311
preferred label: Poems in Dari language @en
preferred label: Poesi på dari @sv

Kurdinkieliset runot
type: Concept
type: YKL-luokka
alternative label: Kurdin kieli, runot (82.832)
alternative label: Kurdinkielinen kaunokirjallisuus, runot (82.832)
alternative label: Kurdisk skönlitteratur, poesi (82.832) @sv
alternative label: Kurdiska, poesi (82.832) @sv
broader: Indoiraanisilla kielillä julkaistut runot
in scheme: YKL - Yleisten kirjastojen luokitusjärjestelmä
narrower: Kurmandžinkieliset runot
narrower: Soraninkieliset runot
notation: 82.832
preferred label: Poems in Kurdish @en
preferred label: Poesi på kurdiska @sv

Kurmandžinkieliset runot
type: Concept
type: YKL-luokka
alternative label: Kurmandžin kieli, runot (82.8321)
alternative label: Kurmanji, poesi (82.8321) @sv
broader: Kurdinkieliset runot
in scheme: YKL - Yleisten kirjastojen luokitusjärjestelmä
notation: 82.8321
preferred label: Poems in Kurmanji language @en
preferred label: Poesi på kurmanji @sv

Soraninkieliset runot
type: Concept
type: YKL-luokka
alternative label: Sorani, poesi (82.8322) @sv
alternative label: Soranin kieli, runot (82.8322)
broader: Kurdinkieliset runot
in scheme: YKL - Yleisten kirjastojen luokitusjärjestelmä
notation: 82.8322
preferred label: Poems in Sorani language @en
preferred label: Poesi på sorani @sv

Paštunkieliset runot
type: Concept
type: YKL-luokka
alternative label: Pashto, poesi (82.833) @sv
alternative label: Paštun kieli, runot (82.833)
broader: Indoiraanisilla kielillä julkaistut runot
in scheme: YKL - Yleisten kirjastojen luokitusjärjestelmä
notation: 82.833
preferred label: Poems in Pushto language @en
preferred label: Poesi på pashto @sv

Indoarjalaisilla kielillä julkaistut runot
type: Concept
type: YKL-luokka
broader: Indoiraanisilla kielillä julkaistut runot
in scheme: YKL - Yleisten kirjastojen luokitusjärjestelmä
narrower: Bengalinkieliset runot
narrower: Gudžaratinkieliset runot
narrower: Hindinkieliset runot
narrower: Pandzabinkieliset runot
narrower: Romanikieliset runot
narrower: Urdunkieliset runot
narrower: Nepalinkieliset runot
narrower: Sinhalankieliset runot
notation: 82.836
preferred label: Poems in Indo-Aryan languages @en
preferred label: Poesi på indoariska spåk @sv

Bengalinkieliset runot
type: Concept
type: YKL-luokka
alternative label: Bengali, poesi (82.8361) @sv
alternative label: Bengalin kieli, runot (82.8361)
broader: Indoarjalaisilla kielillä julkaistut runot
in scheme: YKL - Yleisten kirjastojen luokitusjärjestelmä
notation: 82.8361
preferred label: Poems in Bengali language @en
preferred label: Poesi på bengali @sv

Gudžaratinkieliset runot
type: Concept
type: YKL-luokka
alternative label: Gudžaratin kieli, runot (82.8362)
alternative label: Gujarati, poesi (82.8362) @sv
broader: Indoarjalaisilla kielillä julkaistut runot
in scheme: YKL - Yleisten kirjastojen luokitusjärjestelmä
notation: 82.8362
preferred label: Poems in Gujarati language @en
preferred label: Poesi på gujarati @sv

Hindinkieliset runot
type: Concept
type: YKL-luokka
alternative label: Hindi, poesi (82.8363) @sv
alternative label: Hindin kieli, runot (82.8363)
broader: Indoarjalaisilla kielillä julkaistut runot
in scheme: YKL - Yleisten kirjastojen luokitusjärjestelmä
notation: 82.8363
preferred label: Poems in Hindi language @en
preferred label: Poesi på hindi @sv

Pandzabinkieliset runot
type: Concept
type: YKL-luokka
alternative label: Pandzabin kieli, runot (82.8364)
alternative label: Panjabi, poesi (82.8364) @sv
broader: Indoarjalaisilla kielillä julkaistut runot
in scheme: YKL - Yleisten kirjastojen luokitusjärjestelmä
notation: 82.8364
preferred label: Poems in Punjabi language @en
preferred label: Poesi på panjabi @sv

Romanikieliset runot
type: Concept
type: YKL-luokka
alternative label: Romani, poesi (82.8365) @sv
alternative label: Romanikieli, runot (82.8365)
broader: Indoarjalaisilla kielillä julkaistut runot
in scheme: YKL - Yleisten kirjastojen luokitusjärjestelmä
notation: 82.8365
preferred label: Poems in Romani language @en
preferred label: Poesi på romani @sv

Urdunkieliset runot
type: Concept
type: YKL-luokka
alternative label: Urdu, poesi (82.8366) @sv
alternative label: Urdun kieli, runot (82.8366)
broader: Indoarjalaisilla kielillä julkaistut runot
in scheme: YKL - Yleisten kirjastojen luokitusjärjestelmä
notation: 82.8366
preferred label: Poems in Urdu language @en
preferred label: Poesi på urdu @sv

Nepalinkieliset runot
type: Concept
type: YKL-luokka
alternative label: Nepali, poesi (82.8367) @sv
alternative label: Nepalin kieli, runot (82.8367)
broader: Indoarjalaisilla kielillä julkaistut runot
in scheme: YKL - Yleisten kirjastojen luokitusjärjestelmä
notation: 82.8367
preferred label: Poems in Nepali language @en
preferred label: Poesi på nepali @sv

Sinhalankieliset runot
type: Concept
type: YKL-luokka
alternative label: Singalesiska, poesi (82.8368) @sv
alternative label: Sinhalan kieli, runot (82.8368)
broader: Indoarjalaisilla kielillä julkaistut runot
in scheme: YKL - Yleisten kirjastojen luokitusjärjestelmä
notation: 82.8368
preferred label: Poems in Sinhalese language @en
preferred label: Poesi på singalesiska @sv

Albaniankieliset runot
type: Concept
type: YKL-luokka
alternative label: Albanian kieli, runot (82.84)
alternative label: Albaniankielinen kaunokirjallisuus, runot (82.84)
alternative label: Albansk skönlitteratur, poesi (82.84) @sv
alternative label: Albanska, poesi (82.84) @sv
broader: Muilla indoeurooppalaisilla kielillä julkaistut runot
in scheme: YKL - Yleisten kirjastojen luokitusjärjestelmä
notation: 82.84
preferred label: Poems in Albanian @en
preferred label: Poesi på albanska @sv

Armeniankieliset runot
type: Concept
type: YKL-luokka
alternative label: Armenian kieli, runot (82.85)
alternative label: Armeniska, poesi (82.85) @sv
broader: Muilla indoeurooppalaisilla kielillä julkaistut runot
in scheme: YKL - Yleisten kirjastojen luokitusjärjestelmä
notation: 82.85
preferred label: Poems in Armenian language @en
preferred label: Poesi på armeniska @sv

Kelttiläisillä kielillä julkaistut runot
type: Concept
type: YKL-luokka
broader: Muilla indoeurooppalaisilla kielillä julkaistut runot
in scheme: YKL - Yleisten kirjastojen luokitusjärjestelmä
notation: 82.88
preferred label: Poems in Celtic languages @en
preferred label: Poesi på keltiska språk @sv

Muilla kielillä julkaistut runot
type: Concept
type: YKL-luokka
broader: RUNOT
in scheme: YKL - Yleisten kirjastojen luokitusjärjestelmä
narrower: Turkkilaisilla kielillä julkaistut runot
narrower: Afroaasialaisilla kielillä julkaistut runot
narrower: Sinotiibetiläisillä ja austroaasialaisilla kielillä julkaistut runot
narrower: Japaninkieliset runot. Koreankieliset runot
narrower: Afrikkalaisilla kielillä julkaistut runot
narrower: Kaukasialaisilla kielillä julkaistut runot
narrower: Eskimo- ja intiaanikielillä julkaistut runot
narrower: Muilla ei-indoeurooppalaisilla kielillä julkaistut runot
notation: 82.9
preferred label: Poems in other languages @en
preferred label: Poesi på övriga språk @sv

Turkkilaisilla kielillä julkaistut runot
type: Concept
type: YKL-luokka
broader: Muilla kielillä julkaistut runot
in scheme: YKL - Yleisten kirjastojen luokitusjärjestelmä
narrower: Turkinkieliset runot
narrower: Azerinkieliset runot
narrower: Turkmeeninkieliset runot
narrower: Uiguurinkieliset runot
narrower: Uzbekinkieliset runot
notation: 82.91
preferred label: Poems in Turkic languages @en
preferred label: Poesi på turkiska spåk @sv

Turkinkieliset runot
type: Concept
type: YKL-luokka
alternative label: Turkin kieli, runot (82.911)
alternative label: Turkiska, poesi (82.911) @sv
broader: Turkkilaisilla kielillä julkaistut runot
in scheme: YKL - Yleisten kirjastojen luokitusjärjestelmä
notation: 82.911
preferred label: Poems in Turkish language @en
preferred label: Poesi på turkiska @sv

Azerinkieliset runot
type: Concept
type: YKL-luokka
alternative label: Azerbajdzjanska, poesi (82.912) @sv
alternative label: Azerin kieli, runot (82.912)
broader: Turkkilaisilla kielillä julkaistut runot
in scheme: YKL - Yleisten kirjastojen luokitusjärjestelmä
notation: 82.912
preferred label: Poems in Azerbaijani language @en
preferred label: Poesi på azerbajdzjanska @sv

Turkmeeninkieliset runot
type: Concept
type: YKL-luokka
alternative label: Turkmeenin kieli, runot (82.913)
alternative label: Turkmeniska, poesi (82.913) @sv
broader: Turkkilaisilla kielillä julkaistut runot
in scheme: YKL - Yleisten kirjastojen luokitusjärjestelmä
notation: 82.913
preferred label: Poems in Turkmen language @en
preferred label: Poesi på turkmeniska @sv

Uiguurinkieliset runot
type: Concept
type: YKL-luokka
alternative label: Uiguriska, poesi (82.914) @sv
alternative label: Uiguurin kieli, runot (82.914)
broader: Turkkilaisilla kielillä julkaistut runot
in scheme: YKL - Yleisten kirjastojen luokitusjärjestelmä
notation: 82.914
preferred label: Poems in Uighur language @en
preferred label: Poesi på uiguriska @sv

Uzbekinkieliset runot
type: Concept
type: YKL-luokka
alternative label: Uzbekin kieli, runot (82.915)
alternative label: Uzbekiska, poesi (82.915) @sv
broader: Turkkilaisilla kielillä julkaistut runot
in scheme: YKL - Yleisten kirjastojen luokitusjärjestelmä
notation: 82.915
preferred label: Poems in Uzbek language @en
preferred label: Poesi på uzbekiska @sv

Afroaasialaisilla kielillä julkaistut runot
type: Concept
type: YKL-luokka
broader: Muilla kielillä julkaistut runot
in scheme: YKL - Yleisten kirjastojen luokitusjärjestelmä
narrower: Hepreankieliset runot
narrower: Arabiankieliset runot
narrower: Amharankieliset runot
narrower: Tigrinjankieliset runot
narrower: Somalinkieliset runot
notation: 82.92
preferred label: Poems in Afroasiatic languages @en
preferred label: Poesi på afroasiatiska @sv

Hepreankieliset runot
type: Concept
type: YKL-luokka
alternative label: Hebreisk skönlitteratur, poesi (82.922) @sv
alternative label: Hebreiska, poesi (82.922) @sv
alternative label: Heprean kieli, runot (82.922)
alternative label: Hepreankielinen kaunokirjallisuus, runot (82.922)
broader: Afroaasialaisilla kielillä julkaistut runot
in scheme: YKL - Yleisten kirjastojen luokitusjärjestelmä
notation: 82.922
preferred label: Poems in Hebrew @en
preferred label: Poesi på hebreiska @sv

Arabiankieliset runot
type: Concept
type: YKL-luokka
alternative label: Arabian kieli, runot (82.923)
alternative label: Arabiankielinen kaunokirjallisuus, runot (82.923)
alternative label: Arabisk skönlitteratur, poesi (82.923) @sv
alternative label: Arabiska, poesi (82.923) @sv
broader: Afroaasialaisilla kielillä julkaistut runot
in scheme: YKL - Yleisten kirjastojen luokitusjärjestelmä
notation: 82.923
preferred label: Poems in Arabic @en
preferred label: Poesi på arabiska @sv

Amharankieliset runot
type: Concept
type: YKL-luokka
alternative label: Amharan kieli, runot (82.924)
alternative label: Amhariska, poesi (82.924) @sv
broader: Afroaasialaisilla kielillä julkaistut runot
in scheme: YKL - Yleisten kirjastojen luokitusjärjestelmä
notation: 82.924
preferred label: Poems in Amharic language @en
preferred label: Poesi på amhariska @sv

Tigrinjankieliset runot
type: Concept
type: YKL-luokka
alternative label: Tigrinja, poesi (82.925) @sv
alternative label: Tigrinjan kieli, runot (82.925)
broader: Afroaasialaisilla kielillä julkaistut runot
in scheme: YKL - Yleisten kirjastojen luokitusjärjestelmä
notation: 82.925
preferred label: Poems in Tigrinya language @en
preferred label: Poesi på tigrinja @sv

Somalinkieliset runot
type: Concept
type: YKL-luokka
alternative label: Somalin kieli, runot (82.926)
alternative label: Somaliska, poesi (82.926) @sv
broader: Afroaasialaisilla kielillä julkaistut runot
in scheme: YKL - Yleisten kirjastojen luokitusjärjestelmä
notation: 82.926
preferred label: Poems in Somali language @en
preferred label: Poesi på somaliska @sv

Sinotiibetiläisillä ja austroaasialaisilla kielillä julkaistut runot
type: Concept
type: YKL-luokka
broader: Muilla kielillä julkaistut runot
in scheme: YKL - Yleisten kirjastojen luokitusjärjestelmä
narrower: Kiinankieliset runot
narrower: Burmankieliset runot
narrower: Kareninkieliset runot
narrower: Thainkieliset runot
narrower: Vietnaminkieliset runot
narrower: Khmerinkieliset runot
notation: 82.94
preferred label: Poems in Sino-Tibetan and Austroasiatic languages @en
preferred label: Poesi på sinotibetanska och austroasiatiska språk @sv

Kiinankieliset runot
type: Concept
type: YKL-luokka
alternative label: Kiinan kieli, runot (82.943)
alternative label: Kiinankielinen kaunokirjallisuus, runot (82.943)
alternative label: Kinesisk skönlitteratur, poesi (82.943) @sv
alternative label: Kinesiska, poesi (82.943) @sv
broader: Sinotiibetiläisillä ja austroaasialaisilla kielillä julkaistut runot
in scheme: YKL - Yleisten kirjastojen luokitusjärjestelmä
notation: 82.943
preferred label: Poems in Chinese @en
preferred label: Poesi på kinesiska @sv

Burmankieliset runot
type: Concept
type: YKL-luokka
alternative label: Burman kieli, runot (82.944)
alternative label: Burmesiska, poesi (82.944) @sv
broader: Sinotiibetiläisillä ja austroaasialaisilla kielillä julkaistut runot
in scheme: YKL - Yleisten kirjastojen luokitusjärjestelmä
notation: 82.944
preferred label: Poems in Burmese language @en
preferred label: Poesi på burmesiska @sv

Kareninkieliset runot
type: Concept
type: YKL-luokka
alternative label: Karenin kieli, runot (82.945)
alternative label: Karenska, poesi (82.945) @sv
broader: Sinotiibetiläisillä ja austroaasialaisilla kielillä julkaistut runot
in scheme: YKL - Yleisten kirjastojen luokitusjärjestelmä
notation: 82.945
preferred label: Poems in Karen languages @en
preferred label: Poesi på karenska @sv

Thainkieliset runot
type: Concept
type: YKL-luokka
alternative label: Thai, poesi (82.946) @sv
alternative label: Thailändsk skönlitteratur, poesi (82.946) @sv
alternative label: Thain kieli, runot (82.946)
alternative label: Thainkielinen kaunokirjallisuus, runot (82.946)
broader: Sinotiibetiläisillä ja austroaasialaisilla kielillä julkaistut runot
in scheme: YKL - Yleisten kirjastojen luokitusjärjestelmä
notation: 82.946
preferred label: Poems in Thai @en
preferred label: Poesi på thailändska @sv

Vietnaminkieliset runot
type: Concept
type: YKL-luokka
alternative label: Vietnamesisk skönlitteratur, poesi (82.948) @sv
alternative label: Vietnamesiska, poesi (82.948) @sv
alternative label: Vietnamin kieli, runot (82.948)
alternative label: Vietnaminkielinen kaunokirjallisuus, runot (82.948)
broader: Sinotiibetiläisillä ja austroaasialaisilla kielillä julkaistut runot
in scheme: YKL - Yleisten kirjastojen luokitusjärjestelmä
notation: 82.948
preferred label: Poems in Vietnamese @en
preferred label: Poesi på vietnamesiska @sv

Khmerinkieliset runot
type: Concept
type: YKL-luokka
alternative label: Khmer, poesi (82.949) @sv
alternative label: Khmerin kieli, runot (82.949)
broader: Sinotiibetiläisillä ja austroaasialaisilla kielillä julkaistut runot
in scheme: YKL - Yleisten kirjastojen luokitusjärjestelmä
notation: 82.949
preferred label: Poems in Khmer language @en
preferred label: Poesi på khmer @sv

Japaninkieliset runot. Koreankieliset runot
type: Concept
type: YKL-luokka
broader: Muilla kielillä julkaistut runot
in scheme: YKL - Yleisten kirjastojen luokitusjärjestelmä
narrower: Japaninkieliset runot
narrower: Koreankieliset runot
notation: 82.95
preferred label: Poems in Japanese. Poems in Korean @en
preferred label: Poesi på japanska. Poesi på koreanska @sv

Japaninkieliset runot
type: Concept
type: YKL-luokka
alternative label: Japanin kieli, runot (82.951)
alternative label: Japaninkielinen kaunokirjallisuus, runot (82.951)
alternative label: Japansk skönlitteratur, poesi (82.951) @sv
alternative label: Japanska, poesi (82.951) @sv
broader: Japaninkieliset runot. Koreankieliset runot
in scheme: YKL - Yleisten kirjastojen luokitusjärjestelmä
notation: 82.951
preferred label: Poems in Japanese @en
preferred label: Poesi på japanska @sv

Koreankieliset runot
type: Concept
type: YKL-luokka
alternative label: Korean kieli, runot (82.955)
alternative label: Koreankielinen kaunokirjallisuus, runot (82.955)
alternative label: Koreansk skönlitteratur, poesi (82.955) @sv
alternative label: Koreanska, poesi (82.955) @sv
broader: Japaninkieliset runot. Koreankieliset runot
in scheme: YKL - Yleisten kirjastojen luokitusjärjestelmä
notation: 82.955
preferred label: Poems in Korean @en
preferred label: Poesi på koreanska @sv

Afrikkalaisilla kielillä julkaistut runot
type: Concept
type: YKL-luokka
broader: Muilla kielillä julkaistut runot
in scheme: YKL - Yleisten kirjastojen luokitusjärjestelmä
narrower: Swahilinkieliset runot
narrower: Lingalankieliset runot
notation: 82.96
preferred label: Poems in African languages @en
preferred label: Poesi på afrikanska språk @sv
scope note: Hit poesi på afrikanska språk som talas söder om Sahara, Etiopien och Somalia @sv
scope note: Tähän Saharan, Etiopian ja Somalian eteläpuolella puhutuilla afrikkalaisilla kielillä julkaistut runot

Swahilinkieliset runot
type: Concept
type: YKL-luokka
alternative label: Swahili, poesi (82.961) @sv
alternative label: Swahilin kieli, runot (82.961)
broader: Afrikkalaisilla kielillä julkaistut runot
in scheme: YKL - Yleisten kirjastojen luokitusjärjestelmä
notation: 82.961
preferred label: Poems in Swahili language @en
preferred label: Poesi på swahili @sv

Lingalankieliset runot
type: Concept
type: YKL-luokka
alternative label: Lingala, poesi (82.962) @sv
alternative label: Lingalan kieli, runot (82.962)
broader: Afrikkalaisilla kielillä julkaistut runot
in scheme: YKL - Yleisten kirjastojen luokitusjärjestelmä
notation: 82.962
preferred label: Poems in Lingala language @en
preferred label: Poesi på lingala @sv

Kaukasialaisilla kielillä julkaistut runot
type: Concept
type: YKL-luokka
broader: Muilla kielillä julkaistut runot
in scheme: YKL - Yleisten kirjastojen luokitusjärjestelmä
narrower: Georgiankieliset runot
narrower: Abhaasin, kabardin ja adygenkieliset runot
narrower: Tšetšeeninkieliset runot
notation: 82.97
preferred label: Poems in Caucasian languages @en
preferred label: Poesi på kaukasiska spåk @sv

Georgiankieliset runot
type: Concept
type: YKL-luokka
alternative label: Georgian kieli, runot (82.971)
alternative label: Georgiska, poesi (82.971) @sv
broader: Kaukasialaisilla kielillä julkaistut runot
in scheme: YKL - Yleisten kirjastojen luokitusjärjestelmä
notation: 82.971
preferred label: Poems in Georgian language @en
preferred label: Poesi på georgiska @sv

Abhaasin, kabardin ja adygenkieliset runot
type: Concept
type: YKL-luokka
alternative label: Abchaziska, poesi (82.972) @sv
alternative label: Abhaasin kieli, runot (82.972)
alternative label: Adygeiska, poesi (82.972) @sv
alternative label: Adygen kieli, runot (82.972)
alternative label: Kabardin kieli, runot (82.972)
alternative label: Kabardinska, poesi (82.972) @sv
broader: Kaukasialaisilla kielillä julkaistut runot
in scheme: YKL - Yleisten kirjastojen luokitusjärjestelmä
notation: 82.972
preferred label: Poems in Abkhaz, Kabardian and Adyghe languages @en
preferred label: Poesi på abchaziska, kabardinska och adygeiska @sv

Tšetšeeninkieliset runot
type: Concept
type: YKL-luokka
alternative label: Tjetjenska, poesi (82.973) @sv
alternative label: Tšetšeenin kieli, runot (82.973)
broader: Kaukasialaisilla kielillä julkaistut runot
in scheme: YKL - Yleisten kirjastojen luokitusjärjestelmä
notation: 82.973
preferred label: Poems in Chechen language @en
preferred label: Poesi på tjetjenska @sv

Eskimo- ja intiaanikielillä julkaistut runot
type: Concept
type: YKL-luokka
broader: Muilla kielillä julkaistut runot
in scheme: YKL - Yleisten kirjastojen luokitusjärjestelmä
narrower: Grönlanninkieliset runot
notation: 82.98
preferred label: Poems in Eskimo and Indian languages @en
preferred label: Poesi på eskimå- och indianspråk @sv

Grönlanninkieliset runot
type: Concept
type: YKL-luokka
alternative label: Grönlannin kieli, runot (82.981)
alternative label: Grönländska, poesi (82.981) @sv
broader: Eskimo- ja intiaanikielillä julkaistut runot
in scheme: YKL - Yleisten kirjastojen luokitusjärjestelmä
notation: 82.981
preferred label: Poems in Greenlandic language @en
preferred label: Poesi på grönländska @sv

Muilla ei-indoeurooppalaisilla kielillä julkaistut runot
type: Concept
type: YKL-luokka
alternative label: Mongolin kieli, runot (82.99)
alternative label: Mongoliska, poesi (82.99) @sv
broader: Muilla kielillä julkaistut runot
in scheme: YKL - Yleisten kirjastojen luokitusjärjestelmä
narrower: Keinotekoisilla kielillä julkaistut runot
narrower: Baskinkieliset runot
narrower: Dravidakieliset runot
narrower: Austronesialaisilla kielillä julkaistut runot
notation: 82.99
preferred label: Poems in other Non-Indoeuropean languages @en
preferred label: Poesi på övriga icke-indoeuropeiska språk @sv

Keinotekoisilla kielillä julkaistut runot
type: Concept
type: YKL-luokka
broader: Muilla ei-indoeurooppalaisilla kielillä julkaistut runot
in scheme: YKL - Yleisten kirjastojen luokitusjärjestelmä
notation: 82.991
preferred label: Poems in artificial languages @en
preferred label: Poesi på artificiella språk @sv

Baskinkieliset runot
type: Concept
type: YKL-luokka
alternative label: Baskin kieli, runot (82.992)
alternative label: Baskiska, poesi (82.992) @sv
broader: Muilla ei-indoeurooppalaisilla kielillä julkaistut runot
in scheme: YKL - Yleisten kirjastojen luokitusjärjestelmä
notation: 82.992
preferred label: Poems in Basque language @en
preferred label: Poesi på baskiska @sv

Dravidakieliset runot
type: Concept
type: YKL-luokka
broader: Muilla ei-indoeurooppalaisilla kielillä julkaistut runot
in scheme: YKL - Yleisten kirjastojen luokitusjärjestelmä
narrower: Malajalaminkieliset runot
narrower: Kannadankieliset runot
narrower: Tamilinkieliset runot
narrower: Telugunkieliset runot
notation: 82.994
preferred label: Poems in Dravidian languages @en
preferred label: Poesi på dravidiska @sv

Malajalaminkieliset runot
type: Concept
type: YKL-luokka
alternative label: Malajalamin kieli, runot (82.9941)
alternative label: Malayalam, poesi (82.9941) @sv
broader: Dravidakieliset runot
in scheme: YKL - Yleisten kirjastojen luokitusjärjestelmä
notation: 82.9941
preferred label: Poems in Malayalam language @en
preferred label: Poesi på malayalam @sv

Kannadankieliset runot
type: Concept
type: YKL-luokka
alternative label: Kannada, poesi (82.9942) @sv
alternative label: Kannadan kieli, runot (82.9942)
broader: Dravidakieliset runot
in scheme: YKL - Yleisten kirjastojen luokitusjärjestelmä
notation: 82.9942
preferred label: Poems in Kannada language @en
preferred label: Poesi på kannada @sv

Tamilinkieliset runot
type: Concept
type: YKL-luokka
alternative label: Tamil, poesi (82.9943) @sv
alternative label: Tamilin kieli, runot (82.9943)
broader: Dravidakieliset runot
in scheme: YKL - Yleisten kirjastojen luokitusjärjestelmä
notation: 82.9943
preferred label: Poems in Tamil language @en
preferred label: Poesi på tamil @sv

Telugunkieliset runot
type: Concept
type: YKL-luokka
alternative label: Telugu, poesi (82.9944) @sv
alternative label: Telugun kieli, runot (82.9944)
broader: Dravidakieliset runot
in scheme: YKL - Yleisten kirjastojen luokitusjärjestelmä
notation: 82.9944
preferred label: Poems in Telugu language @en
preferred label: Poesi på telugu @sv

Austronesialaisilla kielillä julkaistut runot
type: Concept
type: YKL-luokka
broader: Muilla ei-indoeurooppalaisilla kielillä julkaistut runot
in scheme: YKL - Yleisten kirjastojen luokitusjärjestelmä
narrower: Tagaloginkieliset runot
narrower: Malaijinkieliset runot
narrower: Indonesiankieliset runot
notation: 82.995
preferred label: Poems in Austronesian languages @en
preferred label: Poesi på austronesiska @sv

Tagaloginkieliset runot
type: Concept
type: YKL-luokka
alternative label: Tagalog, poesi (82.9951) @sv
alternative label: Tagalogin kieli, runot (82.9951)
broader: Austronesialaisilla kielillä julkaistut runot
in scheme: YKL - Yleisten kirjastojen luokitusjärjestelmä
notation: 82.9951
preferred label: Poems in Tagalog language @en
preferred label: Poesi på tagalog @sv

Malaijinkieliset runot
type: Concept
type: YKL-luokka
alternative label: Malaijin kieli, runot (82.9952)
alternative label: Malajiska, poesi (82.9952) @sv
broader: Austronesialaisilla kielillä julkaistut runot
in scheme: YKL - Yleisten kirjastojen luokitusjärjestelmä
notation: 82.9952
preferred label: Poems in Malay language @en
preferred label: Poesi på malajiska @sv

Indonesiankieliset runot
type: Concept
type: YKL-luokka
alternative label: Indonesian kieli, runot (82.9953)
alternative label: Indonesiska, poesi (82.9953) @sv
broader: Austronesialaisilla kielillä julkaistut runot
in scheme: YKL - Yleisten kirjastojen luokitusjärjestelmä
notation: 82.9953
preferred label: Poems in Indonesian language @en
preferred label: Poesi på indonesiska @sv

NÄYTELMÄT
type: Concept
References: Performanssitaide. Esitystaide
References: Teatteritaide
References: Nukketeatteri
References: Radio- ja tv-teatteri
References: Elokuvan historia. Televisio-ohjelmien historia
References: Näyttämömusiikki
References: KERTOMAKIRJALLISUUS
References: Yleinen kirjallisuudenhistoria
References: Suomen, suomalais-ugrilaisten ja uralilaisten kielten kirjallisuuden historia ja tutkimus
References: Pohjoismaisten kielten kirjallisuuden historia ja tutkimus
References: Saksankielisen kirjallisuuden historia ja tutkimus
References: Englanninkielisen kirjallisuuden historia ja tutkimus
References: Romaanisten kielten kirjallisuuden historia ja tutkimus
References: Slaavilaisten ja balttilaisten kielten kirjallisuuden historia ja tutkimus
References: Muiden indoeurooppalaisten kielten kirjallisuuden historia ja tutkimus
References: Muiden kielten kirjallisuuden historia ja tutkimus
alternative label: Anagrammit, kaunokirjallisuus (80 ... 85+)
alternative label: Animaatioelokuvat, tallenteet, fiktiiviset (80 ... 85+)
alternative label: Antologiat, kaunokirjallisuus (80 ... 85+)
alternative label: Draamat (83+)
alternative label: Elokuvakäsikirjoitukset (83+)
alternative label: Elokuvat, animaatioelokuvat, fiktiiviset, tallenteet (80 ... 85+)
alternative label: Fantasiaelokuvat, animaatioelokuvat, tallenteet (80 ... 85+)
alternative label: Kaunokirjallisuus (80 ... 85+)
alternative label: Kirjalliset äänitteet, kaunokirjallisuus (80 ... 85+)
alternative label: Kirjallisuusäänitteet, kaunokirjallisuus (80 ... 85+)
alternative label: Kirkkonäytelmät, näytelmätekstit (83+)
alternative label: Kirkkonäytelmät, taltioinnit (83+)
alternative label: Kokoomateokset, kaunokirjallisuus (80 ... 85+)
alternative label: Komediat, kuunnelmatekstit ja -tallenteet (83+)
alternative label: Komediat, näytelmätekstit ja -taltioinnit (83+)
alternative label: Kootut teokset, kaunokirjallisuus (80 ... 85+)
alternative label: Kuunnelmaesitykset, taltioinnit (83+)
alternative label: Kuunnelmat (83+)
alternative label: Kuunnelmatekstit (83+)
alternative label: Käsikirjoitukset, elokuvat (83+)
alternative label: Lastenelokuvat, animaatioelokuvat, fiktiiviset, tallenteet (80 ... 85+)
alternative label: Lastenkirjallisuus, kaunokirjallisuus (80 ... 85+)
alternative label: Lukemistot, kaunokirjallisuus (80 ... 85+)
alternative label: Lukukirjat, kaunokirjallisuus (80 ... 85+)
alternative label: Murrekirjallisuus, kaunokirjallisuus (80 ... 85+)
alternative label: Musiikkielokuvat, animaatioelokuvat, fiktiiviset, tallenteet (80 ... 85+)
alternative label: Nukke-elokuvat, fiktiiviset (80 ... 85+)
alternative label: Nuortenelokuvat, animaatioelokuvat, fiktiiviset, tallenteet (80 ... 85+)
alternative label: Nuortenkirjallisuus, kaunokirjallisuus (80 ... 85+)
alternative label: Näytelmäesitykset, taltioinnit (83+)
alternative label: Näytelmät (83+)
alternative label: Näytelmätekstit (83+)
alternative label: Ohjelmistot, kaunokirjallisuus (80 ... 85+)
alternative label: Palindromit, kaunokirjallisuus (80 ... 85+)
alternative label: Piirretyt elokuvat, fiktiiviset (80 ... 85+)
alternative label: Radio-ohjelmat, kuunnelmat (83+)
alternative label: Radioteatteri, kuunnelmatallenteet (83+)
alternative label: Radioteatteri, kuunnelmatekstit (83+)
alternative label: Runonäytelmät (83+)
alternative label: Sanaleikit, kaunokirjallisuus (80 ... 85+)
alternative label: Sketsit (83+)
alternative label: Stand up, tekstit (83+)
alternative label: Taide, kirjallisuus (80 ... 86+)
alternative label: Taidemuodot, kirjallisuus (80 ... 86+)
alternative label: Taiteet, kirjallisuus (80 ... 86+)
alternative label: Teatteriesitykset, taltioinnit (83+)
alternative label: Televisio-ohjelmat, tallenteet, fiktiiviset elokuvat ja sarjat (80 ... 85+)
alternative label: Televisioteatteri, näytelmätaltioinnit (83+)
alternative label: Valitut teokset, kaunokirjallisuus (80 ... 85+)
alternative label: Äänikirjat, kaunokirjallisuus (80 ... 85+)
broader: KAUNOKIRJALLISUUS. KIRJALLISUUSTIEDE. KIELITIEDE
in scheme: YKL - Yleisten kirjastojen luokitusjärjestelmä
narrower: Suomenkieliset näytelmät
narrower: Pohjoismaisilla kielillä julkaistut näytelmät
narrower: Saksankieliset näytelmät
narrower: Englanninkieliset näytelmät
narrower: Romaanisilla kielillä julkaistut näytelmät
narrower: Slaavilaisilla ja balttilaisilla kielillä julkaistut näytelmät
narrower: Muilla indoeurooppalaisilla kielillä julkaistut näytelmät
narrower: Muilla kielillä julkaistut näytelmät
notation: 83
scope note: Hit och till underklasserna skådespel och hörspel samt upptagningar av skådespels- och hörspelsföreställningar. Hit och till underklasserna också versdramer. Verken klassificeras efter publikationens språk, inte efter originalspråk eller publikationsland. Om ett av språken i ett tvåspråkigt verk är översättningsspråk klassificeras verket efter detta språk. Om texterna i ett två- eller flerspråkigt verk inte är översättningar av varandra klassificeras verket efter publikationens huvudspråk. Om verket inte har något huvudspråk klassificeras det efter publikationens första språk. Formtilläggen 01, 02, 03+, 06+, 07, 08+ och 09 används inte i samband med klasserna 80-85+. Filmmanuskript klassificeras i klass 83+ Om verket förutom filmmanuskriptet innehåller annan information om produktionen av filmen klassificeras det i klass 77.49+. @sv
scope note: Tähän ja alaluokkiin näytelmät ja kuunnelmat sekä näytelmä- ja kuunnelmaesitysten taltioinnit. Tähän ja alaluokkiin myös runonäytelmät. Teokset luokitetaan julkaisun kielen, ei julkaisumaan tai alkuteoksen kielen mukaan. Jos kaksikielisen teoksen toinen kieli on käännöskieli, luokitetaan teos käännöskielen mukaan. Jos kaksi- tai useampikielisen teoksen tekstit eivät ole toistensa käännöksiä, luokitetaan teos julkaisun pääkielen mukaan. Jos teoksella ei ole pääkieltä, se luokitetaan julkaisun ensimmäisen kielen mukaan. Muotoluokkia 01, 02, 03+, 06+, 07, 08+ ja 09 ei käytetä luokkien 80-85+ yhteydessä. Elokuvakäsikirjoitukset luokitetaan luokkaan 83+ Mikäli teos sisältää käsikirjoituksen lisäksi muuta informaatiota elokuvan tuotannosta, se luokitetaan luokkaan 77.49+.

Suomenkieliset näytelmät
type: Concept
type: YKL-luokka
alternative label: Finsk skönlitteratur, dramatik (83.2) @sv
alternative label: Finska, dramatik (83.2) @sv
alternative label: Suomen kieli, näytelmät (83.2)
alternative label: Suomenkielinen kaunokirjallisuus, näytelmät (83.2)
broader: NÄYTELMÄT
in scheme: YKL - Yleisten kirjastojen luokitusjärjestelmä
narrower: Meänkieliset näytelmät
narrower: Kveeninkieliset näytelmät
narrower: Vironkieliset näytelmät
narrower: Muilla itämerensuomalaisilla kielillä julkaistut näytelmät
narrower: Muilla suomalais-ugrilaisilla ja uralilaisilla kielillä julkaistut näytelmät
notation: 83.2
preferred label: Dramatik på finska @sv
preferred label: Plays in Finnish @en

Meänkieliset näytelmät
type: Concept
type: YKL-luokka
alternative label: Meänkieli, dramatik (83.21) @sv
alternative label: Meänkieli, näytelmät (83.21)
alternative label: Meänkielinen kaunokirjallisuus, näytelmät (83.21)
alternative label: Skönlitteratur på meänkieli, dramatik (83.21) @sv
alternative label: Tornedalsfinska, dramatik (83.21) @sv
broader: Suomenkieliset näytelmät
in scheme: YKL - Yleisten kirjastojen luokitusjärjestelmä
notation: 83.21
preferred label: Dramatik på meänkieli @sv
preferred label: Plays in Meänkieli @en

Kveeninkieliset näytelmät
type: Concept
type: YKL-luokka
alternative label: Kveenin kieli, näytelmät (83.22)
alternative label: Kveeninkielinen kaunokirjallisuus, näytelmät (83.22)
alternative label: Kvänsk skönlitteratur, dramatik (83.22) @sv
alternative label: Kvänska, dramatik (83.22) @sv
broader: Suomenkieliset näytelmät
in scheme: YKL - Yleisten kirjastojen luokitusjärjestelmä
notation: 83.22
preferred label: Dramatik på kvänska @sv
preferred label: Plays in Kven language @en

Vironkieliset näytelmät
type: Concept
type: YKL-luokka
alternative label: Estnisk skönlitteratur, dramatik (83.23) @sv
alternative label: Estniska, dramatik (83.23) @sv
alternative label: Viron kieli, näytelmät (83.23)
alternative label: Vironkielinen kaunokirjallisuus, näytelmät (83.23)
broader: Suomenkieliset näytelmät
in scheme: YKL - Yleisten kirjastojen luokitusjärjestelmä
notation: 83.23
preferred label: Dramatik på estniska @sv
preferred label: Plays in Estonian @en

Muilla itämerensuomalaisilla kielillä julkaistut näytelmät
type: Concept
type: YKL-luokka
broader: Suomenkieliset näytelmät
in scheme: YKL - Yleisten kirjastojen luokitusjärjestelmä
narrower: Karjalankieliset näytelmät
notation: 83.24
preferred label: Dramatik på övriga östersjöfinska språk @sv
preferred label: Plays in other Balto-Finnic languages @en

Karjalankieliset näytelmät
type: Concept
type: YKL-luokka
alternative label: Karelska, dramatik (83.241) @sv
alternative label: Karjalan kieli, näytelmät (83.241)
broader: Muilla itämerensuomalaisilla kielillä julkaistut näytelmät
in scheme: YKL - Yleisten kirjastojen luokitusjärjestelmä
notation: 83.241
preferred label: Dramatik på karelska @sv
preferred label: Plays in Karelian language @en

Muilla suomalais-ugrilaisilla ja uralilaisilla kielillä julkaistut näytelmät
type: Concept
type: YKL-luokka
broader: Suomenkieliset näytelmät
in scheme: YKL - Yleisten kirjastojen luokitusjärjestelmä
narrower: Unkarinkieliset näytelmät
narrower: Saamenkieliset näytelmät
notation: 83.25
preferred label: Dramatik på övriga finsk-ugriska och uraliska språk @sv
preferred label: Plays in other Finno-Ugric and Uralic languages @en

Unkarinkieliset näytelmät
type: Concept
type: YKL-luokka
alternative label: Ungersk skönlitteratur, dramatik (83.251) @sv
alternative label: Ungerska, dramatik (83.251) @sv
alternative label: Unkarin kieli, näytelmät (83.251)
alternative label: Unkarinkielinen kaunokirjallisuus, näytelmät (83.251)
broader: Muilla suomalais-ugrilaisilla ja uralilaisilla kielillä julkaistut näytelmät
in scheme: YKL - Yleisten kirjastojen luokitusjärjestelmä
notation: 83.251
preferred label: Dramatik på ungerska @sv
preferred label: Plays in Hungarian @en

Saamenkieliset näytelmät
type: Concept
type: YKL-luokka
alternative label: Saamen kieli, näytelmät (83.252)
alternative label: Saamenkielinen kaunokirjallisuus, näytelmät (83.252)
alternative label: Samisk skönlitteratur, dramatik (83.252) @sv
alternative label: Samiska, dramatik (83.252) @sv
broader: Muilla suomalais-ugrilaisilla ja uralilaisilla kielillä julkaistut näytelmät
in scheme: YKL - Yleisten kirjastojen luokitusjärjestelmä
notation: 83.252
preferred label: Dramatik på samiska @sv
preferred label: Plays in Sami @en

Pohjoismaisilla kielillä julkaistut näytelmät
type: Concept
type: YKL-luokka
broader: NÄYTELMÄT
in scheme: YKL - Yleisten kirjastojen luokitusjärjestelmä
narrower: Ruotsinkieliset näytelmät
narrower: Norjankieliset näytelmät
narrower: Tanskankieliset näytelmät
narrower: Islanninkieliset näytelmät
narrower: Fäärinkieliset näytelmät
notation: 83.3
preferred label: Dramatik på nordiska språk @sv
preferred label: Plays in Nordic languages @en

Ruotsinkieliset näytelmät
type: Concept
type: YKL-luokka
alternative label: Ruotsin kieli, näytelmät (83.31)
alternative label: Ruotsinkielinen kaunokirjallisuus, näytelmät (83.31)
alternative label: Svensk skönlitteratur, dramatik (83.31) @sv
alternative label: Svenska, dramatik (83.31) @sv
broader: Pohjoismaisilla kielillä julkaistut näytelmät
in scheme: YKL - Yleisten kirjastojen luokitusjärjestelmä
notation: 83.31
preferred label: Dramatik på svenska @sv
preferred label: Plays in Swedish @en

Norjankieliset näytelmät
type: Concept
type: YKL-luokka
alternative label: Norjan kieli, näytelmät (83.32)
alternative label: Norjankielinen kaunokirjallisuus, näytelmät (83.32)
alternative label: Norsk skönlitteratur, dramatik (83.32) @sv
alternative label: Norska, dramatik (83.32) @sv
broader: Pohjoismaisilla kielillä julkaistut näytelmät
in scheme: YKL - Yleisten kirjastojen luokitusjärjestelmä
notation: 83.32
preferred label: Dramatik på norska @sv
preferred label: Plays in Norwegian @en

Tanskankieliset näytelmät
type: Concept
type: YKL-luokka
alternative label: Dansk skönlitteratur, dramatik (83.33) @sv
alternative label: Danska, dramatik (83.33) @sv
alternative label: Tanskan kieli, näytelmät (83.33)
alternative label: Tanskankielinen kaunokirjallisuus, näytelmät (83.33)
broader: Pohjoismaisilla kielillä julkaistut näytelmät
in scheme: YKL - Yleisten kirjastojen luokitusjärjestelmä
notation: 83.33
preferred label: Dramatik på danska @sv
preferred label: Plays in Danish @en

Islanninkieliset näytelmät
type: Concept
type: YKL-luokka
alternative label: Islannin kieli, näytelmät (83.34)
alternative label: Islanninkielinen kaunokirjallisuus, näytelmät (83.34)
alternative label: Isländsk skönlitteratur, dramatik (83.34) @sv
alternative label: Isländska, dramatik (83.34) @sv
broader: Pohjoismaisilla kielillä julkaistut näytelmät
in scheme: YKL - Yleisten kirjastojen luokitusjärjestelmä
notation: 83.34
preferred label: Dramatik på isländska @sv
preferred label: Plays in Icelandic @en

Fäärinkieliset näytelmät
type: Concept
type: YKL-luokka
alternative label: Färöisk skönlitteratur, dramatik (83.35) @sv
alternative label: Färöiska, dramatik (83.35) @sv
alternative label: Fäärin kieli, näytelmät (83.35)
alternative label: Fäärinkielinen kaunokirjallisuus, näytelmät (83.35)
broader: Pohjoismaisilla kielillä julkaistut näytelmät
in scheme: YKL - Yleisten kirjastojen luokitusjärjestelmä
notation: 83.35
preferred label: Dramatik på färöiska @sv
preferred label: Plays in Faeroese @en

Saksankieliset näytelmät
type: Concept
type: YKL-luokka
alternative label: Saksan kieli, näytelmät (83.4)
alternative label: Saksankielinen kaunokirjallisuus, näytelmät (83.4)
alternative label: Tysk skönlitteratur, dramatik (83.4) @sv
alternative label: Tyska, dramatik (83.4) @sv
broader: NÄYTELMÄT
in scheme: YKL - Yleisten kirjastojen luokitusjärjestelmä
narrower: Jiddišinkieliset näytelmät
narrower: Friisinkieliset näytelmät
narrower: Hollanninkieliset näytelmät
notation: 83.4
preferred label: Dramatik på tyska @sv
preferred label: Plays in German @en
scope note: Hit och till underklassen också dramatik på andra germanska språk @sv
scope note: Tähän ja alaluokkaan myös muilla germaanisilla kielillä julkaistut näytelmät

Jiddišinkieliset näytelmät
type: Concept
type: YKL-luokka
alternative label: Jiddisch, dramatik (83.41) @sv
alternative label: Jiddišin kieli, näytelmät (83.41)
broader: Saksankieliset näytelmät
in scheme: YKL - Yleisten kirjastojen luokitusjärjestelmä
notation: 83.41
preferred label: Dramatik på jiddisch @sv
preferred label: Plays in Yiddish language @en

Friisinkieliset näytelmät
type: Concept
type: YKL-luokka
broader: Saksankieliset näytelmät
in scheme: YKL - Yleisten kirjastojen luokitusjärjestelmä
notation: 83.43
preferred label: Dramatik på frisiska @sv
preferred label: Plays in Frisian @en

Hollanninkieliset näytelmät
type: Concept
type: YKL-luokka
alternative label: Hollannin kieli, näytelmät (83.48)
alternative label: Hollanninkielinen kaunokirjallisuus, näytelmät (83.48)
alternative label: Nederländsk skönlitteratur, dramatik (83.48) @sv
alternative label: Nederländska, dramatik (83.48) @sv
broader: Saksankieliset näytelmät
in scheme: YKL - Yleisten kirjastojen luokitusjärjestelmä
narrower: Afrikaansinkieliset näytelmät
notation: 83.48
preferred label: Dramatik på holländska @sv
preferred label: Plays in Dutch @en
scope note: Hit också dramatik på flamländska @sv
scope note: Tähän myös flaaminkieliset näytelmät

Afrikaansinkieliset näytelmät
type: Concept
type: YKL-luokka
alternative label: Afrikaans, dramatik (83.481) @sv
alternative label: Afrikaansin kieli, näytelmät (83.481)
broader: Hollanninkieliset näytelmät
in scheme: YKL - Yleisten kirjastojen luokitusjärjestelmä
notation: 83.481
preferred label: Dramatik på afrikaans @sv
preferred label: Plays in Afrikaans language @en
scope note: Hit också dramatik på flamländska @sv
scope note: Tähän myös flaaminkieliset näytelmät

Englanninkieliset näytelmät
type: Concept
type: YKL-luokka
alternative label: Engelsk skönlitteratur, dramatik (83.5) @sv
alternative label: Engelska, dramatik (83.5) @sv
alternative label: Englannin kieli, näytelmät (83.5)
alternative label: Englanninkielinen kaunokirjallisuus, näytelmät (83.5)
broader: NÄYTELMÄT
in scheme: YKL - Yleisten kirjastojen luokitusjärjestelmä
notation: 83.5
preferred label: Dramatik på engelska @sv
preferred label: Plays in English @en

Romaanisilla kielillä julkaistut näytelmät
type: Concept
type: YKL-luokka
broader: NÄYTELMÄT
in scheme: YKL - Yleisten kirjastojen luokitusjärjestelmä
narrower: Ranskankieliset näytelmät
narrower: Italiankieliset näytelmät
narrower: Espanjankieliset näytelmät
narrower: Portugalinkieliset näytelmät
narrower: Romaniankieliset näytelmät
narrower: Muilla romaanisilla kielillä julkaistut näytelmät
notation: 83.6
preferred label: Dramatik på romanska språk @sv
preferred label: Plays in Romanic languages @en

Ranskankieliset näytelmät
type: Concept
type: YKL-luokka
alternative label: Fransk skönlitteratur, dramatik (83.61) @sv
alternative label: Franska, dramatik (83.61) @sv
alternative label: Ranskan kieli, näytelmät (83.61)
alternative label: Ranskankielinen kaunokirjallisuus, näytelmät (83.61)
broader: Romaanisilla kielillä julkaistut näytelmät
in scheme: YKL - Yleisten kirjastojen luokitusjärjestelmä
notation: 83.61
preferred label: Dramatik på franska @sv
preferred label: Plays in French @en

Italiankieliset näytelmät
type: Concept
type: YKL-luokka
alternative label: Italian kieli, näytelmät (83.62)
alternative label: Italiankielinen kaunokirjallisuus, näytelmät (83.62)
alternative label: Italiensk skönlitteratur, dramatik (83.62) @sv
alternative label: Italienska, dramatik (83.62) @sv
broader: Romaanisilla kielillä julkaistut näytelmät
in scheme: YKL - Yleisten kirjastojen luokitusjärjestelmä
notation: 83.62
preferred label: Dramatik på italienska @sv
preferred label: Plays in Italian @en

Espanjankieliset näytelmät
type: Concept
type: YKL-luokka
alternative label: Espanjan kieli, näytelmät (83.63)
alternative label: Espanjankielinen kaunokirjallisuus, näytelmät (83.63)
alternative label: Spansk skönlitteratur, dramatik (83.63) @sv
alternative label: Spanska, dramatik (83.63) @sv
broader: Romaanisilla kielillä julkaistut näytelmät
in scheme: YKL - Yleisten kirjastojen luokitusjärjestelmä
notation: 83.63
preferred label: Dramatik på spanska @sv
preferred label: Plays in Spanish @en

Portugalinkieliset näytelmät
type: Concept
type: YKL-luokka
alternative label: Portugalin kieli, näytelmät (83.64)
alternative label: Portugalinkielinen kaunokirjallisuus, näytelmät (83.64)
alternative label: Portugisisk skönlitteratur, dramatik (83.64) @sv
alternative label: Portugisiska, dramatik (83.64) @sv
broader: Romaanisilla kielillä julkaistut näytelmät
in scheme: YKL - Yleisten kirjastojen luokitusjärjestelmä
notation: 83.64
preferred label: Dramatik på portugisiska @sv
preferred label: Plays in Portuguese @en

Romaniankieliset näytelmät
type: Concept
type: YKL-luokka
alternative label: Romanian kieli, näytelmät (83.65)
alternative label: Romaniankielinen kaunokirjallisuus, näytelmät (83.65)
alternative label: Rumänsk skönlitteratur, dramatik (83.65) @sv
alternative label: Rumänska, dramatik (83.65) @sv
broader: Romaanisilla kielillä julkaistut näytelmät
in scheme: YKL - Yleisten kirjastojen luokitusjärjestelmä
notation: 83.65
preferred label: Dramatik på rumänska @sv
preferred label: Plays in Romanian @en

Muilla romaanisilla kielillä julkaistut näytelmät
type: Concept
type: YKL-luokka
broader: Romaanisilla kielillä julkaistut näytelmät
in scheme: YKL - Yleisten kirjastojen luokitusjärjestelmä
narrower: Katalaaninkieliset näytelmät
notation: 83.67
preferred label: Dramatik på övriga romanska språk @sv
preferred label: Plays in other Romanic languages @en

Katalaaninkieliset näytelmät
type: Concept
type: YKL-luokka
alternative label: Katalaanin kieli, näytelmät (83.671)
alternative label: Katalanska, dramatik (83.671) @sv
broader: Muilla romaanisilla kielillä julkaistut näytelmät
in scheme: YKL - Yleisten kirjastojen luokitusjärjestelmä
notation: 83.671
preferred label: Dramatik på katalanska @sv
preferred label: Plays in Catalan language @en

Slaavilaisilla ja balttilaisilla kielillä julkaistut näytelmät
type: Concept
type: YKL-luokka
broader: NÄYTELMÄT
in scheme: YKL - Yleisten kirjastojen luokitusjärjestelmä
narrower: Venäjänkieliset näytelmät
narrower: Ukrainankieliset näytelmät. Valkovenäjänkieliset näytelmät
narrower: Puolankieliset näytelmät
narrower: Tšekinkieliset näytelmät
narrower: Slovakinkieliset näytelmät
narrower: Eteläslaavilaisilla kielillä julkaistut näytelmät
narrower: Balttilaisilla kielillä julkaistut näytelmät
notation: 83.7
preferred label: Dramatik på slaviska och baltiska språk @sv
preferred label: Plays in Slavonic and Baltic languages @en

Venäjänkieliset näytelmät
type: Concept
type: YKL-luokka
alternative label: Rysk skönlitteratur, dramatik (83.71) @sv
alternative label: Ryska, dramatik (83.71) @sv
alternative label: Venäjän kieli, näytelmät (83.71)
alternative label: Venäjänkielinen kaunokirjallisuus, näytelmät (83.71)
broader: Slaavilaisilla ja balttilaisilla kielillä julkaistut näytelmät
in scheme: YKL - Yleisten kirjastojen luokitusjärjestelmä
notation: 83.71
preferred label: Dramatik på ryska @sv
preferred label: Plays in Russian @en

Ukrainankieliset näytelmät. Valkovenäjänkieliset näytelmät
type: Concept
type: YKL-luokka
broader: Slaavilaisilla ja balttilaisilla kielillä julkaistut näytelmät
in scheme: YKL - Yleisten kirjastojen luokitusjärjestelmä
narrower: Ukrainankieliset näytelmät
narrower: Valkovenäjänkieliset näytelmät
notation: 83.72
preferred label: Dramatik på ukrainska. Dramatik på vitryska @sv
preferred label: Plays in Ukrainian. Plays in Byelorussian @en

Ukrainankieliset näytelmät
type: Concept
type: YKL-luokka
alternative label: Ukrainan kieli, näytelmät (83.721)
alternative label: Ukrainska, dramatik (83.721) @sv
broader: Ukrainankieliset näytelmät. Valkovenäjänkieliset näytelmät
in scheme: YKL - Yleisten kirjastojen luokitusjärjestelmä
notation: 83.721
preferred label: Dramatik på ukrainska @sv
preferred label: Plays in Ukrainian @en

Valkovenäjänkieliset näytelmät
type: Concept
type: YKL-luokka
alternative label: Valkovenäjän kieli, näytelmät (83.722)
alternative label: Vitryska, dramatik (83.722) @sv
broader: Ukrainankieliset näytelmät. Valkovenäjänkieliset näytelmät
in scheme: YKL - Yleisten kirjastojen luokitusjärjestelmä
notation: 83.722
preferred label: Dramatik på vitryska @sv
preferred label: Plays in Belarusian language @en

Puolankieliset näytelmät
type: Concept
type: YKL-luokka
alternative label: Polsk skönlitteratur, dramatik (83.73) @sv
alternative label: Polska, dramatik (83.73) @sv
alternative label: Puolan kieli, näytelmät (83.73)
alternative label: Puolankielinen kaunokirjallisuus, näytelmät (83.73)
broader: Slaavilaisilla ja balttilaisilla kielillä julkaistut näytelmät
in scheme: YKL - Yleisten kirjastojen luokitusjärjestelmä
notation: 83.73
preferred label: Dramatik på polska @sv
preferred label: Plays in Polish @en

Tšekinkieliset näytelmät
type: Concept
type: YKL-luokka
alternative label: Tjeckisk skönlitteratur, dramatik (83.74) @sv
alternative label: Tjeckiska, dramatik (83.74) @sv
alternative label: Tšekin kieli, näytelmät (83.74)
alternative label: Tšekinkielinen kaunokirjallisuus, näytelmät (83.74)
broader: Slaavilaisilla ja balttilaisilla kielillä julkaistut näytelmät
in scheme: YKL - Yleisten kirjastojen luokitusjärjestelmä
notation: 83.74
preferred label: Dramatik på tjeckiska @sv
preferred label: Plays in Czech @en

Slovakinkieliset näytelmät
type: Concept
type: YKL-luokka
alternative label: Slovakin kieli, näytelmät (83.75)
alternative label: Slovakinkielinen kaunokirjallisuus, näytelmät (83.75)
alternative label: Slovakisk skönlitteratur, dramatik (83.75) @sv
alternative label: Slovakiska, dramatik (83.75) @sv
broader: Slaavilaisilla ja balttilaisilla kielillä julkaistut näytelmät
in scheme: YKL - Yleisten kirjastojen luokitusjärjestelmä
notation: 83.75
preferred label: Dramatik på slovakiska @sv
preferred label: Plays in Slovak @en

Eteläslaavilaisilla kielillä julkaistut näytelmät
type: Concept
type: YKL-luokka
broader: Slaavilaisilla ja balttilaisilla kielillä julkaistut näytelmät
in scheme: YKL - Yleisten kirjastojen luokitusjärjestelmä
narrower: Bulgariankieliset näytelmät
narrower: Makedoniankieliset näytelmät
narrower: Sloveeninkieliset näytelmät
narrower: Serbiankieliset näytelmät
narrower: Kroatiankieliset näytelmät
narrower: Bosniankieliset näytelmät
notation: 83.76
preferred label: Dramatik på sydslaviska språk @sv
preferred label: Plays in South-Slavonic languages @en

Bulgariankieliset näytelmät
type: Concept
type: YKL-luokka
alternative label: Bulgarian kieli, näytelmät (83.761)
alternative label: Bulgariankielinen kaunokirjallisuus, näytelmät (83.761)
alternative label: Bulgarisk skönlitteratur, dramatik (83.761) @sv
alternative label: Bulgariska, dramatik (83.761) @sv
broader: Eteläslaavilaisilla kielillä julkaistut näytelmät
in scheme: YKL - Yleisten kirjastojen luokitusjärjestelmä
notation: 83.761
preferred label: Dramatik på bulgariska @sv
preferred label: Plays in Bulgarian @en

Makedoniankieliset näytelmät
type: Concept
type: YKL-luokka
alternative label: Makedonian kieli, näytelmät (83.762)
alternative label: Makedoniankielinen kaunokirjallisuus, näytelmät (83.762)
alternative label: Makedonsk skönlitteratur, dramatik (83.762) @sv
alternative label: Makedonska, dramatik (83.762) @sv
broader: Eteläslaavilaisilla kielillä julkaistut näytelmät
in scheme: YKL - Yleisten kirjastojen luokitusjärjestelmä
notation: 83.762
preferred label: Dramatik på makedonska @sv
preferred label: Plays in Macedonian @en

Sloveeninkieliset näytelmät
type: Concept
type: YKL-luokka
alternative label: Sloveenin kieli, näytelmät (83.763)
alternative label: Sloveeninkielinen kaunokirjallisuus, näytelmät (83.763)
alternative label: Slovensk skönlitteratur, dramatik (83.763) @sv
alternative label: Slovenska, dramatik (83.763) @sv
broader: Eteläslaavilaisilla kielillä julkaistut näytelmät
in scheme: YKL - Yleisten kirjastojen luokitusjärjestelmä
notation: 83.763
preferred label: Dramatik på slovenska @sv
preferred label: Plays in Slovenian @en

Serbiankieliset näytelmät
type: Concept
type: YKL-luokka
alternative label: Serbian kieli, näytelmät (83.764)
alternative label: Serbiankielinen kaunokirjallisuus, näytelmät (83.764)
alternative label: Serbisk skönlitteratur, dramatik (83.764) @sv
alternative label: Serbiska, dramatik (83.764) @sv
broader: Eteläslaavilaisilla kielillä julkaistut näytelmät
in scheme: YKL - Yleisten kirjastojen luokitusjärjestelmä
notation: 83.764
preferred label: Dramatik på serbiska @sv
preferred label: Plays in Serbian @en

Kroatiankieliset näytelmät
type: Concept
type: YKL-luokka
alternative label: Kroaatin kieli, näytelmät (83.765)
alternative label: Kroaatinkielinen kaunokirjallisuus, näytelmät (83.765)
alternative label: Kroatian kieli, näytelmät (83.765)
alternative label: Kroatiankielinen kaunokirjallisuus, näytelmät (83.765)
alternative label: Kroatisk skönlitteratur, dramatik (83.765) @sv
alternative label: Kroatiska, dramatik (83.765) @sv
broader: Eteläslaavilaisilla kielillä julkaistut näytelmät
in scheme: YKL - Yleisten kirjastojen luokitusjärjestelmä
notation: 83.765
preferred label: Dramatik på kroatiska @sv
preferred label: Plays in Croatian @en

Bosniankieliset näytelmät
type: Concept
type: YKL-luokka
alternative label: Bosnian kieli, näytelmät (83.766)
alternative label: Bosniankielinen kaunokirjallisuus, näytelmät (83.766)
alternative label: Bosnisk skönlitteratur, dramatik (83.766) @sv
alternative label: Bosniska, dramatik (83.766) @sv
broader: Eteläslaavilaisilla kielillä julkaistut näytelmät
in scheme: YKL - Yleisten kirjastojen luokitusjärjestelmä
notation: 83.766
preferred label: Dramatik på bosniska @sv
preferred label: Plays in Bosnian @en

Balttilaisilla kielillä julkaistut näytelmät
type: Concept
type: YKL-luokka
broader: Slaavilaisilla ja balttilaisilla kielillä julkaistut näytelmät
in scheme: YKL - Yleisten kirjastojen luokitusjärjestelmä
narrower: Latviankieliset näytelmät
narrower: Liettuankieliset näytelmät
notation: 83.78
preferred label: Dramatik på baltiska språk @sv
preferred label: Plays in Baltic languages @en

Latviankieliset näytelmät
type: Concept
type: YKL-luokka
alternative label: Latvian kieli, näytelmät (83.781)
alternative label: Latviankielinen kaunokirjallisuus, näytelmät (83.781)
alternative label: Lettisk skönlitteratur, dramatik (83.781) @sv
alternative label: Lettiska, dramatik (83.781) @sv
broader: Balttilaisilla kielillä julkaistut näytelmät
in scheme: YKL - Yleisten kirjastojen luokitusjärjestelmä
notation: 83.781
preferred label: Dramatik på lettiska @sv
preferred label: Plays in Latvian @en

Liettuankieliset näytelmät
type: Concept
type: YKL-luokka
alternative label: Liettuan kieli, näytelmät (83.782)
alternative label: Liettuankielinen kaunokirjallisuus, näytelmät (83.782)
alternative label: Litauisk skönlitteratur, dramatik (83.782) @sv
alternative label: Litauiska, dramatik (83.782) @sv
broader: Balttilaisilla kielillä julkaistut näytelmät
in scheme: YKL - Yleisten kirjastojen luokitusjärjestelmä
notation: 83.782
preferred label: Dramatik på litauiska @sv
preferred label: Plays in Lithuanian @en

Muilla indoeurooppalaisilla kielillä julkaistut näytelmät
type: Concept
type: YKL-luokka
broader: NÄYTELMÄT
in scheme: YKL - Yleisten kirjastojen luokitusjärjestelmä
narrower: Kreikankieliset näytelmät
narrower: Latinankieliset näytelmät
narrower: Indoiraanisilla kielillä julkaistut näytelmät
narrower: Albaniankieliset näytelmät
narrower: Armeniankieliset näytelmät
narrower: Kelttiläisillä kielillä julkaistut näytelmät
notation: 83.8
preferred label: Dramatik på övriga indoeuropeiska språk @sv
preferred label: Plays in other Indo-European languages @en

Kreikankieliset näytelmät
type: Concept
type: YKL-luokka
alternative label: Grekisk skönlitteratur, forngrekiska, dramatik (83.81) @sv
alternative label: Grekiska, forngrekiska, dramatik (83.81) @sv
alternative label: Kreikan kieli, muinaiskreikka, näytelmät (83.81)
alternative label: Kreikankielinen kaunokirjallisuus, muinaiskreikka, näytelmät (83.81)
broader: Muilla indoeurooppalaisilla kielillä julkaistut näytelmät
in scheme: YKL - Yleisten kirjastojen luokitusjärjestelmä
narrower: Nykykreikankieliset näytelmät
notation: 83.81
preferred label: Dramatik på grekiska @sv
preferred label: Plays in Greek @en

Nykykreikankieliset näytelmät
type: Concept
type: YKL-luokka
alternative label: Grekisk skönlitteratur, nygrekiska, dramatik (83.812) @sv
alternative label: Grekiska, nygrekiska, dramatik (83.812) @sv
alternative label: Kreikan kieli, nykykreikka, näytelmät (83.812)
alternative label: Kreikankielinen kaunokirjallisuus, nykykreikka, näytelmät (83.812)
broader: Kreikankieliset näytelmät
in scheme: YKL - Yleisten kirjastojen luokitusjärjestelmä
notation: 83.812
preferred label: Dramatik på nygrekiska @sv
preferred label: Plays in Modern Greek @en

Latinankieliset näytelmät
type: Concept
type: YKL-luokka
alternative label: Latin, dramatik (83.82) @sv
alternative label: Latinan kieli, näytelmät (83.82)
alternative label: Latinankielinen kaunokirjallisuus, näytelmät (83.82)
alternative label: Latinsk skönlitteratur, dramatik (83.82) @sv
broader: Muilla indoeurooppalaisilla kielillä julkaistut näytelmät
in scheme: YKL - Yleisten kirjastojen luokitusjärjestelmä
notation: 83.82
preferred label: Dramatik på latin @sv
preferred label: Plays in Latin @en

Indoiraanisilla kielillä julkaistut näytelmät
type: Concept
type: YKL-luokka
broader: Muilla indoeurooppalaisilla kielillä julkaistut näytelmät
in scheme: YKL - Yleisten kirjastojen luokitusjärjestelmä
narrower: Persiankieliset näytelmät
narrower: Kurdinkieliset näytelmät
narrower: Paštunkieliset näytelmät
narrower: Indoarjalaisilla kielillä julkaistut näytelmät
notation: 83.83
preferred label: Dramatik på indoiranska språk @sv
preferred label: Plays in Indo-Iranian languages @en
scope note: Dramatik på indiska och iranska språk @sv
scope note: Intialaisilla ja iranilaisilla kielillä julkaistut näytelmät

Persiankieliset näytelmät
type: Concept
type: YKL-luokka
alternative label: Persian kieli, näytelmät (83.831)
alternative label: Persiankielinen kaunokirjallisuus, näytelmät (83.831)
alternative label: Persisk skönlitteratur, dramatik (83.831) @sv
alternative label: Persiska, dramatik (83.831) @sv
broader: Indoiraanisilla kielillä julkaistut näytelmät
in scheme: YKL - Yleisten kirjastojen luokitusjärjestelmä
narrower: Darinkieliset näytelmät
notation: 83.831
preferred label: Dramatik på persiska @sv
preferred label: Plays in Persian @en

Darinkieliset näytelmät
type: Concept
type: YKL-luokka
alternative label: Dari, dramatik (83.8311) @sv
alternative label: Darin kieli, näytelmät (83.8311)
alternative label: Darinkielinen kaunokirjallisuus, näytelmät (83.8311)
alternative label: Skönlitteratur på dari, dramatik (83.8311) @sv
broader: Persiankieliset näytelmät
in scheme: YKL - Yleisten kirjastojen luokitusjärjestelmä
notation: 83.8311
preferred label: Dramatik på dari @sv
preferred label: Plays in Dari language @en

Kurdinkieliset näytelmät
type: Concept
type: YKL-luokka
alternative label: Kurdin kieli, näytelmät (83.832)
alternative label: Kurdinkielinen kaunokirjallisuus, näytelmät (83.832)
alternative label: Kurdisk skönlitteratur, dramatik (83.832) @sv
alternative label: Kurdiska, dramatik (83.832) @sv
broader: Indoiraanisilla kielillä julkaistut näytelmät
in scheme: YKL - Yleisten kirjastojen luokitusjärjestelmä
narrower: Kurmandžinkieliset näytelmät
narrower: Soraninkieliset näytelmät
notation: 83.832
preferred label: Dramatik på kurdiska @sv
preferred label: Plays in Kurdish @en

Kurmandžinkieliset näytelmät
type: Concept
type: YKL-luokka
alternative label: Kurmandžin kieli, näytelmät (83.8321)
alternative label: Kurmanji, dramatik (83.8321) @sv
broader: Kurdinkieliset näytelmät
in scheme: YKL - Yleisten kirjastojen luokitusjärjestelmä
notation: 83.8321
preferred label: Dramatik på kurmanji @sv
preferred label: Plays in Kurmanji language @en

Soraninkieliset näytelmät
type: Concept
type: YKL-luokka
alternative label: Sorani, dramatik (83.8322) @sv
alternative label: Soranin kieli, näytelmät (83.8322)
broader: Kurdinkieliset näytelmät
in scheme: YKL - Yleisten kirjastojen luokitusjärjestelmä
notation: 83.8322
preferred label: Dramatik på sorani @sv
preferred label: Plays in Sorani language @en

Paštunkieliset näytelmät
type: Concept
type: YKL-luokka
alternative label: Pashto, dramatik (83.833) @sv
alternative label: Paštun kieli, näytelmät (83.833)
broader: Indoiraanisilla kielillä julkaistut näytelmät
in scheme: YKL - Yleisten kirjastojen luokitusjärjestelmä
notation: 83.833
preferred label: Dramatik på pashto @sv
preferred label: Plays in Pushto language @en

Indoarjalaisilla kielillä julkaistut näytelmät
type: Concept
type: YKL-luokka
broader: Indoiraanisilla kielillä julkaistut näytelmät
in scheme: YKL - Yleisten kirjastojen luokitusjärjestelmä
narrower: Bengalinkieliset näytelmät
narrower: Gudžaratinkieliset näytelmät
narrower: Hindinkieliset näytelmät
narrower: Pandzabinkieliset näytelmät
narrower: Romanikieliset näytelmät
narrower: Urdunkieliset näytelmät
narrower: Nepalinkieliset näytelmät
narrower: Sinhalankieliset näytelmät
notation: 83.836
preferred label: Dramatik på indoariska spåk @sv
preferred label: Plays in Indo-Aryan languages @en

Bengalinkieliset näytelmät
type: Concept
type: YKL-luokka
alternative label: Bengali, dramatik (83.8361) @sv
alternative label: Bengalin kieli, näytelmät (83.8361)
broader: Indoarjalaisilla kielillä julkaistut näytelmät
in scheme: YKL - Yleisten kirjastojen luokitusjärjestelmä
notation: 83.8361
preferred label: Dramatik på bengali @sv
preferred label: Plays in Bengali language @en

Gudžaratinkieliset näytelmät
type: Concept
type: YKL-luokka
alternative label: Gudžaratin kieli, näytelmät (83.8362)
alternative label: Gujarati, dramatik (83.8362) @sv
broader: Indoarjalaisilla kielillä julkaistut näytelmät
in scheme: YKL - Yleisten kirjastojen luokitusjärjestelmä
notation: 83.8362
preferred label: Dramatik på gujarati @sv
preferred label: Plays in Gujarati language @en

Hindinkieliset näytelmät
type: Concept
type: YKL-luokka
alternative label: Hindi, dramatik (83.8363) @sv
alternative label: Hindin kieli, näytelmät (83.8363)
broader: Indoarjalaisilla kielillä julkaistut näytelmät
in scheme: YKL - Yleisten kirjastojen luokitusjärjestelmä
notation: 83.8363
preferred label: Dramatik på hindi @sv
preferred label: Plays in Hindi language @en

Pandzabinkieliset näytelmät
type: Concept
type: YKL-luokka
alternative label: Pandzabin kieli, näytelmät (83.8364)
alternative label: Panjabi, dramatik (83.8364) @sv
broader: Indoarjalaisilla kielillä julkaistut näytelmät
in scheme: YKL - Yleisten kirjastojen luokitusjärjestelmä
notation: 83.8364
preferred label: Dramatik på panjabi @sv
preferred label: Plays in Punjabi language @en

Romanikieliset näytelmät
type: Concept
type: YKL-luokka
alternative label: Romani, dramatik (83.8365) @sv
alternative label: Romanikieli, näytelmät (83.8365)
broader: Indoarjalaisilla kielillä julkaistut näytelmät
in scheme: YKL - Yleisten kirjastojen luokitusjärjestelmä
notation: 83.8365
preferred label: Dramatik på romani @sv
preferred label: Plays in Romani language @en

Urdunkieliset näytelmät
type: Concept
type: YKL-luokka
alternative label: Urdu, dramatik (83.8366) @sv
alternative label: Urdun kieli, näytelmät (83.8366)
broader: Indoarjalaisilla kielillä julkaistut näytelmät
in scheme: YKL - Yleisten kirjastojen luokitusjärjestelmä
notation: 83.8366
preferred label: Dramatik på urdu @sv
preferred label: Plays in Urdu language @en

Nepalinkieliset näytelmät
type: Concept
type: YKL-luokka
alternative label: Nepali, dramatik (83.8367) @sv
alternative label: Nepalin kieli, näytelmät (83.8367)
broader: Indoarjalaisilla kielillä julkaistut näytelmät
in scheme: YKL - Yleisten kirjastojen luokitusjärjestelmä
notation: 83.8367
preferred label: Dramatik på nepali @sv
preferred label: Plays in Nepali language @en

Sinhalankieliset näytelmät
type: Concept
type: YKL-luokka
alternative label: Singalesiska, dramatik (83.8368) @sv
alternative label: Sinhalan kieli, näytelmät (83.8368)
broader: Indoarjalaisilla kielillä julkaistut näytelmät
in scheme: YKL - Yleisten kirjastojen luokitusjärjestelmä
notation: 83.8368
preferred label: Dramatik på singalesiska @sv
preferred label: Plays in Sinhalese language @en

Albaniankieliset näytelmät
type: Concept
type: YKL-luokka
alternative label: Albanian kieli, näytelmät (83.84)
alternative label: Albaniankielinen kaunokirjallisuus, näytelmät (83.84)
alternative label: Albansk skönlitteratur, dramatik (83.84) @sv
alternative label: Albanska, dramatik (83.84) @sv
broader: Muilla indoeurooppalaisilla kielillä julkaistut näytelmät
in scheme: YKL - Yleisten kirjastojen luokitusjärjestelmä
notation: 83.84
preferred label: Dramatik på albanska @sv
preferred label: Plays in Albanian @en

Armeniankieliset näytelmät
type: Concept
type: YKL-luokka
alternative label: Armenian kieli, näytelmät (83.85)
alternative label: Armeniska, dramatik (83.85) @sv
broader: Muilla indoeurooppalaisilla kielillä julkaistut näytelmät
in scheme: YKL - Yleisten kirjastojen luokitusjärjestelmä
notation: 83.85
preferred label: Dramatik på armeniska @sv
preferred label: Plays in Armenian language @en

Kelttiläisillä kielillä julkaistut näytelmät
type: Concept
type: YKL-luokka
broader: Muilla indoeurooppalaisilla kielillä julkaistut näytelmät
in scheme: YKL - Yleisten kirjastojen luokitusjärjestelmä
notation: 83.88
preferred label: Dramatik på keltiska språk @sv
preferred label: Plays in Celtic languages @en

Muilla kielillä julkaistut näytelmät
type: Concept
type: YKL-luokka
broader: NÄYTELMÄT
in scheme: YKL - Yleisten kirjastojen luokitusjärjestelmä
narrower: Turkkilaisilla kielillä julkaistut näytelmät
narrower: Afroaasialaisilla kielillä julkaistut näytelmät
narrower: Sinotiibetiläisillä ja austroaasialaisilla kielillä julkaistut näytelmät
narrower: Japanin- ja koreankieliset näytelmät
narrower: Afrikkalaisilla kielillä julkaistut näytelmät
narrower: Kaukasialaisilla kielillä julkaistut näytelmät
narrower: Eskimo- ja intiaanikielillä julkaistut näytelmät
narrower: Muilla ei-indoeurooppalaisilla kielillä julkaistut näytelmät
notation: 83.9
preferred label: Dramatik på övriga språk @sv
preferred label: Plays in other languages @en

Turkkilaisilla kielillä julkaistut näytelmät
type: Concept
type: YKL-luokka
broader: Muilla kielillä julkaistut näytelmät
in scheme: YKL - Yleisten kirjastojen luokitusjärjestelmä
narrower: Turkinkieliset näytelmät
narrower: Azerinkieliset näytelmät
narrower: Turkmeeninkieliset näytelmät
narrower: Uiguurinkieliset näytelmät
narrower: Uzbekinkieliset näytelmät
notation: 83.91
preferred label: Dramatik på turkiska spåk @sv
preferred label: Plays in Turkic languages @en

Turkinkieliset näytelmät
type: Concept
type: YKL-luokka
alternative label: Turkin kieli, näytelmät (83.911)
alternative label: Turkiska, dramatik (83.911) @sv
broader: Turkkilaisilla kielillä julkaistut näytelmät
in scheme: YKL - Yleisten kirjastojen luokitusjärjestelmä
notation: 83.911
preferred label: Dramatik på turkiska @sv
preferred label: Plays in Turkish @en

Azerinkieliset näytelmät
type: Concept
type: YKL-luokka
alternative label: Azerbajdzjanska, dramatik (83.912) @sv
alternative label: Azerin kieli, näytelmät (83.912)
broader: Turkkilaisilla kielillä julkaistut näytelmät
in scheme: YKL - Yleisten kirjastojen luokitusjärjestelmä
notation: 83.912
preferred label: Dramatik på azerbajdzjanska @sv
preferred label: Plays in Azerbaijani language @en

Turkmeeninkieliset näytelmät
type: Concept
type: YKL-luokka
alternative label: Turkmeenin kieli, näytelmät (83.913)
alternative label: Turkmeniska, dramatik (83.913) @sv
broader: Turkkilaisilla kielillä julkaistut näytelmät
in scheme: YKL - Yleisten kirjastojen luokitusjärjestelmä
notation: 83.913
preferred label: Dramatik på turkmeniska @sv
preferred label: Plays in Turkmen language @en

Uiguurinkieliset näytelmät
type: Concept
type: YKL-luokka
alternative label: Uiguriska, dramatik (83.914) @sv
alternative label: Uiguurin kieli, näytelmät (83.914)
broader: Turkkilaisilla kielillä julkaistut näytelmät
in scheme: YKL - Yleisten kirjastojen luokitusjärjestelmä
notation: 83.914
preferred label: Dramatik på uiguriska @sv
preferred label: Plays in Uighur language @en

Uzbekinkieliset näytelmät
type: Concept
type: YKL-luokka
alternative label: Uzbekin kieli, näytelmät (83.915)
alternative label: Uzbekiska, dramatik (83.915) @sv
broader: Turkkilaisilla kielillä julkaistut näytelmät
in scheme: YKL - Yleisten kirjastojen luokitusjärjestelmä
notation: 83.915
preferred label: Dramatik på uzbekiska @sv
preferred label: Plays in Uzbek language @en

Afroaasialaisilla kielillä julkaistut näytelmät
type: Concept
type: YKL-luokka
broader: Muilla kielillä julkaistut näytelmät
in scheme: YKL - Yleisten kirjastojen luokitusjärjestelmä
narrower: Hepreankieliset näytelmät
narrower: Arabiankieliset näytelmät
narrower: Amharankieliset näytelmät
narrower: Tigrinjankieliset näytelmät
narrower: Somalinkieliset näytelmät
notation: 83.92
preferred label: Dramatik på afroasiatiska språk @sv
preferred label: Plays in Afroasiatic languages @en

Hepreankieliset näytelmät
type: Concept
type: YKL-luokka
alternative label: Hebreisk skönlitteratur, dramatik (83.922) @sv
alternative label: Hebreiska, dramatik (83.922) @sv
alternative label: Heprean kieli, näytelmät (83.922)
alternative label: Hepreankielinen kaunokirjallisuus, näytelmät (83.922)
broader: Afroaasialaisilla kielillä julkaistut näytelmät
in scheme: YKL - Yleisten kirjastojen luokitusjärjestelmä
notation: 83.922
preferred label: Dramatik på hebreiska @sv
preferred label: Plays in Hebrew @en

Arabiankieliset näytelmät
type: Concept
type: YKL-luokka
alternative label: Arabian kieli, näytelmät (83.923)
alternative label: Arabiankielinen kaunokirjallisuus, näytelmät (83.923)
alternative label: Arabisk skönlitteratur, dramatik (83.923) @sv
alternative label: Arabiska, dramatik (83.923) @sv
broader: Afroaasialaisilla kielillä julkaistut näytelmät
in scheme: YKL - Yleisten kirjastojen luokitusjärjestelmä
notation: 83.923
preferred label: Dramatik på arabiska @sv
preferred label: Plays in Arabic @en

Amharankieliset näytelmät
type: Concept
type: YKL-luokka
alternative label: Amharan kieli, näytelmät (83.924)
alternative label: Amhariska, dramatik (83.924) @sv
broader: Afroaasialaisilla kielillä julkaistut näytelmät
in scheme: YKL - Yleisten kirjastojen luokitusjärjestelmä
notation: 83.924
preferred label: Dramatik på amhariska @sv
preferred label: Plays in Amharic language @en

Tigrinjankieliset näytelmät
type: Concept
type: YKL-luokka
alternative label: Tigrinja, dramatik (83.925) @sv
alternative label: Tigrinjan kieli, näytelmät (83.925)
broader: Afroaasialaisilla kielillä julkaistut näytelmät
in scheme: YKL - Yleisten kirjastojen luokitusjärjestelmä
notation: 83.925
preferred label: Dramatik på tigrinja @sv
preferred label: Plays in Tigrinya language @en

Somalinkieliset näytelmät
type: Concept
type: YKL-luokka
alternative label: Somalin kieli, näytelmät (83.926)
alternative label: Somaliska, dramatik (83.926) @sv
broader: Afroaasialaisilla kielillä julkaistut näytelmät
in scheme: YKL - Yleisten kirjastojen luokitusjärjestelmä
notation: 83.926
preferred label: Dramatik på somaliska @sv
preferred label: Plays in Somali language @en

Sinotiibetiläisillä ja austroaasialaisilla kielillä julkaistut näytelmät
type: Concept
type: YKL-luokka
broader: Muilla kielillä julkaistut näytelmät
in scheme: YKL - Yleisten kirjastojen luokitusjärjestelmä
narrower: Kiinankieliset näytelmät
narrower: Burmankieliset näytelmät
narrower: Kareninkieliset näytelmät
narrower: Thainkieliset näytelmät
narrower: Vietnaminkieliset näytelmät
narrower: Khmerinkieliset näytelmät
notation: 83.94
preferred label: Dramatik på sinotibetanska och austroasiatiska språk @sv
preferred label: Plays in Sino-Tibetan and Austroasiatic languages @en

Kiinankieliset näytelmät
type: Concept
type: YKL-luokka
alternative label: Kiinan kieli, näytelmät (83.943)
alternative label: Kiinankielinen kaunokirjallisuus, näytelmät (83.943)
alternative label: Kinesisk skönlitteratur, dramatik (83.943) @sv
alternative label: Kinesiska, dramatik (83.943) @sv
broader: Sinotiibetiläisillä ja austroaasialaisilla kielillä julkaistut näytelmät
in scheme: YKL - Yleisten kirjastojen luokitusjärjestelmä
notation: 83.943
preferred label: Dramatik på kinesiska @sv
preferred label: Plays in Chinese @en

Burmankieliset näytelmät
type: Concept
type: YKL-luokka
alternative label: Burman kieli, näytelmät (83.944)
alternative label: Burmesiska, dramatik (83.944) @sv
broader: Sinotiibetiläisillä ja austroaasialaisilla kielillä julkaistut näytelmät
in scheme: YKL - Yleisten kirjastojen luokitusjärjestelmä
notation: 83.944
preferred label: Dramatik på burmesiska @sv
preferred label: Plays in Burmese language @en

Kareninkieliset näytelmät
type: Concept
type: YKL-luokka
alternative label: Karenin kieli, näytelmät (83.945)
alternative label: Karenska, dramatik (83.945) @sv
broader: Sinotiibetiläisillä ja austroaasialaisilla kielillä julkaistut näytelmät
in scheme: YKL - Yleisten kirjastojen luokitusjärjestelmä
notation: 83.945
preferred label: Dramatik på karenska @sv
preferred label: Plays in Karen languages @en

Thainkieliset näytelmät
type: Concept
type: YKL-luokka
alternative label: Thai, dramatik (83.946) @sv
alternative label: Thailändsk skönlitteratur, dramatik (83.946) @sv
alternative label: Thain kieli, näytelmät (83.946)
alternative label: Thainkielinen kaunokirjallisuus, näytelmät (83.946)
broader: Sinotiibetiläisillä ja austroaasialaisilla kielillä julkaistut näytelmät
in scheme: YKL - Yleisten kirjastojen luokitusjärjestelmä
notation: 83.946
preferred label: Dramatik på thailändska @sv
preferred label: Plays in Thai @en

Vietnaminkieliset näytelmät
type: Concept
type: YKL-luokka
alternative label: Vietnamesisk skönlitteratur, dramatik (83.948) @sv
alternative label: Vietnamesiska, dramatik (83.948) @sv
alternative label: Vietnamin kieli, näytelmät (83.948)
alternative label: Vietnaminkielinen kaunokirjallisuus, näytelmät (83.948)
broader: Sinotiibetiläisillä ja austroaasialaisilla kielillä julkaistut näytelmät
in scheme: YKL - Yleisten kirjastojen luokitusjärjestelmä
notation: 83.948
preferred label: Dramatik på vietnamesiska @sv
preferred label: Plays in Vietnamese @en

Khmerinkieliset näytelmät
type: Concept
type: YKL-luokka
alternative label: Khmer kieli, näytelmät (83.949)
alternative label: Khmer, dramatik (83.949) @sv
broader: Sinotiibetiläisillä ja austroaasialaisilla kielillä julkaistut näytelmät
in scheme: YKL - Yleisten kirjastojen luokitusjärjestelmä
notation: 83.949
preferred label: Dramatik på khmer @sv
preferred label: Plays in Khmer language @en

Japanin- ja koreankieliset näytelmät
type: Concept
type: YKL-luokka
broader: Muilla kielillä julkaistut näytelmät
in scheme: YKL - Yleisten kirjastojen luokitusjärjestelmä
narrower: Japaninkieliset näytelmät
narrower: Koreankieliset näytelmät
notation: 83.95
preferred label: Dramatik på japanska. Dramatik på koreanska @sv
preferred label: Plays in Japanese. Plays in Korean @en

Japaninkieliset näytelmät
type: Concept
type: YKL-luokka
alternative label: Japanin kieli, näytelmät (83.951)
alternative label: Japaninkielinen kaunokirjallisuus, näytelmät (83.951)
alternative label: Japansk skönlitteratur, dramatik (83.951) @sv
alternative label: Japanska, dramatik (83.951) @sv
broader: Japanin- ja koreankieliset näytelmät
in scheme: YKL - Yleisten kirjastojen luokitusjärjestelmä
notation: 83.951
preferred label: Dramatik på japanska @sv
preferred label: Plays in Japanese @en

Koreankieliset näytelmät
type: Concept
type: YKL-luokka
alternative label: Korean kieli, näytelmät (83.955)
alternative label: Koreankielinen kaunokirjallisuus, näytelmät (83.955)
alternative label: Koreansk skönlitteratur, dramatik (83.955) @sv
alternative label: Koreanska, dramatik (83.955) @sv
broader: Japanin- ja koreankieliset näytelmät
in scheme: YKL - Yleisten kirjastojen luokitusjärjestelmä
notation: 83.955
preferred label: Dramatik på koreanska @sv
preferred label: Plays in Korean @en

Afrikkalaisilla kielillä julkaistut näytelmät
type: Concept
type: YKL-luokka
broader: Muilla kielillä julkaistut näytelmät
in scheme: YKL - Yleisten kirjastojen luokitusjärjestelmä
narrower: Swahilinkieliset näytelmät
narrower: Lingalankieliset näytelmät
notation: 83.96
preferred label: Dramatik på afrikanska språk @sv
preferred label: Plays in African languages @en
scope note: Hit dramatik på afrikanska språk som talas söder om Sahara, Etiopien och Somalia @sv
scope note: Tähän Saharan, Etiopian ja Somalian eteläpuolella puhutuilla afrikkalaisilla kielillä julkaistut näytelmät

Swahilinkieliset näytelmät
type: Concept
type: YKL-luokka
alternative label: Swahili, dramatik (83.961) @sv
alternative label: Swahilin kieli, näytelmät (83.961)
broader: Afrikkalaisilla kielillä julkaistut näytelmät
in scheme: YKL - Yleisten kirjastojen luokitusjärjestelmä
notation: 83.961
preferred label: Dramatik på swahili @sv
preferred label: Plays in Swahili language @en

Lingalankieliset näytelmät
type: Concept
type: YKL-luokka
alternative label: Lingala, dramatik (83.962) @sv
alternative label: Lingalan kieli, näytelmät (83.962)
broader: Afrikkalaisilla kielillä julkaistut näytelmät
in scheme: YKL - Yleisten kirjastojen luokitusjärjestelmä
notation: 83.962
preferred label: Dramatik på lingala @sv
preferred label: Plays in Lingala language @en

Kaukasialaisilla kielillä julkaistut näytelmät
type: Concept
type: YKL-luokka
broader: Muilla kielillä julkaistut näytelmät
in scheme: YKL - Yleisten kirjastojen luokitusjärjestelmä
narrower: Georgiankieliset näytelmät
narrower: Abhaasin, kabardin ja adygenkieliset näytelmät
narrower: Tšetšeeninkieliset näytelmät
notation: 83.97
preferred label: Dramatik på kaukasiska spåk @sv
preferred label: Plays in Caucasian languages @en

Georgiankieliset näytelmät
type: Concept
type: YKL-luokka
alternative label: Georgian kieli, näytelmät (83.971)
alternative label: Georgiska, dramatik (83.971) @sv
broader: Kaukasialaisilla kielillä julkaistut näytelmät
in scheme: YKL - Yleisten kirjastojen luokitusjärjestelmä
notation: 83.971
preferred label: Dramatik på georgiska @sv
preferred label: Plays in Georgian language @en

Abhaasin, kabardin ja adygenkieliset näytelmät
type: Concept
type: YKL-luokka
alternative label: Abchaziska, dramatik (83.972) @sv
alternative label: Abhaasin kieli, näytelmät (83.972)
alternative label: Adygeiska, dramatik (83.972) @sv
alternative label: Adygen kieli, näytelmät (83.972)
alternative label: Kabardin kieli, näytelmät (83.972)
alternative label: Kbardinska, dramatik (83.972) @sv
broader: Kaukasialaisilla kielillä julkaistut näytelmät
in scheme: YKL - Yleisten kirjastojen luokitusjärjestelmä
notation: 83.972
preferred label: Dramatik på abchaziska, kabardinska och adygeiska @sv
preferred label: Plays in Abkhaz, Kabardian and Adyghe languages @en

Tšetšeeninkieliset näytelmät
type: Concept
type: YKL-luokka
alternative label: Tjetjenska, dramatik (83.973) @sv
alternative label: Tšetšeenin kieli, näytelmät (83.973)
broader: Kaukasialaisilla kielillä julkaistut näytelmät
in scheme: YKL - Yleisten kirjastojen luokitusjärjestelmä
notation: 83.973
preferred label: Dramatik på tjetjenska @sv
preferred label: Plays in Chechen language @en

Eskimo- ja intiaanikielillä julkaistut näytelmät
type: Concept
type: YKL-luokka
broader: Muilla kielillä julkaistut näytelmät
in scheme: YKL - Yleisten kirjastojen luokitusjärjestelmä
narrower: Grönlanninkieliset näytelmät
notation: 83.98
preferred label: Dramatik på eskimå- och idianspråk @sv
preferred label: Plays in Eskimo and Indian languages @en

Grönlanninkieliset näytelmät
type: Concept
type: YKL-luokka
alternative label: Grönlannin kieli, näytelmät (83.981)
alternative label: Grönländska, dramatik (83.981) @sv
broader: Eskimo- ja intiaanikielillä julkaistut näytelmät
in scheme: YKL - Yleisten kirjastojen luokitusjärjestelmä
notation: 83.981
preferred label: Dramatik på grönländska @sv
preferred label: Plays in Greenlandic language @en

Muilla ei-indoeurooppalaisilla kielillä julkaistut näytelmät
type: Concept
type: YKL-luokka
alternative label: Mongolin kieli, näytelmät (83.99)
alternative label: Mongoliska, dramatik (83.99) @sv
broader: Muilla kielillä julkaistut näytelmät
in scheme: YKL - Yleisten kirjastojen luokitusjärjestelmä
narrower: Keinotekoisilla kielillä julkaistut näytelmät
narrower: Baskinkieliset näytelmät
narrower: Dravidakieliset näytelmät
narrower: Austronesialaisilla kielillä julkaistut näytelmät
notation: 83.99
preferred label: Dramatik på övriga icke-indoeuropeiska språk @sv
preferred label: Plays in other Non-Indoeuropean languages @en

Keinotekoisilla kielillä julkaistut näytelmät
type: Concept
type: YKL-luokka
broader: Muilla ei-indoeurooppalaisilla kielillä julkaistut näytelmät
in scheme: YKL - Yleisten kirjastojen luokitusjärjestelmä
notation: 83.991
preferred label: Dramatik på artificiella språk @sv
preferred label: Plays in artificial languages @en

Baskinkieliset näytelmät
type: Concept
type: YKL-luokka
alternative label: Baskin kieli, näytelmät (83.992)
alternative label: Baskiska, dramatik (83.992) @sv
broader: Muilla ei-indoeurooppalaisilla kielillä julkaistut näytelmät
in scheme: YKL - Yleisten kirjastojen luokitusjärjestelmä
notation: 83.992
preferred label: Dramatik på baskiska @sv
preferred label: Plays in Basque language @en

Dravidakieliset näytelmät
type: Concept
type: YKL-luokka
broader: Muilla ei-indoeurooppalaisilla kielillä julkaistut näytelmät
in scheme: YKL - Yleisten kirjastojen luokitusjärjestelmä
narrower: Malajalaminkieliset näytelmät
narrower: Kannadankieliset näytelmät
narrower: Tamilinkieliset näytelmät
narrower: Telugunkieliset näytelmät
notation: 83.994
preferred label: Dramatik på dravidiska @sv
preferred label: Plays in Dravidian languages @en

Malajalaminkieliset näytelmät
type: Concept
type: YKL-luokka
alternative label: Malajalamin kieli, näytelmät (83.9941)
alternative label: Malayalam, dramatik (83.9941) @sv
broader: Dravidakieliset näytelmät
in scheme: YKL - Yleisten kirjastojen luokitusjärjestelmä
notation: 83.9941
preferred label: Dramatik på malayalam @sv
preferred label: Plays in Malayalam language @en

Kannadankieliset näytelmät
type: Concept
type: YKL-luokka
alternative label: Kannada, dramatik (83.9942) @sv
alternative label: Kannadan kieli, näytelmät (83.9942)
broader: Dravidakieliset näytelmät
in scheme: YKL - Yleisten kirjastojen luokitusjärjestelmä
notation: 83.9942
preferred label: Dramatik på kannada @sv
preferred label: Plays in Kannada language @en

Tamilinkieliset näytelmät
type: Concept
type: YKL-luokka
alternative label: Tamil, dramatik (83.9943) @sv
alternative label: Tamilin kieli, näytelmät (83.9943)
broader: Dravidakieliset näytelmät
in scheme: YKL - Yleisten kirjastojen luokitusjärjestelmä
notation: 83.9943
preferred label: Dramatik på tamil @sv
preferred label: Plays in Tamil language @en

Telugunkieliset näytelmät
type: Concept
type: YKL-luokka
alternative label: Telugu, dramatik (83.9944) @sv
alternative label: Telugun kieli, näytelmät (83.9944)
broader: Dravidakieliset näytelmät
in scheme: YKL - Yleisten kirjastojen luokitusjärjestelmä
notation: 83.9944
preferred label: Dramatik på telugu @sv
preferred label: Plays in Telugu language @en

Austronesialaisilla kielillä julkaistut näytelmät
type: Concept
type: YKL-luokka
broader: Muilla ei-indoeurooppalaisilla kielillä julkaistut näytelmät
in scheme: YKL - Yleisten kirjastojen luokitusjärjestelmä
narrower: Tagaloginkieliset näytelmät
narrower: Malaijinkieliset näytelmät
narrower: Indonesiankieliset näytelmät
notation: 83.995
preferred label: Dramatik på austronesiska @sv
preferred label: Plays in Austronesian languages @en

Tagaloginkieliset näytelmät
type: Concept
type: YKL-luokka
alternative label: Tagalog, dramatik (83.9951) @sv
alternative label: Tagalogin kieli, näytelmät (83.9951)
broader: Austronesialaisilla kielillä julkaistut näytelmät
in scheme: YKL - Yleisten kirjastojen luokitusjärjestelmä
notation: 83.9951
preferred label: Dramatik på tagalog @sv
preferred label: Plays in Tagalog language @en

Malaijinkieliset näytelmät
type: Concept
type: YKL-luokka
alternative label: Malaijin kieli, näytelmät (83.9952)
alternative label: Malajiska, dramatik (83.9952) @sv
broader: Austronesialaisilla kielillä julkaistut näytelmät
in scheme: YKL - Yleisten kirjastojen luokitusjärjestelmä
notation: 83.9952
preferred label: Dramatik på malajiska @sv
preferred label: Plays in Malay language @en

Indonesiankieliset näytelmät
type: Concept
type: YKL-luokka
alternative label: Indonesian kieli, näytelmät (83.9953)
alternative label: Indonesiska, dramatik (83.9953) @sv
broader: Austronesialaisilla kielillä julkaistut näytelmät
in scheme: YKL - Yleisten kirjastojen luokitusjärjestelmä
notation: 83.9953
preferred label: Dramatik på indonesiska @sv
preferred label: Plays in Indonesian language @en

KERTOMAKIRJALLISUUS
type: Concept
modified: 2026-05-07T10:46:02
References: NÄYTELMÄT
References: SADUT. KUVAKIRJAT. SARJAKUVAT
References: KUVAKIRJAT
References: Yleinen kirjallisuudenhistoria
References: Suomen, suomalais-ugrilaisten ja uralilaisten kielten kirjallisuuden historia ja tutkimus
References: Pohjoismaisten kielten kirjallisuuden historia ja tutkimus
References: Saksankielisen kirjallisuuden historia ja tutkimus
References: Englanninkielisen kirjallisuuden historia ja tutkimus
References: Romaanisten kielten kirjallisuuden historia ja tutkimus
References: Slaavilaisten ja balttilaisten kielten kirjallisuuden historia ja tutkimus
References: Muiden indoeurooppalaisten kielten kirjallisuuden historia ja tutkimus
References: Muiden kielten kirjallisuuden historia ja tutkimus
alternative label: Anagrammit, kaunokirjallisuus (80 ... 85+)
alternative label: Animaatioelokuvat, tallenteet, fiktiiviset (80 ... 85+)
alternative label: Antologiat, kaunokirjallisuus (80 ... 85+)
alternative label: Dekkarit (84+)
alternative label: Dokumenttidraamat, tallenteet (84+)
alternative label: Elokuvat, animaatioelokuvat, fiktiiviset, tallenteet (80 ... 85+)
alternative label: Elokuvat, näytelmäelokuvat, tallenteet (84+)
alternative label: Elokuvatallenteet, näytelmäelokuvat (84+)
alternative label: Elämäkertaelokuvat (84+)
alternative label: Elämäkertaromaanit (84+)
alternative label: Eroottiset elokuvat (84+)
alternative label: Eroottiset romaanit (84+)
alternative label: Eräaiheinen kertomakirjallisuus (84+)
alternative label: Fantasiaelokuvat, animaatioelokuvat, tallenteet (80 ... 85+)
alternative label: Fantasiaelokuvat, näytelmäelokuvat, tallenteet (84+)
alternative label: Fantasiakirjallisuus, romaanit, novellit (84+)
alternative label: Historialliset elokuvat (84+)
alternative label: Historialliset romaanit (84+)
alternative label: Jännityselokuvat (84+)
alternative label: Kalajutut (84+)
alternative label: Kaskut (84+)
alternative label: Kauhuelokuvat (84+)
alternative label: Kauhuromaanit (84+)
alternative label: Kaunokirjallisuus (80 ... 85+)
alternative label: Kertomakirjallisuus (84+)
alternative label: Kertomukset, kaunokirjallisuus (84+)
alternative label: Kirjalliset äänitteet, kaunokirjallisuus (80 ... 85+)
alternative label: Kirjallisuusäänitteet, kaunokirjallisuus (80 ... 85+)
alternative label: Kokoomateokset, kaunokirjallisuus (80 ... 85+)
alternative label: Kolumnit, kaunokirjalliset (84+)
alternative label: Komediat, elokuvatallenteet (84+)
alternative label: Komediat, fiktiiviset tv-ohjelmat ja -sarjat (84+)
alternative label: Kootut teokset, kaunokirjallisuus (80 ... 85+)
alternative label: Lastenelokuvat, animaatioelokuvat, fiktiiviset, tallenteet (80 ... 85+)
alternative label: Lastenelokuvat, näytelmäelokuvat, tallenteet (84+)
alternative label: Lastenkirjallisuus, kaunokirjallisuus (80 ... 85+)
alternative label: Lukemistot, kaunokirjallisuus (80 ... 85+)
alternative label: Lukukirjat, kaunokirjallisuus (80 ... 85+)
alternative label: Lyhytelokuvatallenteet, näytelmäelokuvat (84+)
alternative label: Lyhytproosa (84+)
alternative label: Lännenelokuvat (84+)
alternative label: Lääkärikaskut (84+)
alternative label: Lääkäriromaanit (84+)
alternative label: Meriromaanit (84+)
alternative label: Murrekirjallisuus, kaunokirjallisuus (80 ... 85+)
alternative label: Musiikkielokuvat, animaatioelokuvat, fiktiiviset, tallenteet (80 ... 85+)
alternative label: Musiikkielokuvat, näytelmäelokuvat, tallenteet (84+)
alternative label: Mykkäelokuvatallenteet, näytelmäelokuvat (84+)
alternative label: Novellit (84+)
alternative label: Nukke-elokuvat, fiktiiviset (80 ... 85+)
alternative label: Nuortenelokuvat, animaatioelokuvat, fiktiiviset, tallenteet (80 ... 85+)
alternative label: Nuortenelokuvat, näytelmäelokuvat, tallenteet (84+)
alternative label: Nuortenkirjallisuus, kaunokirjallisuus (80 ... 85+)
broader: KAUNOKIRJALLISUUS. KIRJALLISUUSTIEDE. KIELITIEDE
in scheme: YKL - Yleisten kirjastojen luokitusjärjestelmä
narrower: Suomenkielinen kertomakirjallisuus
narrower: Pohjoismaisilla kielillä julkaistu kertomakirjallisuus
narrower: Saksankielinen kertomakirjallisuus
narrower: Englanninkielinen kertomakirjallisuus
narrower: Romaanisilla kielillä julkaistu kertomakirjallisuus
narrower: Slaavilaisilla ja balttilaisilla kielillä julkaistu kertomakirjallisuus
narrower: Muilla indoeurooppalaisilla kielillä julkaistu kertomakirjallisuus
narrower: Muilla kielillä julkaistu kertomakirjallisuus
notation: 84
scope note: Hit och till underklasserna romaner, noveller, berättelser, historier, anekdoter, kåserier och annan prosalitteratur samt filmatiserade dramer Verken klassificeras efter publikationens språk, inte efter originalspråk eller publikationsland Om det ena språket i en tvåspråkig publikation är översättningsspråk klassificeras verket efter detta språk Om texterna i en två- eller flerspråkig publikation inte är översättningar av varandra klassificeras verket efter publikationens huvudspråk Om verket inte har något huvudspråk klassificeras det efter publikationens första språk Klassen på filmer på främmande språk bestäms av språket till vilket filmen är textad: i ordningen finska, svenska, engelska osv. utgående från hur vanligt språket är Om en film inte har något språkligt innehåll, förs den till klass 84. Formtilläggen 01, 02, 03+, 06+, 07, 08+ och 09 används inte i samband med klasserna 80-85+ @sv
scope note: Tähän ja alaluokkiin aikuisille tai lapsille tarkoitetut romaanit, novellit, tarinat, kertomukset, kaskut, pakinat ja muu kertomakirjallisuus sekä näytelmäelokuvat Teokset luokitetaan julkaisun kielen, ei julkaisumaan tai alkuteoksen kielen mukaan Jos kaksikielisen teoksen toinen kieli on käännöskieli, luokitetaan teos käännöskielen mukaan Jos kaksi- tai useampikielisen teoksen tekstit eivät ole toistensa käännöksiä, luokitetaan teos julkaisun pääkielen mukaan Jos teoksella ei ole pääkieltä, se luokitetaan julkaisun ensimmäisen kielen mukaan Vieraskielisten elokuvien luokka määräytyy tekstityskielen mukaan järjestyksessä: suomi, ruotsi, englanti jne. kielen tuttuuden mukaan Jos elokuvassa ei ole lainkaan kielellistä sisältöä, sen luokaksi annetaan 84. Muotoluokkia 01, 02, 03+, 06+, 07, 08+ ja 09 ei käytetä luokkien 80-85+ yhteydessä

Suomenkielinen kertomakirjallisuus
type: Concept
type: YKL-luokka
alternative label: Finsk skönlitteratur, epik (84.2) @sv
alternative label: Finska, epik (84.2) @sv
alternative label: Suomen kieli, kertomakirjallisuus (84.2)
alternative label: Suomenkielinen kaunokirjallisuus, kertomakirjallisuus (84.2)
broader: KERTOMAKIRJALLISUUS
in scheme: YKL - Yleisten kirjastojen luokitusjärjestelmä
narrower: Meänkielinen kertomakirjallisuus
narrower: Kveeninkielinen kertomakirjallisuus
narrower: Vironkielinen kertomakirjallisuus
narrower: Muilla itämerensuomalaisilla kielillä julkaistu kertomakirjallisuus
narrower: Muilla suomalais-ugrilaisilla ja uralilaisilla kielillä julkaistu kertomakirjallisuus
notation: 84.2
preferred label: Narrative literature in Finnish @en
preferred label: Prosa på finska @sv

Meänkielinen kertomakirjallisuus
type: Concept
type: YKL-luokka
alternative label: Meänkieli, epik (84.21) @sv
alternative label: Meänkieli, kertomakirjallisuus (84.21)
alternative label: Meänkielinen kaunokirjallisuus, kertomakirjallisuus (84.21)
alternative label: Skönlitteratur på meänkieli, epik (84.21) @sv
alternative label: Tornedalsfinska, epik (84.21) @sv
broader: Suomenkielinen kertomakirjallisuus
in scheme: YKL - Yleisten kirjastojen luokitusjärjestelmä
notation: 84.21
preferred label: Narrative literature in Meänkieli @en
preferred label: Prosa på meänkieli @sv

Kveeninkielinen kertomakirjallisuus
type: Concept
type: YKL-luokka
alternative label: Kveenin kieli, kertomakirjallisuus (84.22)
alternative label: Kveeninkielinen kaunokirjallisuus, kertomakirjallisuus (84.22)
alternative label: Kvänsk skönlitteratur, epik (84.22) @sv
alternative label: Kvänska, epik (84.22) @sv
broader: Suomenkielinen kertomakirjallisuus
in scheme: YKL - Yleisten kirjastojen luokitusjärjestelmä
notation: 84.22
preferred label: Narrative literature in Kven language @en
preferred label: Prosa på kvänska @sv

Vironkielinen kertomakirjallisuus
type: Concept
type: YKL-luokka
alternative label: Estnisk skönlitteratur, epik (84.23) @sv
alternative label: Estniska, epik (84.23) @sv
alternative label: Viron kieli, kertomakirjallisuus (84.23)
alternative label: Vironkielinen kaunokirjallisuus, kertomakirjallisuus (84.23)
broader: Suomenkielinen kertomakirjallisuus
in scheme: YKL - Yleisten kirjastojen luokitusjärjestelmä
notation: 84.23
preferred label: Narrative literature in Estonian @en
preferred label: Prosa på estniska @sv

Muilla itämerensuomalaisilla kielillä julkaistu kertomakirjallisuus
type: Concept
type: YKL-luokka
broader: Suomenkielinen kertomakirjallisuus
in scheme: YKL - Yleisten kirjastojen luokitusjärjestelmä
narrower: Karjalankielinen kertomakirjallisuus
notation: 84.24
preferred label: Narrative literature in other Balto-Finnic languages @en
preferred label: Prosa på övriga östersjöfinska språk @sv

Karjalankielinen kertomakirjallisuus
type: Concept
type: YKL-luokka
alternative label: Karelska, epik (84.241) @sv
alternative label: Karjalan kieli, kertomakirjallisuus (84.241)
broader: Muilla itämerensuomalaisilla kielillä julkaistu kertomakirjallisuus
in scheme: YKL - Yleisten kirjastojen luokitusjärjestelmä
notation: 84.241
preferred label: Narrative literature in Karelian language @en
preferred label: Prosa på karelska @sv

Muilla suomalais-ugrilaisilla ja uralilaisilla kielillä julkaistu kertomakirjallisuus
type: Concept
type: YKL-luokka
broader: Suomenkielinen kertomakirjallisuus
in scheme: YKL - Yleisten kirjastojen luokitusjärjestelmä
narrower: Unkarinkielinen kertomakirjallisuus
narrower: Saamenkielinen kertomakirjallisuus
notation: 84.25
preferred label: Narrative literature in other Finno-Ugric and Uralic languages @en
preferred label: Prosa på övriga finsk-ugriska och uraliska språk @sv

Unkarinkielinen kertomakirjallisuus
type: Concept
type: YKL-luokka
alternative label: Ungersk skönlitteratur, epik (84.251) @sv
alternative label: Ungerska, epik (84.251) @sv
alternative label: Unkarin kieli, kertomakirjallisuus (84.251)
alternative label: Unkarinkielinen kaunokirjallisuus, kertomakirjallisuus (84.251)
broader: Muilla suomalais-ugrilaisilla ja uralilaisilla kielillä julkaistu kertomakirjallisuus
in scheme: YKL - Yleisten kirjastojen luokitusjärjestelmä
notation: 84.251
preferred label: Narrative literature in Hungarian @en
preferred label: Prosa på ungerska @sv

Saamenkielinen kertomakirjallisuus
type: Concept
type: YKL-luokka
alternative label: Saamen kieli, kertomakirjallisuus (84.252)
alternative label: Saamenkielinen kaunokirjallisuus, kertomakirjallisuus (84.252)
alternative label: Samisk skönlitteratur, epik (84.252) @sv
alternative label: Samiska, epik (84.252) @sv
broader: Muilla suomalais-ugrilaisilla ja uralilaisilla kielillä julkaistu kertomakirjallisuus
in scheme: YKL - Yleisten kirjastojen luokitusjärjestelmä
notation: 84.252
preferred label: Narrative literature in Sami @en
preferred label: Prosa på samiska @sv

Pohjoismaisilla kielillä julkaistu kertomakirjallisuus
type: Concept
type: YKL-luokka
broader: KERTOMAKIRJALLISUUS
in scheme: YKL - Yleisten kirjastojen luokitusjärjestelmä
narrower: Ruotsinkielinen kertomakirjallisuus
narrower: Norjankielinen kertomakirjallisuus
narrower: Tanskankielinen kertomakirjallisuus
narrower: Islanninkielinen kertomakirjallisuus
narrower: Fäärinkielinen kertomakirjallisuus
notation: 84.3
preferred label: Narrative literature in other Nordic languages @en
preferred label: Prosa på nordiska språk @sv

Ruotsinkielinen kertomakirjallisuus
type: Concept
type: YKL-luokka
alternative label: Ruotsin kieli, kertomakirjallisuus (84.31)
alternative label: Ruotsinkielinen kaunokirjallisuus, kertomakirjallisuus (84.31)
alternative label: Svensk skönlitteratur, epik (84.31) @sv
alternative label: Svenska, epik (84.31) @sv
broader: Pohjoismaisilla kielillä julkaistu kertomakirjallisuus
in scheme: YKL - Yleisten kirjastojen luokitusjärjestelmä
notation: 84.31
preferred label: Narrative literature in Swedish @en
preferred label: Prosa på svenska @sv

Norjankielinen kertomakirjallisuus
type: Concept
type: YKL-luokka
alternative label: Norjan kieli, kertomakirjallisuus (84.32)
alternative label: Norjankielinen kaunokirjallisuus, kertomakirjallisuus (84.32)
alternative label: Norsk skönlitteratur, epik (84.32) @sv
alternative label: Norska, epik (84.32) @sv
broader: Pohjoismaisilla kielillä julkaistu kertomakirjallisuus
in scheme: YKL - Yleisten kirjastojen luokitusjärjestelmä
notation: 84.32
preferred label: Narrative literature in Norwegian @en
preferred label: Prosa på norska @sv

Tanskankielinen kertomakirjallisuus
type: Concept
type: YKL-luokka
alternative label: Dansk skönlitteratur, epik (84.33) @sv
alternative label: Danska, epik (84.33) @sv
alternative label: Tanskan kieli, kertomakirjallisuus (84.33)
alternative label: Tanskankielinen kaunokirjallisuus, kertomakirjallisuus (84.33)
broader: Pohjoismaisilla kielillä julkaistu kertomakirjallisuus
in scheme: YKL - Yleisten kirjastojen luokitusjärjestelmä
notation: 84.33
preferred label: Narrative literature in Danish @en
preferred label: Prosa på danska @sv

Islanninkielinen kertomakirjallisuus
type: Concept
type: YKL-luokka
alternative label: Islannin kieli, kertomakirjallisuus (84.34)
alternative label: Islanninkielinen kaunokirjallisuus, kertomakirjallisuus (84.34)
alternative label: Isländsk skönlitteratur, epik (84.34) @sv
alternative label: Isländska, epik (84.34) @sv
broader: Pohjoismaisilla kielillä julkaistu kertomakirjallisuus
in scheme: YKL - Yleisten kirjastojen luokitusjärjestelmä
notation: 84.34
preferred label: Narrative literature in Icelandic @en
preferred label: Prosa på isländska @sv

Fäärinkielinen kertomakirjallisuus
type: Concept
type: YKL-luokka
alternative label: Färöisk skönlitteratur, epik (84.35) @sv
alternative label: Färöiska, epik (84.35) @sv
alternative label: Fäärin kieli, kertomakirjallisuus (84.35)
alternative label: Fäärinkielinen kaunokirjallisuus, kertomakirjallisuus (84.35)
broader: Pohjoismaisilla kielillä julkaistu kertomakirjallisuus
in scheme: YKL - Yleisten kirjastojen luokitusjärjestelmä
notation: 84.35
preferred label: Narrative literature in Faeroese @en
preferred label: Prosa på färöiska @sv

Saksankielinen kertomakirjallisuus
type: Concept
type: YKL-luokka
alternative label: Saksan kieli, kertomakirjallisuus (84.4)
alternative label: Saksankielinen kaunokirjallisuus, kertomakirjallisuus (84.4)
alternative label: Tysk skönlitteratur, epik (84.4) @sv
alternative label: Tyska, epik (84.4) @sv
broader: KERTOMAKIRJALLISUUS
in scheme: YKL - Yleisten kirjastojen luokitusjärjestelmä
narrower: Jiddišinkielinen kertomakirjallisuus
narrower: Friisinkielinen kertomakirjallisuus
narrower: Hollanninkielinen kertomakirjallisuus
notation: 84.4
preferred label: Narrative literature in German @en
preferred label: Prosa på tyska @sv
scope note: Hit och till underklassen också prosa på andra germanska språk Hit prosa på jiddisch @sv
scope note: Tähän ja alaluokkaan myös muilla germaanisilla kielillä julkaistu kertomakirjallisuus Tähän jiddisinkielinen kertomakirjallisuus

Jiddišinkielinen kertomakirjallisuus
type: Concept
type: YKL-luokka
alternative label: Jiddisch, epik (84.41) @sv
alternative label: Jiddišin kieli, kertomakirjallisuus (84.41)
broader: Saksankielinen kertomakirjallisuus
in scheme: YKL - Yleisten kirjastojen luokitusjärjestelmä
notation: 84.41
preferred label: Narrative literature in Yiddish language @en
preferred label: Prosa på jiddisch @sv

Friisinkielinen kertomakirjallisuus
type: Concept
type: YKL-luokka
broader: Saksankielinen kertomakirjallisuus
in scheme: YKL - Yleisten kirjastojen luokitusjärjestelmä
notation: 84.43
preferred label: Narrative literature in Frisian @en
preferred label: Prosa på frisiska @sv

Hollanninkielinen kertomakirjallisuus
type: Concept
type: YKL-luokka
alternative label: Hollannin kieli, kertomakirjallisuus (84.48)
alternative label: Hollanninkielinen kaunokirjallisuus, kertomakirjallisuus (84.48)
alternative label: Nederländsk skönlitteratur, epik (84.48) @sv
alternative label: Nederländska, epik (84.48) @sv
broader: Saksankielinen kertomakirjallisuus
in scheme: YKL - Yleisten kirjastojen luokitusjärjestelmä
narrower: Afrikaansinkielinen kertomakirjallisuus
notation: 84.48
preferred label: Narrative literature in Dutch @en
preferred label: Prosa på holländska @sv
scope note: Hit också prosa på afrikaans och flamländska @sv
scope note: Tähän myös afrikaansin- ja flaaminkielinen kertomakirjallisuus

Afrikaansinkielinen kertomakirjallisuus
type: Concept
type: YKL-luokka
alternative label: Afrikaans, epik (84.481) @sv
alternative label: Afrikaansin kieli, kertomakirjallisuus (84.481)
broader: Hollanninkielinen kertomakirjallisuus
in scheme: YKL - Yleisten kirjastojen luokitusjärjestelmä
notation: 84.481
preferred label: Narrative literature in Afrikaans language @en
preferred label: Prosa på afrikaans @sv

Englanninkielinen kertomakirjallisuus
type: Concept
type: YKL-luokka
alternative label: Engelsk skönlitteratur, epik (84.5) @sv
alternative label: Engelska, epik (84.5) @sv
alternative label: Englannin kieli, kertomakirjallisuus (84.5)
alternative label: Englanninkielinen kaunokirjallisuus, kertomakirjallisuus (84.5)
broader: KERTOMAKIRJALLISUUS
in scheme: YKL - Yleisten kirjastojen luokitusjärjestelmä
notation: 84.5
preferred label: Narrative literature in English @en
preferred label: Prosa på engelska @sv

Romaanisilla kielillä julkaistu kertomakirjallisuus
type: Concept
type: YKL-luokka
broader: KERTOMAKIRJALLISUUS
in scheme: YKL - Yleisten kirjastojen luokitusjärjestelmä
narrower: Ranskankielinen kertomakirjallisuus
narrower: Italiankielinen kertomakirjallisuus
narrower: Espanjankielinen kertomakirjallisuus
narrower: Portugalinkielinen kertomakirjallisuus
narrower: Romaniankielinen kertomakirjallisuus
narrower: Muilla romaanisilla kielillä julkaistu kertomakirjallisuus
notation: 84.6
preferred label: Narrative literature in Romanic languages @en
preferred label: Prosa på romanska språk @sv

Ranskankielinen kertomakirjallisuus
type: Concept
type: YKL-luokka
alternative label: Fransk skönlitteratur, epik (84.61) @sv
alternative label: Franska, epik (84.61) @sv
alternative label: Ranskan kieli, kertomakirjallisuus (84.61)
alternative label: Ranskankielinen kaunokirjallisuus, kertomakirjallisuus (84.61)
broader: Romaanisilla kielillä julkaistu kertomakirjallisuus
in scheme: YKL - Yleisten kirjastojen luokitusjärjestelmä
notation: 84.61
preferred label: Narrative literature in French @en
preferred label: Prosa på franska @sv

Italiankielinen kertomakirjallisuus
type: Concept
type: YKL-luokka
alternative label: Italian kieli, kertomakirjallisuus (84.62)
alternative label: Italiankielinen kaunokirjallisuus, kertomakirjallisuus (84.62)
alternative label: Italiensk skönlitteratur, epik (84.62) @sv
alternative label: Italienska, epik (84.62) @sv
broader: Romaanisilla kielillä julkaistu kertomakirjallisuus
in scheme: YKL - Yleisten kirjastojen luokitusjärjestelmä
notation: 84.62
preferred label: Narrative literature in Italian @en
preferred label: Prosa på italienska @sv

Espanjankielinen kertomakirjallisuus
type: Concept
type: YKL-luokka
alternative label: Espanjan kieli, kertomakirjallisuus (84.63)
alternative label: Espanjankielinen kaunokirjallisuus, kertomakirjallisuus (84.63)
alternative label: Spansk skönlitteratur, epik (84.63) @sv
alternative label: Spanska, epik (84.63) @sv
broader: Romaanisilla kielillä julkaistu kertomakirjallisuus
in scheme: YKL - Yleisten kirjastojen luokitusjärjestelmä
notation: 84.63
preferred label: Narrative literature in Spanish @en
preferred label: Prosa på spanska @sv

Portugalinkielinen kertomakirjallisuus
type: Concept
type: YKL-luokka
alternative label: Portugalin kieli, kertomakirjallisuus (84.64)
alternative label: Portugalinkielinen kaunokirjallisuus, kertomakirjallisuus (84.64)
alternative label: Portugisisk skönlitteratur, epik (84.64) @sv
alternative label: Portugisiska, epik (84.64) @sv
broader: Romaanisilla kielillä julkaistu kertomakirjallisuus
in scheme: YKL - Yleisten kirjastojen luokitusjärjestelmä
notation: 84.64
preferred label: Narrative literature in Portuguese @en
preferred label: Prosa på portugisiska @sv

Romaniankielinen kertomakirjallisuus
type: Concept
type: YKL-luokka
alternative label: Romanian kieli, kertomakirjallisuus (84.65)
alternative label: Romaniankielinen kaunokirjallisuus, kertomakirjallisuus (84.65)
alternative label: Rumänsk skönlitteratur, epik (84.65) @sv
alternative label: Rumänska, epik (84.65) @sv
broader: Romaanisilla kielillä julkaistu kertomakirjallisuus
in scheme: YKL - Yleisten kirjastojen luokitusjärjestelmä
notation: 84.65
preferred label: Narrative literature in Romanian @en
preferred label: Prosa på rumänska @sv

Muilla romaanisilla kielillä julkaistu kertomakirjallisuus
type: Concept
type: YKL-luokka
broader: Romaanisilla kielillä julkaistu kertomakirjallisuus
in scheme: YKL - Yleisten kirjastojen luokitusjärjestelmä
narrower: Katalaaninkielinen kertomakirjallisuus
notation: 84.67
preferred label: Narrative literature in other Romanic languages @en
preferred label: Prosa på övriga romanska språk @sv

Katalaaninkielinen kertomakirjallisuus
type: Concept
type: YKL-luokka
alternative label: Katalaanin kieli, kertomakirjallisuus (84.671)
alternative label: Katalanska, epik (84.671) @sv
broader: Muilla romaanisilla kielillä julkaistu kertomakirjallisuus
in scheme: YKL - Yleisten kirjastojen luokitusjärjestelmä
notation: 84.671
preferred label: Narrative literature in Catalan language @en
preferred label: Prosa på katalanska @sv

Slaavilaisilla ja balttilaisilla kielillä julkaistu kertomakirjallisuus
type: Concept
type: YKL-luokka
broader: KERTOMAKIRJALLISUUS
in scheme: YKL - Yleisten kirjastojen luokitusjärjestelmä
narrower: Venäjänkielinen kertomakirjallisuus
narrower: Ukrainankielinen kertomakirjallisuus. Valkovenäjänkielinen kertomakirjallisuus
narrower: Puolankielinen kertomakirjallisuus
narrower: Tšekinkielinen kertomakirjallisuus
narrower: Slovakinkielinen kertomakirjallisuus
narrower: Eteläslaavilaisilla kielillä julkaistu kertomakirjallisuus
narrower: Balttilaisilla kielillä julkaistu kertomakirjallisuus
notation: 84.7
preferred label: Narrative literature in Slavonic and Baltic languages @en
preferred label: Prosa på slaviska och baltiska språk @sv

Venäjänkielinen kertomakirjallisuus
type: Concept
type: YKL-luokka
alternative label: Rysk skönlitteratur, epik (84.71) @sv
alternative label: Ryska, epik (84.71) @sv
alternative label: Venäjän kieli, kertomakirjallisuus (84.71)
alternative label: Venäjänkielinen kaunokirjallisuus, kertomakirjallisuus (84.71)
broader: Slaavilaisilla ja balttilaisilla kielillä julkaistu kertomakirjallisuus
in scheme: YKL - Yleisten kirjastojen luokitusjärjestelmä
notation: 84.71
preferred label: Narrative literature in Russian @en
preferred label: Prosa på ryska @sv

Ukrainankielinen kertomakirjallisuus. Valkovenäjänkielinen kertomakirjallisuus
type: Concept
type: YKL-luokka
broader: Slaavilaisilla ja balttilaisilla kielillä julkaistu kertomakirjallisuus
in scheme: YKL - Yleisten kirjastojen luokitusjärjestelmä
narrower: Ukrainankielinen kertomakirjallisuus
narrower: Valkovenäjänkielinen kertomakirjallisuus
notation: 84.72
preferred label: Narrative literature in Ukrainian. Narrative literature in Byelorussian @en
preferred label: Prosa på ukrainska. Prosa på vitryska @sv

Ukrainankielinen kertomakirjallisuus
type: Concept
type: YKL-luokka
alternative label: Ukrainan kieli, kertomakirjallisuus (84.721)
alternative label: Ukrainska, epik (84.721) @sv
broader: Ukrainankielinen kertomakirjallisuus. Valkovenäjänkielinen kertomakirjallisuus
in scheme: YKL - Yleisten kirjastojen luokitusjärjestelmä
notation: 84.721
preferred label: Narrative literature in Ukrainian @en
preferred label: Prosa på ukrainska @sv

Valkovenäjänkielinen kertomakirjallisuus
type: Concept
type: YKL-luokka
alternative label: Valkovenäjän kieli, kertomakirjallisuus (84.722)
alternative label: Vitryska, epik (84.722) @sv
broader: Ukrainankielinen kertomakirjallisuus. Valkovenäjänkielinen kertomakirjallisuus
in scheme: YKL - Yleisten kirjastojen luokitusjärjestelmä
notation: 84.722
preferred label: Narrative literature in Belarusian language @en
preferred label: Prosa på vitryska @sv

Puolankielinen kertomakirjallisuus
type: Concept
type: YKL-luokka
alternative label: Polsk skönlitteratur, epik (84.73) @sv
alternative label: Polska, epik (84.73) @sv
alternative label: Puolan kieli, kertomakirjallisuus (84.73)
alternative label: Puolankielinen kaunokirjallisuus, kertomakirjallisuus (84.73)
broader: Slaavilaisilla ja balttilaisilla kielillä julkaistu kertomakirjallisuus
in scheme: YKL - Yleisten kirjastojen luokitusjärjestelmä
notation: 84.73
preferred label: Narrative literature in Polish @en
preferred label: Prosa på polska @sv

Tšekinkielinen kertomakirjallisuus
type: Concept
type: YKL-luokka
alternative label: Tjeckisk skönlitteratur, epik (84.74) @sv
alternative label: Tjeckiska, epik (84.74) @sv
alternative label: Tšekin kieli, kertomakirjallisuus (84.74)
alternative label: Tšekinkielinen kaunokirjallisuus, kertomakirjallisuus (84.74)
broader: Slaavilaisilla ja balttilaisilla kielillä julkaistu kertomakirjallisuus
in scheme: YKL - Yleisten kirjastojen luokitusjärjestelmä
notation: 84.74
preferred label: Narrative literature in Czech @en
preferred label: Prosa på tjeckiska @sv

Slovakinkielinen kertomakirjallisuus
type: Concept
type: YKL-luokka
alternative label: Slovakin kieli, kertomakirjallisuus (84.75)
alternative label: Slovakinkielinen kaunokirjallisuus, kertomakirjallisuus (84.75)
alternative label: Slovakisk skönlitteratur, epik (84.75) @sv
alternative label: Slovakiska, epik (84.75) @sv
broader: Slaavilaisilla ja balttilaisilla kielillä julkaistu kertomakirjallisuus
in scheme: YKL - Yleisten kirjastojen luokitusjärjestelmä
notation: 84.75
preferred label: Narrative literature in Slovak @en
preferred label: Prosa på slovakiska @sv

Eteläslaavilaisilla kielillä julkaistu kertomakirjallisuus
type: Concept
type: YKL-luokka
broader: Slaavilaisilla ja balttilaisilla kielillä julkaistu kertomakirjallisuus
in scheme: YKL - Yleisten kirjastojen luokitusjärjestelmä
narrower: Bulgariankielinen kertomakirjallisuus
narrower: Makedoniankielinen kertomakirjallisuus
narrower: Sloveeninkielinen kertomakirjallisuus
narrower: Serbiankielinen kertomakirjallisuus
narrower: Kroatiankielinen kertomakirjallisuus
narrower: Bosniankielinen kertomakirjallisuus
notation: 84.76
preferred label: Narrative literature in South-Slavonic languages @en
preferred label: Prosa på sydslaviska språk @sv

Bulgariankielinen kertomakirjallisuus
type: Concept
type: YKL-luokka
alternative label: Bulgarian kieli, kertomakirjallisuus (84.761)
alternative label: Bulgariankielinen kaunokirjallisuus, kertomakirjallisuus (84.761)
alternative label: Bulgarisk skönlitteratur, epik (84.761) @sv
alternative label: Bulgariska, epik (84.761) @sv
broader: Eteläslaavilaisilla kielillä julkaistu kertomakirjallisuus
in scheme: YKL - Yleisten kirjastojen luokitusjärjestelmä
notation: 84.761
preferred label: Narrative literature in Bulgarian @en
preferred label: Prosa på bulgariska @sv

Makedoniankielinen kertomakirjallisuus
type: Concept
type: YKL-luokka
alternative label: Makedonian kieli, kertomakirjallisuus (84.762)
alternative label: Makedoniankielinen kaunokirjallisuus, kertomakirjallisuus (84.762)
alternative label: Makedonsk skönlitteratur, epik (84.762) @sv
alternative label: Makedonska, epik (84.762) @sv
broader: Eteläslaavilaisilla kielillä julkaistu kertomakirjallisuus
in scheme: YKL - Yleisten kirjastojen luokitusjärjestelmä
notation: 84.762
preferred label: Narrative literature in Macedonian @en
preferred label: Prosa på makedonska @sv

Sloveeninkielinen kertomakirjallisuus
type: Concept
type: YKL-luokka
alternative label: Sloveenin kieli, kertomakirjallisuus (84.763)
alternative label: Sloveeninkielinen kaunokirjallisuus, kertomakirjallisuus (84.763)
alternative label: Slovensk skönlitteratur, epik (84.763) @sv
alternative label: Slovenska, epik (84.763) @sv
broader: Eteläslaavilaisilla kielillä julkaistu kertomakirjallisuus
in scheme: YKL - Yleisten kirjastojen luokitusjärjestelmä
notation: 84.763
preferred label: Narrative literature in Slovenian @en
preferred label: Prosa på slovenska @sv

Serbiankielinen kertomakirjallisuus
type: Concept
type: YKL-luokka
alternative label: Serbian kieli, kertomakirjallisuus (84.764)
alternative label: Serbiankielinen kaunokirjallisuus, kertomakirjallisuus (84.764)
alternative label: Serbisk skönlitteratur, epik (84.764) @sv
alternative label: Serbiska, epik (84.764) @sv
broader: Eteläslaavilaisilla kielillä julkaistu kertomakirjallisuus
in scheme: YKL - Yleisten kirjastojen luokitusjärjestelmä
notation: 84.764
preferred label: Narrative literature in Serbian @en
preferred label: Prosa på serbiska @sv

Kroatiankielinen kertomakirjallisuus
type: Concept
type: YKL-luokka
alternative label: Kroaatin kieli, kertomakirjallisuus (84.765)
alternative label: Kroaatinkielinen kaunokirjallisuus, kertomakirjallisuus (84.765)
alternative label: Kroatian kieli, kertomakirjallisuus (84.765)
alternative label: Kroatiankielinen kaunokirjallisuus, kertomakirjallisuus (84.765)
alternative label: Kroatisk skönlitteratur, epik (84.765) @sv
alternative label: Kroatiska, epik (84.765) @sv
broader: Eteläslaavilaisilla kielillä julkaistu kertomakirjallisuus
in scheme: YKL - Yleisten kirjastojen luokitusjärjestelmä
notation: 84.765
preferred label: Narrative literature in Croatian @en
preferred label: Prosa på kroatiska @sv

Bosniankielinen kertomakirjallisuus
type: Concept
type: YKL-luokka
alternative label: Bosnian kieli, kertomakirjallisuus (84.766)
alternative label: Bosniankielinen kaunokirjallisuus, kertomakirjallisuus (84.766)
alternative label: Bosnisk skönlitteratur, epik (84.766) @sv
alternative label: Bosniska, epik (84.766) @sv
broader: Eteläslaavilaisilla kielillä julkaistu kertomakirjallisuus
in scheme: YKL - Yleisten kirjastojen luokitusjärjestelmä
notation: 84.766
preferred label: Narrative literature in Bosnian @en
preferred label: Prosa på bosniska @sv

Balttilaisilla kielillä julkaistu kertomakirjallisuus
type: Concept
type: YKL-luokka
broader: Slaavilaisilla ja balttilaisilla kielillä julkaistu kertomakirjallisuus
in scheme: YKL - Yleisten kirjastojen luokitusjärjestelmä
narrower: Latviankielinen kertomakirjallisuus
narrower: Liettuankielinen kertomakirjallisuus
notation: 84.78
preferred label: Narrative literature in Baltic languages @en
preferred label: Prosa på baltiska språk @sv

Latviankielinen kertomakirjallisuus
type: Concept
type: YKL-luokka
alternative label: Latvian kieli, kertomakirjallisuus (84.781)
alternative label: Latviankielinen kaunokirjallisuus, kertomakirjallisuus (84.781)
alternative label: Lettisk skönlitteratur, epik (84.781) @sv
alternative label: Lettiska, epik (84.781) @sv
broader: Balttilaisilla kielillä julkaistu kertomakirjallisuus
in scheme: YKL - Yleisten kirjastojen luokitusjärjestelmä
notation: 84.781
preferred label: Narrative literature in Latvian @en
preferred label: Prosa på lettiska @sv

Liettuankielinen kertomakirjallisuus
type: Concept
type: YKL-luokka
alternative label: Liettuan kieli, kertomakirjallisuus (84.782)
alternative label: Liettuankielinen kaunokirjallisuus, kertomakirjallisuus (84.782)
alternative label: Litauisk skönlitteratur, epik (84.782) @sv
alternative label: Litauiska, epik (84.782) @sv
broader: Balttilaisilla kielillä julkaistu kertomakirjallisuus
in scheme: YKL - Yleisten kirjastojen luokitusjärjestelmä
notation: 84.782
preferred label: Narrative literature in Lithuanian @en
preferred label: Prosa på litauiska @sv

Muilla indoeurooppalaisilla kielillä julkaistu kertomakirjallisuus
type: Concept
type: YKL-luokka
broader: KERTOMAKIRJALLISUUS
in scheme: YKL - Yleisten kirjastojen luokitusjärjestelmä
narrower: Kreikankielinen kertomakirjallisuus
narrower: Latinankielinen kertomakirjallisuus
narrower: Indoiraanisilla kielillä julkaistu kertomakirjallisuus
narrower: Albaniankielinen kertomakirjallisuus
narrower: Armeniankielinen kertomakirjallisuus
narrower: Kelttiläisillä kielillä julkaistu kertomakirjallisuus
notation: 84.8
preferred label: Narrative literature in other Indo-European languages @en
preferred label: Prosa på övriga indoeuropeiska språk @sv

Kreikankielinen kertomakirjallisuus
type: Concept
type: YKL-luokka
alternative label: Grekisk skönlitteratur, forngrekiska, epik (84.81) @sv
alternative label: Grekiska, forngrekiska, epik (84.81) @sv
alternative label: Kreikan kieli, muinaiskreikka, kertomakirjallisuus (84.81)
alternative label: Kreikankielinen kaunokirjallisuus, muinaiskreikka, kertomakirjallisuus (84.81)
broader: Muilla indoeurooppalaisilla kielillä julkaistu kertomakirjallisuus
in scheme: YKL - Yleisten kirjastojen luokitusjärjestelmä
narrower: Nykykreikankielinen kertomakirjallisuus
notation: 84.81
preferred label: Narrative literature in Greek @en
preferred label: Prosa på grekiska @sv

Nykykreikankielinen kertomakirjallisuus
type: Concept
type: YKL-luokka
alternative label: Grekisk skönlitteratur, nygrekiska, epik (84.812) @sv
alternative label: Grekiska, nygrekiska, epik (84.812) @sv
alternative label: Kreikan kieli, nykykreikka, kertomakirjallisuus (84.812)
alternative label: Kreikankielinen kaunokirjallisuus, nykykreikka, kertomakirjallisuus (84.812)
broader: Kreikankielinen kertomakirjallisuus
in scheme: YKL - Yleisten kirjastojen luokitusjärjestelmä
notation: 84.812
preferred label: Narrative literature in Modern Greek @en
preferred label: Prosa på nygrekiska @sv

Latinankielinen kertomakirjallisuus
type: Concept
type: YKL-luokka
alternative label: Latin, epik (84.82) @sv
alternative label: Latinan kieli, kertomakirjallisuus (84.82)
alternative label: Latinankielinen kaunokirjallisuus, kertomakirjallisuus (84.82)
alternative label: Latinsk skönlitteratur, epik (84.82) @sv
broader: Muilla indoeurooppalaisilla kielillä julkaistu kertomakirjallisuus
in scheme: YKL - Yleisten kirjastojen luokitusjärjestelmä
notation: 84.82
preferred label: Narrative literature in Latin @en
preferred label: Prosa på latin @sv

Indoiraanisilla kielillä julkaistu kertomakirjallisuus
type: Concept
type: YKL-luokka
broader: Muilla indoeurooppalaisilla kielillä julkaistu kertomakirjallisuus
in scheme: YKL - Yleisten kirjastojen luokitusjärjestelmä
narrower: Persiankielinen kertomakirjallisuus
narrower: Kurdinkielinen kertomakirjallisuus
narrower: Paštunkielinen kertomakirjallisuus
narrower: Indoarjalaisilla kielillä julkaistu kertomakirjallisuus
notation: 84.83
preferred label: Narrative literature in Indo-Iranic languages @en
preferred label: Prosa på indoiranska språk @sv
scope note: Intialaisilla ja iranilaisilla kielillä julkaistu kertomakirjallisuus
scope note: Prosa på indiska och iranska språk @sv

Persiankielinen kertomakirjallisuus
type: Concept
type: YKL-luokka
alternative label: Persian kieli, kertomakirjallisuus (84.831)
alternative label: Persiankielinen kaunokirjallisuus, kertomakirjallisuus (84.831)
alternative label: Persisk skönlitteratur, epik (84.831) @sv
alternative label: Persiska, epik (84.831) @sv
broader: Indoiraanisilla kielillä julkaistu kertomakirjallisuus
in scheme: YKL - Yleisten kirjastojen luokitusjärjestelmä
narrower: Darinkielinen kertomakirjallisuus
notation: 84.831
preferred label: Narrative literature in Persian @en
preferred label: Prosa på persiska @sv

Darinkielinen kertomakirjallisuus
type: Concept
type: YKL-luokka
alternative label: Dari, epik (84.8311) @sv
alternative label: Darin kieli, kertomakirjallisuus (84.8311)
alternative label: Darinkielinen kaunokirjallisuus, kertomakirjallisuus (84.8311)
alternative label: Skönlitteratur på dari, epik (84.8311) @sv
broader: Persiankielinen kertomakirjallisuus
in scheme: YKL - Yleisten kirjastojen luokitusjärjestelmä
notation: 84.8311
preferred label: Narrative literature in Dari language @en
preferred label: Prosa på dari @sv

Kurdinkielinen kertomakirjallisuus
type: Concept
type: YKL-luokka
alternative label: Kurdin kieli, kertomakirjallisuus (84.832)
alternative label: Kurdinkielinen kaunokirjallisuus, kertomakirjallisuus (84.832)
alternative label: Kurdisk skönlitteratur, epik (84.832) @sv
alternative label: Kurdiska, epik (84.832) @sv
broader: Indoiraanisilla kielillä julkaistu kertomakirjallisuus
in scheme: YKL - Yleisten kirjastojen luokitusjärjestelmä
narrower: Kurmandžinkielinen kertomakirjallisuus
narrower: Soraninkielinen kertomakirjallisuus
notation: 84.832
preferred label: Narrative literature in Kurdish @en
preferred label: Prosa på kurdiska @sv

Kurmandžinkielinen kertomakirjallisuus
type: Concept
type: YKL-luokka
alternative label: Kurmandžin kieli, kertomakirjallisuus (84.8321)
alternative label: Kurmanji, epik (84.8321) @sv
broader: Kurdinkielinen kertomakirjallisuus
in scheme: YKL - Yleisten kirjastojen luokitusjärjestelmä
notation: 84.8321
preferred label: Narrative literature in Kurmanji language @en
preferred label: Prosa på kurmanji @sv

Soraninkielinen kertomakirjallisuus
type: Concept
type: YKL-luokka
alternative label: Sorani, epik (84.8322) @sv
alternative label: Soranin kieli, kertomakirjallisuus (84.8322)
broader: Kurdinkielinen kertomakirjallisuus
in scheme: YKL - Yleisten kirjastojen luokitusjärjestelmä
notation: 84.8322
preferred label: Narrative literature in Sorani language @en
preferred label: Prosa på sorani @sv

Paštunkielinen kertomakirjallisuus
type: Concept
type: YKL-luokka
alternative label: Pashto, epik (84.833) @sv
alternative label: Paštun kieli, kertomakirjallisuus (84.833)
broader: Indoiraanisilla kielillä julkaistu kertomakirjallisuus
in scheme: YKL - Yleisten kirjastojen luokitusjärjestelmä
notation: 84.833
preferred label: Narrative literature in Pushto language @en
preferred label: Prosa på pashto @sv

Indoarjalaisilla kielillä julkaistu kertomakirjallisuus
type: Concept
type: YKL-luokka
broader: Indoiraanisilla kielillä julkaistu kertomakirjallisuus
in scheme: YKL - Yleisten kirjastojen luokitusjärjestelmä
narrower: Bengalinkielinen kertomakirjallisuus
narrower: Gudžaratinkielinen kertomakirjallisuus
narrower: Hindinkielinen kertomakirjallisuus
narrower: Pandzabinkielinen kertomakirjallisuus
narrower: Romanikielinen kertomakirjallisuus
narrower: Urdunkielinen kertomakirjallisuus
narrower: Nepalinkielinen kertomakirjallisuus
narrower: Sinhalankielinen kertomakirjallisuus
notation: 84.836
preferred label: Narrative literature in Indo-Aryan languages @en
preferred label: Prosa på indoariska spåk @sv

Bengalinkielinen kertomakirjallisuus
type: Concept
type: YKL-luokka
alternative label: Bengali, epik (84.8361) @sv
alternative label: Bengalin kieli, kertomakirjallisuus (84.8361)
broader: Indoarjalaisilla kielillä julkaistu kertomakirjallisuus
in scheme: YKL - Yleisten kirjastojen luokitusjärjestelmä
notation: 84.8361
preferred label: Narrative literature in Bengali language @en
preferred label: Prosa på bengali @sv

Gudžaratinkielinen kertomakirjallisuus
type: Concept
type: YKL-luokka
alternative label: Gudžaratin kieli, kertomakirjallisuus (84.8362)
alternative label: Gujarati, epik (84.8362) @sv
broader: Indoarjalaisilla kielillä julkaistu kertomakirjallisuus
in scheme: YKL - Yleisten kirjastojen luokitusjärjestelmä
notation: 84.8362
preferred label: Narrative literature in Gujarati language @en
preferred label: Prosa på gujarati @sv

Hindinkielinen kertomakirjallisuus
type: Concept
type: YKL-luokka
alternative label: Hindi, epik (84.8363) @sv
alternative label: Hindin kieli, kertomakirjallisuus (84.8363)
broader: Indoarjalaisilla kielillä julkaistu kertomakirjallisuus
in scheme: YKL - Yleisten kirjastojen luokitusjärjestelmä
notation: 84.8363
preferred label: Narrative literature in Hindi language @en
preferred label: Prosa på hindi @sv

Pandzabinkielinen kertomakirjallisuus
type: Concept
type: YKL-luokka
alternative label: Pandzabin kieli, kertomakirjallisuus (84.8364)
alternative label: Panjabi, epik (84.8364) @sv
broader: Indoarjalaisilla kielillä julkaistu kertomakirjallisuus
in scheme: YKL - Yleisten kirjastojen luokitusjärjestelmä
notation: 84.8364
preferred label: Narrative literature in Punjabi language @en
preferred label: Prosa på panjabi @sv

Romanikielinen kertomakirjallisuus
type: Concept
type: YKL-luokka
alternative label: Romani, epik (84.8365) @sv
alternative label: Romanikieli, kertomakirjallisuus (84.8365)
broader: Indoarjalaisilla kielillä julkaistu kertomakirjallisuus
in scheme: YKL - Yleisten kirjastojen luokitusjärjestelmä
notation: 84.8365
preferred label: Narrative literature in Romani language @en
preferred label: Prosa på romani @sv

Urdunkielinen kertomakirjallisuus
type: Concept
type: YKL-luokka
alternative label: Urdu, epik (84.8366) @sv
alternative label: Urdun kieli, kertomakirjallisuus (84.8366)
broader: Indoarjalaisilla kielillä julkaistu kertomakirjallisuus
in scheme: YKL - Yleisten kirjastojen luokitusjärjestelmä
notation: 84.8366
preferred label: Narrative literature in Urdu language @en
preferred label: Prosa på urdu @sv

Nepalinkielinen kertomakirjallisuus
type: Concept
type: YKL-luokka
alternative label: Nepali, epik (84.8367) @sv
alternative label: Nepalin kieli, kertomakirjallisuus (84.8367)
broader: Indoarjalaisilla kielillä julkaistu kertomakirjallisuus
in scheme: YKL - Yleisten kirjastojen luokitusjärjestelmä
notation: 84.8367
preferred label: Narrative literature in Nepali language @en
preferred label: Prosa på nepali @sv

Sinhalankielinen kertomakirjallisuus
type: Concept
type: YKL-luokka
alternative label: Singalesiska, epik (84.8368) @sv
alternative label: Sinhalan kieli, kertomakirjallisuus (84.8368)
broader: Indoarjalaisilla kielillä julkaistu kertomakirjallisuus
in scheme: YKL - Yleisten kirjastojen luokitusjärjestelmä
notation: 84.8368
preferred label: Narrative literature in Sinhalese language @en
preferred label: Prosa på singalesiska @sv

Albaniankielinen kertomakirjallisuus
type: Concept
type: YKL-luokka
alternative label: Albanian kieli, kertomakirjallisuus (84.84)
alternative label: Albaniankielinen kaunokirjallisuus, kertomakirjallisuus (84.84)
alternative label: Albansk skönlitteratur, epik (84.84) @sv
alternative label: Albanska, epik (84.84) @sv
broader: Muilla indoeurooppalaisilla kielillä julkaistu kertomakirjallisuus
in scheme: YKL - Yleisten kirjastojen luokitusjärjestelmä
notation: 84.84
preferred label: Narrative literature in Albanian @en
preferred label: Prosa på albanska @sv

Armeniankielinen kertomakirjallisuus
type: Concept
type: YKL-luokka
alternative label: Armenian kieli, kertomakirjallisuus (84.85)
alternative label: Armeniska, epik (84.85) @sv
broader: Muilla indoeurooppalaisilla kielillä julkaistu kertomakirjallisuus
in scheme: YKL - Yleisten kirjastojen luokitusjärjestelmä
notation: 84.85
preferred label: Narrative literature in Armenian language @en
preferred label: Prosa på armeniska @sv

Kelttiläisillä kielillä julkaistu kertomakirjallisuus
type: Concept
type: YKL-luokka
broader: Muilla indoeurooppalaisilla kielillä julkaistu kertomakirjallisuus
in scheme: YKL - Yleisten kirjastojen luokitusjärjestelmä
notation: 84.88
preferred label: Narrative literature in Celtic languages @en
preferred label: Prosa på keltiska språk @sv

Muilla kielillä julkaistu kertomakirjallisuus
type: Concept
type: YKL-luokka
broader: KERTOMAKIRJALLISUUS
in scheme: YKL - Yleisten kirjastojen luokitusjärjestelmä
narrower: Turkkilaisilla kielillä julkaistu kertomakirjallisuus
narrower: Afroaasialaisilla kielillä julkaistu kertomakirjallisuus
narrower: Sinotiibetiläisillä ja austroaasialaisilla kielillä julkaistu kertomakirjallisuus
narrower: Japanin- ja koreankielinen kertomakirjallisuus
narrower: Afrikkalaisilla kielillä julkaistu kertomakirjallisuus
narrower: Kaukasialaisilla kielillä julkaistu kertomakirjallisuus
narrower: Eskimo- ja intiaanikielillä julkaistu kertomakirjallisuus
narrower: Muilla ei-indoeurooppalaisilla kielillä julkaistu kertomakirjallisuus
notation: 84.9
preferred label: Narrative literature in other languages @en
preferred label: Prosa på övriga språk @sv

Turkkilaisilla kielillä julkaistu kertomakirjallisuus
type: Concept
type: YKL-luokka
broader: Muilla kielillä julkaistu kertomakirjallisuus
in scheme: YKL - Yleisten kirjastojen luokitusjärjestelmä
narrower: Turkinkielinen kertomakirjallisuus
narrower: Azerinkielinen kertomakirjallisuus
narrower: Turkmeeninkielinen kertomakirjallisuus
narrower: Uiguurinkielinen kertomakirjallisuus
narrower: Uzbekinkielinen kertomakirjallisuus
notation: 84.91
preferred label: Narrative literature in Turkic languages @en
preferred label: Prosa på turkiska spåk @sv

Turkinkielinen kertomakirjallisuus
type: Concept
type: YKL-luokka
alternative label: Turkin kieli, kertomakirjallisuus (84.911)
alternative label: Turkiska, epik (84.911) @sv
broader: Turkkilaisilla kielillä julkaistu kertomakirjallisuus
in scheme: YKL - Yleisten kirjastojen luokitusjärjestelmä
notation: 84.911
preferred label: Narrative literature in Turkish @en
preferred label: Prosa på turkiska @sv

Azerinkielinen kertomakirjallisuus
type: Concept
type: YKL-luokka
alternative label: Azerbajdzjanska, epik (84.912) @sv
alternative label: Azerin kieli, kertomakirjallisuus (84.912)
broader: Turkkilaisilla kielillä julkaistu kertomakirjallisuus
in scheme: YKL - Yleisten kirjastojen luokitusjärjestelmä
notation: 84.912
preferred label: Narrative literature in Azerbaijani language @en
preferred label: Prosa på azerbajdzjanska @sv

Turkmeeninkielinen kertomakirjallisuus
type: Concept
type: YKL-luokka
alternative label: Turkmeenin kieli, kertomakirjallisuus (84.913)
alternative label: Turkmeniska, epik (84.913) @sv
broader: Turkkilaisilla kielillä julkaistu kertomakirjallisuus
in scheme: YKL - Yleisten kirjastojen luokitusjärjestelmä
notation: 84.913
preferred label: Narrative literature in Turkmen language @en
preferred label: Prosa på turkmeniska @sv

Uiguurinkielinen kertomakirjallisuus
type: Concept
type: YKL-luokka
alternative label: Uiguriska, epik (84.914) @sv
alternative label: Uiguurin kieli, kertomakirjallisuus (84.914)
broader: Turkkilaisilla kielillä julkaistu kertomakirjallisuus
in scheme: YKL - Yleisten kirjastojen luokitusjärjestelmä
notation: 84.914
preferred label: Narrative literature in Uighur language @en
preferred label: Prosa på uiguriska @sv

Uzbekinkielinen kertomakirjallisuus
type: Concept
type: YKL-luokka
alternative label: Uzbekin kieli, kertomakirjallisuus (84.915)
alternative label: Uzbekiska, epik (84.915) @sv
broader: Turkkilaisilla kielillä julkaistu kertomakirjallisuus
in scheme: YKL - Yleisten kirjastojen luokitusjärjestelmä
notation: 84.915
preferred label: Narrative literature in Uzbek language @en
preferred label: Prosa på uzbekiska @sv

Afroaasialaisilla kielillä julkaistu kertomakirjallisuus
type: Concept
type: YKL-luokka
broader: Muilla kielillä julkaistu kertomakirjallisuus
in scheme: YKL - Yleisten kirjastojen luokitusjärjestelmä
narrower: Hepreankielinen kertomakirjallisuus
narrower: Arabiankielinen kertomakirjallisuus
narrower: Amharankielinen kertomakirjallisuus
narrower: Tigrinjankielinen kertomakirjallisuus
narrower: Somalinkielinen kertomakirjallisuus
notation: 84.92
preferred label: Narrative literature in Afroasiatic languages @en
preferred label: Prosa på afroasiatiska @sv

Hepreankielinen kertomakirjallisuus
type: Concept
type: YKL-luokka
alternative label: Hebreisk skönlitteratur, epik (84.922) @sv
alternative label: Hebreiska, epik (84.922) @sv
alternative label: Heprean kieli, kertomakirjallisuus (84.922)
alternative label: Hepreankielinen kaunokirjallisuus, kertomakirjallisuus (84.922)
broader: Afroaasialaisilla kielillä julkaistu kertomakirjallisuus
in scheme: YKL - Yleisten kirjastojen luokitusjärjestelmä
notation: 84.922
preferred label: Narrative literature in Hebrew @en
preferred label: Prosa på hebreiska @sv

Arabiankielinen kertomakirjallisuus
type: Concept
type: YKL-luokka
alternative label: Arabian kieli, kertomakirjallisuus (84.923)
alternative label: Arabiankielinen kaunokirjallisuus, kertomakirjallisuus (84.923)
alternative label: Arabisk skönlitteratur, epik (84.923) @sv
alternative label: Arabiska, epik (84.923) @sv
broader: Afroaasialaisilla kielillä julkaistu kertomakirjallisuus
in scheme: YKL - Yleisten kirjastojen luokitusjärjestelmä
notation: 84.923
preferred label: Narrative literature in Arabic @en
preferred label: Prosa på arabiska @sv

Amharankielinen kertomakirjallisuus
type: Concept
type: YKL-luokka
alternative label: Amharan kieli, kertomakirjallisuus (84.924)
alternative label: Amhariska, epik (84.924) @sv
broader: Afroaasialaisilla kielillä julkaistu kertomakirjallisuus
in scheme: YKL - Yleisten kirjastojen luokitusjärjestelmä
notation: 84.924
preferred label: Narrative literature in Amharic language @en
preferred label: Prosa på amhariska @sv

Tigrinjankielinen kertomakirjallisuus
type: Concept
type: YKL-luokka
alternative label: Tigrinja, epik (84.925) @sv
alternative label: Tigrinjan kieli, kertomakirjallisuus (84.925)
broader: Afroaasialaisilla kielillä julkaistu kertomakirjallisuus
in scheme: YKL - Yleisten kirjastojen luokitusjärjestelmä
notation: 84.925
preferred label: Narrative literature in Tigrinya language @en
preferred label: Prosa på tigrinja @sv

Somalinkielinen kertomakirjallisuus
type: Concept
type: YKL-luokka
alternative label: Somalin kieli, kertomakirjallisuus (84.926)
alternative label: Somaliska, epik (84.926) @sv
broader: Afroaasialaisilla kielillä julkaistu kertomakirjallisuus
in scheme: YKL - Yleisten kirjastojen luokitusjärjestelmä
notation: 84.926
preferred label: Narrative literature in Somali language @en
preferred label: Prosa på somaliska @sv

Sinotiibetiläisillä ja austroaasialaisilla kielillä julkaistu kertomakirjallisuus
type: Concept
type: YKL-luokka
broader: Muilla kielillä julkaistu kertomakirjallisuus
in scheme: YKL - Yleisten kirjastojen luokitusjärjestelmä
narrower: Kiinankielinen kertomakirjallisuus
narrower: Burmankielinen kertomakirjallisuus
narrower: Kareninkielinen kertomakirjallisuus
narrower: Thainkielinen kertomakirjallisuus
narrower: Vietnaminkielinen kertomakirjallisuus
narrower: Khmerinkielinen kertomakirjallisuus
notation: 84.94
preferred label: Narrative literature in Sino-Tibetan and Austroasiatic languages @en
preferred label: Prosa på sinotibetanska och austroasiatiska språk @sv

Kiinankielinen kertomakirjallisuus
type: Concept
type: YKL-luokka
alternative label: Kiinan kieli, kertomakirjallisuus (84.943)
alternative label: Kiinankielinen kaunokirjallisuus, kertomakirjallisuus (84.943)
alternative label: Kinesisk skönlitteratur, epik (84.943) @sv
alternative label: Kinesiska, epik (84.943) @sv
broader: Sinotiibetiläisillä ja austroaasialaisilla kielillä julkaistu kertomakirjallisuus
in scheme: YKL - Yleisten kirjastojen luokitusjärjestelmä
notation: 84.943
preferred label: Narrative literature in Chinese @en
preferred label: Prosa på kinesiska @sv

Burmankielinen kertomakirjallisuus
type: Concept
type: YKL-luokka
alternative label: Burman kieli, kertomakirjallisuus (84.944)
alternative label: Burmesiska, epik (84.944) @sv
broader: Sinotiibetiläisillä ja austroaasialaisilla kielillä julkaistu kertomakirjallisuus
in scheme: YKL - Yleisten kirjastojen luokitusjärjestelmä
notation: 84.944
preferred label: Narrative literature in Burmese language @en
preferred label: Prosa på burmesiska @sv

Kareninkielinen kertomakirjallisuus
type: Concept
type: YKL-luokka
alternative label: Karenin kieli, kertomakirjallisuus (84.945)
alternative label: Karenska, epik (84.945) @sv
broader: Sinotiibetiläisillä ja austroaasialaisilla kielillä julkaistu kertomakirjallisuus
in scheme: YKL - Yleisten kirjastojen luokitusjärjestelmä
notation: 84.945
preferred label: Narrative literature in Karen languages @en
preferred label: Prosa på karenska @sv

Thainkielinen kertomakirjallisuus
type: Concept
type: YKL-luokka
alternative label: Thai, epik (84.946) @sv
alternative label: Thailändsk skönlitteratur, epik (84.946) @sv
alternative label: Thain kieli, kertomakirjallisuus (84.946)
alternative label: Thainkielinen kaunokirjallisuus, kertomakirjallisuus (84.946)
broader: Sinotiibetiläisillä ja austroaasialaisilla kielillä julkaistu kertomakirjallisuus
in scheme: YKL - Yleisten kirjastojen luokitusjärjestelmä
notation: 84.946
preferred label: Narrative literature in Thai @en
preferred label: Prosa på thailändska @sv

Vietnaminkielinen kertomakirjallisuus
type: Concept
type: YKL-luokka
alternative label: Vietnamesisk skönlitteratur, epik (84.948) @sv
alternative label: Vietnamesiska, epik (84.948) @sv
alternative label: Vietnamin kieli, kertomakirjallisuus (84.948)
alternative label: Vietnaminkielinen kaunokirjallisuus, kertomakirjallisuus (84.948)
broader: Sinotiibetiläisillä ja austroaasialaisilla kielillä julkaistu kertomakirjallisuus
in scheme: YKL - Yleisten kirjastojen luokitusjärjestelmä
notation: 84.948
preferred label: Narrative literature in Vietnamese @en
preferred label: Prosa på vietnamesiska @sv

Khmerinkielinen kertomakirjallisuus
type: Concept
type: YKL-luokka
alternative label: Khmer, epik (84.949) @sv
alternative label: Khmerin kieli, kertomakirjallisuus (84.949)
broader: Sinotiibetiläisillä ja austroaasialaisilla kielillä julkaistu kertomakirjallisuus
in scheme: YKL - Yleisten kirjastojen luokitusjärjestelmä
notation: 84.949
preferred label: Narrative literature in Khmer language @en
preferred label: Prosa på khmer @sv

Japanin- ja koreankielinen kertomakirjallisuus
type: Concept
type: YKL-luokka
broader: Muilla kielillä julkaistu kertomakirjallisuus
in scheme: YKL - Yleisten kirjastojen luokitusjärjestelmä
narrower: Japaninkielinen kertomakirjallisuus
narrower: Koreankielinen kertomakirjallisuus
notation: 84.95
preferred label: Narrative literature in Japanese. Narrative literature in Korean @en
preferred label: Prosa på japanska. Prosa på koreanska @sv

Japaninkielinen kertomakirjallisuus
type: Concept
type: YKL-luokka
alternative label: Japanin kieli, kertomakirjallisuus (84.951)
alternative label: Japaninkielinen kaunokirjallisuus, kertomakirjallisuus (84.951)
alternative label: Japansk skönlitteratur, epik (84.951) @sv
alternative label: Japanska, epik (84.951) @sv
broader: Japanin- ja koreankielinen kertomakirjallisuus
in scheme: YKL - Yleisten kirjastojen luokitusjärjestelmä
notation: 84.951
preferred label: Narrative literature in Japanese @en
preferred label: Prosa på japanska @sv

Koreankielinen kertomakirjallisuus
type: Concept
type: YKL-luokka
alternative label: Korean kieli, kertomakirjallisuus (84.955)
alternative label: Koreankielinen kaunokirjallisuus, kertomakirjallisuus (84.955)
alternative label: Koreansk skönlitteratur, epik (84.955) @sv
alternative label: Koreanska, epik (84.955) @sv
broader: Japanin- ja koreankielinen kertomakirjallisuus
in scheme: YKL - Yleisten kirjastojen luokitusjärjestelmä
notation: 84.955
preferred label: Narrative literature in Korean @en
preferred label: Prosa på koreanska @sv

Afrikkalaisilla kielillä julkaistu kertomakirjallisuus
type: Concept
type: YKL-luokka
broader: Muilla kielillä julkaistu kertomakirjallisuus
in scheme: YKL - Yleisten kirjastojen luokitusjärjestelmä
narrower: Swahilinkielinen kertomakirjallisuus
narrower: Lingalankielinen kertomakirjallisuus
notation: 84.96
preferred label: Narrative literature in African languages @en
preferred label: Prosa på afrikanska språk @sv
scope note: Hit prosa på afrikanska språk som talas söder om Sahara, Etiopien och Somalia @sv
scope note: Tähän Saharan, Etiopian ja Somalian eteläpuolella puhutuilla afrikkalaisilla kielillä julkaistu kertomakirjallisuus

Swahilinkielinen kertomakirjallisuus
type: Concept
type: YKL-luokka
alternative label: Swahili, epik (84.961) @sv
alternative label: Swahilin kieli, kertomakirjallisuus (84.961)
broader: Afrikkalaisilla kielillä julkaistu kertomakirjallisuus
in scheme: YKL - Yleisten kirjastojen luokitusjärjestelmä
notation: 84.961
preferred label: Narrative literature in Swahili language @en
preferred label: Prosa på swahili @sv

Lingalankielinen kertomakirjallisuus
type: Concept
type: YKL-luokka
alternative label: Lingala, epik (84.962) @sv
alternative label: Lingalan kieli, kertomakirjallisuus (84.962)
broader: Afrikkalaisilla kielillä julkaistu kertomakirjallisuus
in scheme: YKL - Yleisten kirjastojen luokitusjärjestelmä
notation: 84.962
preferred label: Narrative literature in Lingala language @en
preferred label: Prosa på lingala @sv

Kaukasialaisilla kielillä julkaistu kertomakirjallisuus
type: Concept
type: YKL-luokka
broader: Muilla kielillä julkaistu kertomakirjallisuus
in scheme: YKL - Yleisten kirjastojen luokitusjärjestelmä
narrower: Georgiankielinen kertomakirjallisuus
narrower: Abhaasin, kabardin ja adygenkielinen kertomakirjallisuus
narrower: Tšetšeeninkielinen kertomakirjallisuus
notation: 84.97
preferred label: Narrative literature in Caucasian languages @en
preferred label: Prosa på kaukasiska spåk @sv

Georgiankielinen kertomakirjallisuus
type: Concept
type: YKL-luokka
alternative label: Georgian kieli, kertomakirjallisuus (84.971)
alternative label: Georgiska, epik (84.971) @sv
broader: Kaukasialaisilla kielillä julkaistu kertomakirjallisuus
in scheme: YKL - Yleisten kirjastojen luokitusjärjestelmä
notation: 84.971
preferred label: Narrative literature in Georgian language @en
preferred label: Prosa på georgiska @sv

Abhaasin, kabardin ja adygenkielinen kertomakirjallisuus
type: Concept
type: YKL-luokka
alternative label: Abchaziska, epik (84.972) @sv
alternative label: Abhaasin kieli, kertomakirjallisuus (84.972)
alternative label: Adygeiska, epik (84.972) @sv
alternative label: Adygen kieli, kertomakirjallisuus (84.972)
alternative label: Kabardin kieli, kertomakirjallisuus (84.972)
alternative label: Kabardinska, epik (84.972) @sv
broader: Kaukasialaisilla kielillä julkaistu kertomakirjallisuus
in scheme: YKL - Yleisten kirjastojen luokitusjärjestelmä
notation: 84.972
preferred label: Narrative literature in Abkhaz, Kabardian and Adyghe languages @en
preferred label: Prosa på abchaziska, kabardinska och adygeiska @sv

Tšetšeeninkielinen kertomakirjallisuus
type: Concept
type: YKL-luokka
alternative label: Tjetjenska, epik (84.973) @sv
alternative label: Tšetšeenin kieli, kertomakirjallisuus (84.973)
broader: Kaukasialaisilla kielillä julkaistu kertomakirjallisuus
in scheme: YKL - Yleisten kirjastojen luokitusjärjestelmä
notation: 84.973
preferred label: Narrative literature in Chechen language @en
preferred label: Prosa på tjetjenska @sv

Eskimo- ja intiaanikielillä julkaistu kertomakirjallisuus
type: Concept
type: YKL-luokka
broader: Muilla kielillä julkaistu kertomakirjallisuus
in scheme: YKL - Yleisten kirjastojen luokitusjärjestelmä
narrower: Grönlanninkielinen kertomakirjallisuus
notation: 84.98
preferred label: Narrative literature in Eskimo and Indian languages @en
preferred label: Prosa på eskimå- och indianspråk @sv

Grönlanninkielinen kertomakirjallisuus
type: Concept
type: YKL-luokka
alternative label: Grönlannin kieli, kertomakirjallisuus (84.981)
alternative label: Grönländska, epik (84.981) @sv
broader: Eskimo- ja intiaanikielillä julkaistu kertomakirjallisuus
in scheme: YKL - Yleisten kirjastojen luokitusjärjestelmä
notation: 84.981
preferred label: Narrative literature in Greenlandic language @en
preferred label: Prosa på grönländska @sv

Muilla ei-indoeurooppalaisilla kielillä julkaistu kertomakirjallisuus
type: Concept
type: YKL-luokka
alternative label: Mongolin kieli, kertomakirjallisuus (84.99)
alternative label: Mongoliska, epik (84.99) @sv
broader: Muilla kielillä julkaistu kertomakirjallisuus
in scheme: YKL - Yleisten kirjastojen luokitusjärjestelmä
narrower: Keinotekoisilla kielillä julkaistu kertomakirjallisuus
narrower: Baskinkielinen kertomakirjallisuus
narrower: Dravidakielinen kertomakirjallisuus
narrower: Austronesialaisilla kielillä julkaistu kertomakirjallisuus
notation: 84.99
preferred label: Narrative literature in other Non-Indoeuropean languages @en
preferred label: Prosa på övriga icke-indoeuropeiska språk @sv

Keinotekoisilla kielillä julkaistu kertomakirjallisuus
type: Concept
type: YKL-luokka
broader: Muilla ei-indoeurooppalaisilla kielillä julkaistu kertomakirjallisuus
in scheme: YKL - Yleisten kirjastojen luokitusjärjestelmä
notation: 84.991
preferred label: Narrative literature in artificial languages @en
preferred label: Prosa på artificiella språk @sv

Baskinkielinen kertomakirjallisuus
type: Concept
type: YKL-luokka
alternative label: Baskin kieli, kertomakirjallisuus (84.992)
alternative label: Baskiska, epik (84.992) @sv
broader: Muilla ei-indoeurooppalaisilla kielillä julkaistu kertomakirjallisuus
in scheme: YKL - Yleisten kirjastojen luokitusjärjestelmä
notation: 84.992
preferred label: Narrative literature in Basque language @en
preferred label: Prosa på baskiska @sv

Dravidakielinen kertomakirjallisuus
type: Concept
type: YKL-luokka
broader: Muilla ei-indoeurooppalaisilla kielillä julkaistu kertomakirjallisuus
in scheme: YKL - Yleisten kirjastojen luokitusjärjestelmä
narrower: Malajalaminkielinen kertomakirjallisuus
narrower: Kannadankielinen kertomakirjallisuus
narrower: Tamilinkielinen kertomakirjallisuus
narrower: Telugunkielinen kertomakirjallisuus
notation: 84.994
preferred label: Narrative literature in Dravidian languages @en
preferred label: Prosa på dravidiska @sv

Malajalaminkielinen kertomakirjallisuus
type: Concept
type: YKL-luokka
alternative label: Malajalamin kieli, kertomakirjallisuus (84.9941)
alternative label: Malayalam, epik (84.9941) @sv
broader: Dravidakielinen kertomakirjallisuus
in scheme: YKL - Yleisten kirjastojen luokitusjärjestelmä
notation: 84.9941
preferred label: Narrative literature in Malayalam language @en
preferred label: Prosa på malayalam @sv

Kannadankielinen kertomakirjallisuus
type: Concept
type: YKL-luokka
alternative label: Kannada, epik (84.9942) @sv
alternative label: Kannadan kieli, kertomakirjallisuus (84.9942)
broader: Dravidakielinen kertomakirjallisuus
in scheme: YKL - Yleisten kirjastojen luokitusjärjestelmä
notation: 84.9942
preferred label: Narrative literature in Kannada language @en
preferred label: Prosa på kannada @sv

Tamilinkielinen kertomakirjallisuus
type: Concept
type: YKL-luokka
alternative label: Tamil, epik (84.9943) @sv
alternative label: Tamilin kieli, kertomakirjallisuus (84.9943)
broader: Dravidakielinen kertomakirjallisuus
in scheme: YKL - Yleisten kirjastojen luokitusjärjestelmä
notation: 84.9943
preferred label: Narrative literature in Tamil language @en
preferred label: Prosa på tamil @sv

Telugunkielinen kertomakirjallisuus
type: Concept
type: YKL-luokka
alternative label: Telugu, epik (84.9944) @sv
alternative label: Telugun kieli, kertomakirjallisuus (84.9944)
broader: Dravidakielinen kertomakirjallisuus
in scheme: YKL - Yleisten kirjastojen luokitusjärjestelmä
notation: 84.9944
preferred label: Narrative literature in Telugu language @en
preferred label: Prosa på telugu @sv

Austronesialaisilla kielillä julkaistu kertomakirjallisuus
type: Concept
type: YKL-luokka
broader: Muilla ei-indoeurooppalaisilla kielillä julkaistu kertomakirjallisuus
in scheme: YKL - Yleisten kirjastojen luokitusjärjestelmä
narrower: Tagaloginkielinen kertomakirjallisuus
narrower: Malaijinkielinen kertomakirjallisuus
narrower: Indonesiankielinen kertomakirjallisuus
notation: 84.995
preferred label: Narrative literature in Austronesian languages @en
preferred label: Prosa på austronesiska @sv

Tagaloginkielinen kertomakirjallisuus
type: Concept
type: YKL-luokka
alternative label: Tagalog, epik (84.9951) @sv
alternative label: Tagalogin kieli, kertomakirjallisuus (84.9951)
broader: Austronesialaisilla kielillä julkaistu kertomakirjallisuus
in scheme: YKL - Yleisten kirjastojen luokitusjärjestelmä
notation: 84.9951
preferred label: Narrative literature in Tagalog language @en
preferred label: Prosa på tagalog @sv

Malaijinkielinen kertomakirjallisuus
type: Concept
type: YKL-luokka
alternative label: Malaijin kieli, kertomakirjallisuus (84.9952)
alternative label: Malajiska, epik (84.9952) @sv
broader: Austronesialaisilla kielillä julkaistu kertomakirjallisuus
in scheme: YKL - Yleisten kirjastojen luokitusjärjestelmä
notation: 84.9952
preferred label: Narrative literature in Malay language @en
preferred label: Prosa på malajiska @sv

Indonesiankielinen kertomakirjallisuus
type: Concept
type: YKL-luokka
alternative label: Indonesian kieli, kertomakirjallisuus (84.9953)
alternative label: Indonesiska, epik (84.9953) @sv
broader: Austronesialaisilla kielillä julkaistu kertomakirjallisuus
in scheme: YKL - Yleisten kirjastojen luokitusjärjestelmä
notation: 84.9953
preferred label: Narrative literature in Indonesian language @en
preferred label: Prosa på indonesiska @sv

SADUT. KUVAKIRJAT. SARJAKUVAT
type: Concept
References: KERTOMAKIRJALLISUUS
References: Lasten- ja nuortenkirjallisuuden historia ja tutkimus
type: YKL-luokka
alternative label: Anagram, skönlitteratur (80 ... 85+) @sv
alternative label: Anagrammit, kaunokirjallisuus (80 ... 85+)
alternative label: Animaatioelokuvat, tallenteet, fiktiiviset (80 ... 85+)
alternative label: Animationsfilmer, inspelningar, fiktiva (80 ... 85+) @sv
alternative label: Antologiat, kaunokirjallisuus (80 ... 85+)
alternative label: Antologier, skönlitteratur (80 ... 85+) @sv
alternative label: Barnfilmer, animationsfilmer, fiktiva, inspelningar (80 ... 85+) @sv
alternative label: Barnlitteratur, skönlitteratur (80 ... 85+) @sv
alternative label: Dataprogram, skönlitteratur (80 ... 85+) @sv
alternative label: Dialektlitteratur, skönlitteratur (80 ... 85+) @sv
alternative label: Dockfilmer, fiktiva (80 ... 85+) @sv
alternative label: Elokuvat, animaatioelokuvat, fiktiiviset, tallenteet (80 ... 85+)
alternative label: Fantasiaelokuvat, animaatioelokuvat, tallenteet (80 ... 85+)
alternative label: Fantasyfilmer, animationsfilmer, inspelningar (80 ... 85+) @sv
alternative label: Filmer, animationsfilmer, fiktiva, inspelningar (80 ... 85+) @sv
alternative label: Kaunokirjallisuus (80 ... 85+)
alternative label: Kirjalliset äänitteet, kaunokirjallisuus (80 ... 85+)
alternative label: Kirjallisuusäänitteet, kaunokirjallisuus (80 ... 85+)
alternative label: Kokoomateokset, kaunokirjallisuus (80 ... 85+)
alternative label: Konst, litteratur (80 ... 86+) @sv
alternative label: Konstformer, litteratur (80 ... 86+) @sv
alternative label: Kootut teokset, kaunokirjallisuus (80 ... 85+)
alternative label: Krestomatier, skönlitteratur (80 ... 85+) @sv
alternative label: Lastenelokuvat, animaatioelokuvat, fiktiiviset, tallenteet (80 ... 85+)
alternative label: Lastenkirjallisuus, kaunokirjallisuus (80 ... 85+)
alternative label: Litteraturinspelningar, skönlitteratur (80 ... 85+) @sv
alternative label: Litterära ljudupptagningar, skönlitteratur (80 ... 85+) @sv
alternative label: Ljudupptagningar, skönlitteratur (80 ... 85+) @sv
alternative label: Lukemistot, kaunokirjallisuus (80 ... 85+)
alternative label: Lukukirjat, kaunokirjallisuus (80 ... 85+)
alternative label: Läseböcker, skönlitteratur (80 ... 85+) @sv
alternative label: Murrekirjallisuus, kaunokirjallisuus (80 ... 85+)
alternative label: Musiikkielokuvat, animaatioelokuvat, fiktiiviset, tallenteet (80 ... 85+)
alternative label: Musikfilmer, animationsfilmer, fiktiva, inspelningar (80 ... 85+) @sv
alternative label: Nukke-elokuvat, fiktiiviset (80 ... 85+)
alternative label: Nuortenelokuvat, animaatioelokuvat, fiktiiviset, tallenteet (80 ... 85+)
alternative label: Nuortenkirjallisuus, kaunokirjallisuus (80 ... 85+)
alternative label: Ohjelmistot, kaunokirjallisuus (80 ... 85+)
alternative label: Ordlekar, skönlitteratur (80 ... 85+) @sv
alternative label: Palindromer, skönlitteratur (80 ... 85+) @sv
alternative label: Palindromit, kaunokirjallisuus (80 ... 85+)
alternative label: Piirretyt elokuvat, fiktiiviset (80 ... 85+)
alternative label: Samlade verk, skönlitteratur (80 ... 85+) @sv
alternative label: Samlingsverk, skönlitteratur (80 ... 85+) @sv
alternative label: Sanaleikit, kaunokirjallisuus (80 ... 85+)
alternative label: Skönlitteratur (80 ... 85+) @sv
alternative label: TV-program, inspelningar, fiktiva filmer och serier (80 ... 85+) @sv
alternative label: Taide, kirjallisuus (80 ... 86+)
alternative label: Taidemuodot, kirjallisuus (80 ... 86+)
alternative label: Taiteet, kirjallisuus (80 ... 86+)
alternative label: Talböcker, skönlitteratur (80 ... 85+) @sv
alternative label: Tecknade filmer, fiktiva (80 ... 85+) @sv
alternative label: Televisio-ohjelmat, tallenteet, fiktiiviset elokuvat ja sarjat (80 ... 85+)
alternative label: Ungdomsfilmer, animationsfilmer, fiktiva, inspelningar (80 ... 85+) @sv
alternative label: Ungdomslitteratur, skönlitteratur (80 ... 85+) @sv
alternative label: Valda verk, skönlitteratur (80 ... 85+) @sv
alternative label: Valitut teokset, kaunokirjallisuus (80 ... 85+)
alternative label: Äänikirjat, kaunokirjallisuus (80 ... 85+)
alternative label: Äänitteet, kaunokirjallisuus (80 ... 85+)
broader: KAUNOKIRJALLISUUS. KIRJALLISUUSTIEDE. KIELITIEDE
in scheme: YKL - Yleisten kirjastojen luokitusjärjestelmä
narrower: SADUT
narrower: KUVAKIRJAT
narrower: SARJAKUVAT
notation: 85
preferred label: FAIRY TALES. PICTURE BOOKS. COMICS @en
preferred label: SAGOR. BILDERBÖCKER. TECKNADE SERIER @sv
scope note: Hit och till underklasserna sagor, bilderböcker och tecknade serier för vuxna eller barn Formtilläggen 01, 02, 03+, 06+, 07, 08+ och 09 används inte i samband med klasserna 80-85+ @sv
scope note: Tähän ja alaluokkiin aikuisille tai lapsille tarkoitetut sadut, kuvakirjat ja sarjakuvat Muotoluokkia 01, 02, 03+, 06+, 07, 08+ ja 09 ei käytetä luokkien 80-85+ yhteydessä

SADUT
type: Concept
References: Kansansadut. Kansantarinat
References: KERTOMAKIRJALLISUUS
References: KUVAKIRJAT
References: SARJAKUVAT
References: Lasten- ja nuortenkirjallisuuden historia ja tutkimus
type: YKL-luokka
alternative label: Folksagor, bearbetade för barn (85.1+) @sv
alternative label: Kansansadut, lapsille muokatut (85.1+)
alternative label: Sadut (85.1+)
alternative label: Sagofilmer (85.1+) @sv
alternative label: Sagor (85.1+) @sv
alternative label: Satuelokuvat (85.1+)
broader: SADUT. KUVAKIRJAT. SARJAKUVAT
in scheme: YKL - Yleisten kirjastojen luokitusjärjestelmä
narrower: Suomenkieliset sadut
narrower: Pohjoismaisilla kielillä julkaistut sadut
narrower: Saksankieliset sadut
narrower: Englanninkieliset sadut
narrower: Romaanisilla kielillä julkaistut sadut
narrower: Slaavilaisilla ja balttilaisilla kielillä julkaistut sadut
narrower: Muilla indoeurooppalaisilla kielillä julkaistut sadut
narrower: Muilla kielillä julkaistut sadut
notation: 85.1
preferred label: FAIRY TALES @en
preferred label: SAGOR @sv
scope note: Hit och till underklasserna sagor för vuxna eller barn Hit och till underklasserna också folksagor som bearbetats eller förkortats för barn Verken klassificeras enligt publikationens språk, inte enligt originalspråk eller publikationsland Om det ena av språken i ett tvåspråkigt verk är översättningsspråk klassificeras verk enligt detta språk Om texterna i ett två- eller flerspråkigt verk inte är översättningar av varandra klassificeras verket efter publikationens huvudspråk Om verket saknar huvudspråk klassificeras det enligt publikationens första språk Klassen på filmer på främmande språk bestäms av språket till vilket filmen är textad: i ordningen finska, svenska, engelska osv. utgående från hur vanligt språket är Formtilläggen 01, 02, 03+, 06+, 07, 08+ och 09 används inte i samband med klasserna 80-85+ @sv
scope note: Tähän ja alaluokkiin aikuisille tai lapsille tarkoitetut sadut Tähän ja alaluokkiin myös lapsille muokatut tai lyhennetyt kansansadut Teokset luokitetaan julkaisun kielen, ei julkaisumaan tai alkuteoksen kielen mukaan Jos kaksikielisen teoksen toinen kieli on käännöskieli, luokitetaan teos käännöskielen mukaan Jos kaksi- tai useampikielisen teoksen tekstit eivät ole toistensa käännöksiä, luokitetaan teos julkaisun pääkielen mukaan Jos teoksella ei ole pääkieltä, se luokitetaan julkaisun ensimmäisen kielen mukaan Vieraskielisten elokuvien luokka määräytyy tekstityskielen mukaan järjestyksessä: suomi, ruotsi, englanti jne. kielen tuttuuden mukaan Muotoluokkia 01, 02, 03+, 06+, 07, 08+ ja 09 ei käytetä luokkien 80-85+ yhteydessä

Suomenkieliset sadut
type: Concept
type: YKL-luokka
alternative label: Finsk skönlitteratur, sagor (85.12) @sv
alternative label: Finska, sagor (85.12) @sv
alternative label: Suomen kieli, sadut (85.12)
alternative label: Suomenkielinen kaunokirjallisuus, sadut (85.12)
broader: SADUT
in scheme: YKL - Yleisten kirjastojen luokitusjärjestelmä
narrower: Meänkieliset sadut
narrower: Kveeninkieliset sadut
narrower: Vironkieliset sadut
narrower: Muilla itämerensuomalaisilla kielillä julkaistut sadut
narrower: Muilla suomalais-ugrilaisilla ja uralilaisilla kielillä julkaistut sadut
notation: 85.12
preferred label: Fairy tales in Finnish @en
preferred label: Sagor på finska @sv

Meänkieliset sadut
type: Concept
type: YKL-luokka
alternative label: Meänkieli, sadut (85.121)
alternative label: Meänkieli, sagor (85.121) @sv
alternative label: Meänkielinen kaunokirjallisuus, sadut (85.121)
alternative label: Skönlitteratur på meänkieli, sagor (85.121) @sv
alternative label: Skönlitteratur på tornedalsfinska, sagor (85.121) @sv
broader: Suomenkieliset sadut
in scheme: YKL - Yleisten kirjastojen luokitusjärjestelmä
notation: 85.121
preferred label: Fairy tales in Meänkieli @en
preferred label: Sagor på meänkieli @sv

Kveeninkieliset sadut
type: Concept
type: YKL-luokka
alternative label: Kveenin kieli, sadut (85.122)
alternative label: Kveeninkielinen kaunokirjallisuus, sadut (85.122)
alternative label: Kvänsk skönlitteratur, sagor (85.122) @sv
alternative label: Kvänska, sagor (85.122) @sv
broader: Suomenkieliset sadut
in scheme: YKL - Yleisten kirjastojen luokitusjärjestelmä
notation: 85.122
preferred label: Fairy tales in Kven language @en
preferred label: Sagor på kvänska @sv

Vironkieliset sadut
type: Concept
type: YKL-luokka
alternative label: Estnisk skönlitteratur, sagor (85.123) @sv
alternative label: Estniska, sagor (85.123) @sv
alternative label: Viron kieli, sadut (85.123)
alternative label: Vironkielinen kaunokirjallisuus, sadut (85.123)
broader: Suomenkieliset sadut
in scheme: YKL - Yleisten kirjastojen luokitusjärjestelmä
notation: 85.123
preferred label: Fairy tales in Estonian @en
preferred label: Sagor på estniska @sv

Muilla itämerensuomalaisilla kielillä julkaistut sadut
type: Concept
type: YKL-luokka
broader: Suomenkieliset sadut
in scheme: YKL - Yleisten kirjastojen luokitusjärjestelmä
narrower: Karjajalankieliset sadut
notation: 85.124
preferred label: Fairy tales in other Balto-Finnic languages @en
preferred label: Sagor på övriga östersjöfinska språk @sv

Karjajalankieliset sadut
type: Concept
type: YKL-luokka
alternative label: Karelska, sagor (85.1241) @sv
alternative label: Karjalan kieli, sadut (85.1241)
broader: Muilla itämerensuomalaisilla kielillä julkaistut sadut
in scheme: YKL - Yleisten kirjastojen luokitusjärjestelmä
notation: 85.1241
preferred label: Fairy tales in Karelian language @en
preferred label: Sagor på karelska @sv

Muilla suomalais-ugrilaisilla ja uralilaisilla kielillä julkaistut sadut
type: Concept
type: YKL-luokka
broader: Suomenkieliset sadut
in scheme: YKL - Yleisten kirjastojen luokitusjärjestelmä
narrower: Unkarinkieliset sadut
narrower: Saamenkieliset sadut
notation: 85.125
preferred label: Fairy tales in other Finno-Ugric and Uralic languages @en
preferred label: Sagor på övriga finsk-ugriska och uraliska språk @sv

Unkarinkieliset sadut
type: Concept
type: YKL-luokka
alternative label: Ungersk skönlitteratur, sagor (85.1251) @sv
alternative label: Ungerska, sagor (85.1251) @sv
alternative label: Unkarin kieli, sadut (85.1251)
alternative label: Unkarinkielinen kaunokirjallisuus, sadut (85.1251)
broader: Muilla suomalais-ugrilaisilla ja uralilaisilla kielillä julkaistut sadut
in scheme: YKL - Yleisten kirjastojen luokitusjärjestelmä
notation: 85.1251
preferred label: Fairy tales in Hungarian @en
preferred label: Sagor på ungerska @sv

Saamenkieliset sadut
type: Concept
type: YKL-luokka
alternative label: Saamen kieli, sadut (85.1252)
alternative label: Saamenkielinen kaunokirjallisuus, sadut (85.1252)
alternative label: Samisk skönlitteratur, sagor (85.1252) @sv
alternative label: Samiska, sagor (85.1252) @sv
broader: Muilla suomalais-ugrilaisilla ja uralilaisilla kielillä julkaistut sadut
in scheme: YKL - Yleisten kirjastojen luokitusjärjestelmä
notation: 85.1252
preferred label: Fairy tales in Sami @en
preferred label: Sagor på samiska @sv

Pohjoismaisilla kielillä julkaistut sadut
type: Concept
type: YKL-luokka
broader: SADUT
in scheme: YKL - Yleisten kirjastojen luokitusjärjestelmä
narrower: Ruotsinkieliset sadut
narrower: Norjankieliset sadut
narrower: Tanskankieliset sadut
narrower: Islanninkieliset sadut
narrower: Fäärinkieliset sadut
notation: 85.13
preferred label: Fairy tales in Nordic languages @en
preferred label: Sagor på nordiska språk @sv

Ruotsinkieliset sadut
type: Concept
type: YKL-luokka
alternative label: Ruotsin kieli, sadut (85.131)
alternative label: Ruotsinkielinen kaunokirjallisuus, sadut (85.131)
alternative label: Svensk skönlitteratur, sagor (85.131) @sv
alternative label: Svenska, sagor (85.131) @sv
broader: Pohjoismaisilla kielillä julkaistut sadut
in scheme: YKL - Yleisten kirjastojen luokitusjärjestelmä
notation: 85.131
preferred label: Fairy tales in Swedish @en
preferred label: Sagor på svenska @sv

Norjankieliset sadut
type: Concept
type: YKL-luokka
alternative label: Norjan kieli, sadut (85.132)
alternative label: Norjankielinen kaunokirjallisuus, sadut (85.132)
alternative label: Norsk skönlitteratur, sagor (85.132) @sv
alternative label: Norska, sagor (85.132) @sv
broader: Pohjoismaisilla kielillä julkaistut sadut
in scheme: YKL - Yleisten kirjastojen luokitusjärjestelmä
notation: 85.132
preferred label: Fairy tales in Norwegian @en
preferred label: Sagor på norska @sv

Tanskankieliset sadut
type: Concept
type: YKL-luokka
alternative label: Dansk skönlitteratur, sagor (85.133) @sv
alternative label: Danska, sagor (85.133) @sv
alternative label: Tanskan kieli, sadut (85.133)
alternative label: Tanskankielinen kaunokirjallisuus, sadut (85.133)
broader: Pohjoismaisilla kielillä julkaistut sadut
in scheme: YKL - Yleisten kirjastojen luokitusjärjestelmä
notation: 85.133
preferred label: Fairy tales in Danish @en
preferred label: Sagor på danska @sv

Islanninkieliset sadut
type: Concept
type: YKL-luokka
alternative label: Islannin kieli, sadut (85.134)
alternative label: Islanninkielinen kaunokirjallisuus, sadut (85.134)
alternative label: Isländsk skönlitteratur, sagor (85.134) @sv
alternative label: Isländska, sagor (85.134) @sv
broader: Pohjoismaisilla kielillä julkaistut sadut
in scheme: YKL - Yleisten kirjastojen luokitusjärjestelmä
notation: 85.134
preferred label: Fairy tales in Icelandic @en
preferred label: Sagor på isländska @sv

Fäärinkieliset sadut
type: Concept
type: YKL-luokka
alternative label: Färöisk skönlitteratur, sagor (85.135) @sv
alternative label: Färöiska, sagor (85.135) @sv
alternative label: Fäärin kieli, sadut (85.135)
alternative label: Fäärinkielinen kaunokirjallisuus, sadut (85.135)
broader: Pohjoismaisilla kielillä julkaistut sadut
in scheme: YKL - Yleisten kirjastojen luokitusjärjestelmä
notation: 85.135
preferred label: Fairy tales in Faeroe @en
preferred label: Sagor på färöiska @sv

Saksankieliset sadut
type: Concept
type: YKL-luokka
alternative label: Saksan kieli, sadut (85.14)
alternative label: Saksankielinen kaunokirjallisuus, sadut (85.14)
alternative label: Tysk skönlitteratur, sagor (85.14) @sv
alternative label: Tyska, sagor (85.14) @sv
broader: SADUT
in scheme: YKL - Yleisten kirjastojen luokitusjärjestelmä
narrower: Jiddišinkieliset sadut
narrower: Friisinkieliset sadut
narrower: Hollanninkieliset sadut
notation: 85.14
preferred label: Fairy tales in German @en
preferred label: Sagor på tyska @sv
scope note: Hit och till underklassen också sagor på andra germanska språk Hit sagor på jiddisch @sv
scope note: Tähän ja alaluokkaan myös muilla germaanisilla kielillä julkaistut sadut Tähän jiddisinkieliset sadut

Jiddišinkieliset sadut
type: Concept
type: YKL-luokka
alternative label: Jiddisch, sagor (85.141) @sv
alternative label: Jiddišin kieli, sadut (85.141)
broader: Saksankieliset sadut
in scheme: YKL - Yleisten kirjastojen luokitusjärjestelmä
notation: 85.141
preferred label: Fairy tales in Yiddish language @en
preferred label: Sagor på jiddisch @sv

Friisinkieliset sadut
type: Concept
type: YKL-luokka
broader: Saksankieliset sadut
in scheme: YKL - Yleisten kirjastojen luokitusjärjestelmä
notation: 85.143
preferred label: Fairy tales in Frisian @en
preferred label: Sagor på frisiska @sv

Hollanninkieliset sadut
type: Concept
type: YKL-luokka
alternative label: Hollannin kieli, sadut (85.148)
alternative label: Hollanninkielinen kaunokirjallisuus, sadut (85.148)
alternative label: Nederländsk skönlitteratur, sagor (85.148) @sv
alternative label: Nederländska, sagor (85.148) @sv
broader: Saksankieliset sadut
in scheme: YKL - Yleisten kirjastojen luokitusjärjestelmä
narrower: Afrikaansinkieliset sadut
notation: 85.148
preferred label: Fairy tales in Dutch @en
preferred label: Sagor på holländska @sv
scope note: Hit också sagor på flamländska @sv
scope note: Tähän myös flaaminkieliset sadut

Afrikaansinkieliset sadut
type: Concept
type: YKL-luokka
alternative label: Afrikaan kieli, sadut (85.1481)
alternative label: Afrikaans, sagor (85.1481) @sv
broader: Hollanninkieliset sadut
in scheme: YKL - Yleisten kirjastojen luokitusjärjestelmä
notation: 85.1481
preferred label: Fairy tales in Afrikaans language @en
preferred label: Sagor på afrikaans @sv

Englanninkieliset sadut
type: Concept
type: YKL-luokka
alternative label: Engelsk skönlitteratur, sagor (85.15) @sv
alternative label: Engelska, sagor (85.15) @sv
alternative label: Englannin kieli, sadut (85.15)
alternative label: Englanninkielinen kaunokirjallisuus, sadut (85.15)
broader: SADUT
in scheme: YKL - Yleisten kirjastojen luokitusjärjestelmä
notation: 85.15
preferred label: Fairy tales in English @en
preferred label: Sagor på engelska @sv

Romaanisilla kielillä julkaistut sadut
type: Concept
type: YKL-luokka
broader: SADUT
in scheme: YKL - Yleisten kirjastojen luokitusjärjestelmä
narrower: Ranskankieliset sadut
narrower: Italiankieliset sadut
narrower: Espanjankieliset sadut
narrower: Portugalinkieliset sadut
narrower: Romaniankieliset sadut
narrower: Muilla romaanisilla kielillä julkaistut sadut
notation: 85.16
preferred label: Fairy tales in Romanic languages @en
preferred label: Sagor på romanska språk @sv

Ranskankieliset sadut
type: Concept
type: YKL-luokka
alternative label: Fransk skönlitteratur, sagor (85.161) @sv
alternative label: Franska, sagor (85.161) @sv
alternative label: Ranskan kieli, sadut (85.161)
alternative label: Ranskankielinen kaunokirjallisuus, sadut (85.161)
broader: Romaanisilla kielillä julkaistut sadut
in scheme: YKL - Yleisten kirjastojen luokitusjärjestelmä
notation: 85.161
preferred label: Fairy tales in French @en
preferred label: Sagor på franska @sv

Italiankieliset sadut
type: Concept
type: YKL-luokka
alternative label: Italian kieli, sadut (85.162)
alternative label: Italiankielinen kaunokirjallisuus, sadut (85.162)
alternative label: Italiensk skönlitteratur, sagor (85.162) @sv
alternative label: Italienska, sagor (85.162) @sv
broader: Romaanisilla kielillä julkaistut sadut
in scheme: YKL - Yleisten kirjastojen luokitusjärjestelmä
notation: 85.162
preferred label: Fairy tales in Italian @en
preferred label: Sagor på italienska @sv

Espanjankieliset sadut
type: Concept
type: YKL-luokka
alternative label: Espanjan kieli, sadut (85.163)
alternative label: Espanjankielinen kaunokirjallisuus, sadut (85.163)
alternative label: Spansk skönlitteratur, sagor (85.163) @sv
alternative label: Spanska, sagor (85.163) @sv
broader: Romaanisilla kielillä julkaistut sadut
in scheme: YKL - Yleisten kirjastojen luokitusjärjestelmä
notation: 85.163
preferred label: Fairy tales in Spanish @en
preferred label: Sagor på spanska @sv

Portugalinkieliset sadut
type: Concept
type: YKL-luokka
alternative label: Portugalin kieli, sadut (85.164)
alternative label: Portugalinkielinen kaunokirjallisuus, sadut (85.164)
alternative label: Portugisisk skönlitteratur, sagor (85.164) @sv
alternative label: Portugisiska, sagor (85.164) @sv
broader: Romaanisilla kielillä julkaistut sadut
in scheme: YKL - Yleisten kirjastojen luokitusjärjestelmä
notation: 85.164
preferred label: Fairy tales in Portuguese @en
preferred label: Sagor på portugisiska @sv

Romaniankieliset sadut
type: Concept
type: YKL-luokka
alternative label: Romanian kieli, sadut (85.165)
alternative label: Romaniankielinen kaunokirjallisuus, sadut (85.165)
alternative label: Rumänsk skönlitteratur, sagor (85.165) @sv
alternative label: Rumänska, sagor (85.165) @sv
broader: Romaanisilla kielillä julkaistut sadut
in scheme: YKL - Yleisten kirjastojen luokitusjärjestelmä
notation: 85.165
preferred label: Fairy tales in Romanian @en
preferred label: Sagor på rumänska @sv

Muilla romaanisilla kielillä julkaistut sadut
type: Concept
type: YKL-luokka
broader: Romaanisilla kielillä julkaistut sadut
in scheme: YKL - Yleisten kirjastojen luokitusjärjestelmä
narrower: Katalaaninkieliset sadut
notation: 85.167
preferred label: Fairy tales in other Romanic languages @en
preferred label: Sagor på övriga romanska språk @sv

Katalaaninkieliset sadut
type: Concept
type: YKL-luokka
alternative label: Katalaan kieli, sadut (85.1671)
alternative label: Katalanska, sagor (85.1671) @sv
broader: Muilla romaanisilla kielillä julkaistut sadut
in scheme: YKL - Yleisten kirjastojen luokitusjärjestelmä
notation: 85.1671
preferred label: Fairy tales in Catalan language @en
preferred label: Sagor på katalanska @sv

Slaavilaisilla ja balttilaisilla kielillä julkaistut sadut
type: Concept
type: YKL-luokka
broader: SADUT
in scheme: YKL - Yleisten kirjastojen luokitusjärjestelmä
narrower: Venäjänkieliset sadut
narrower: Ukrainankieliset sadut. Valkovenäjänkieliset sadut
narrower: Puolankieliset sadut
narrower: Tšekinkieliset sadut
narrower: Slovakinkieliset sadut
narrower: Eteläslaavilaisilla kielillä julkaistut sadut
narrower: Balttilaisilla kielillä julkaistut sadut
notation: 85.17
preferred label: Fairy tales in Slavonic and Baltic languages @en
preferred label: Sagor på slaviska och baltiska språk @sv

Venäjänkieliset sadut
type: Concept
type: YKL-luokka
alternative label: Rysk skönlitteratur, sagor (85.171) @sv
alternative label: Ryska, sagor (85.171) @sv
alternative label: Venäjän kieli, sadut (85.171)
alternative label: Venäjänkielinen kaunokirjallisuus, sadut (85.171)
broader: Slaavilaisilla ja balttilaisilla kielillä julkaistut sadut
in scheme: YKL - Yleisten kirjastojen luokitusjärjestelmä
notation: 85.171
preferred label: Fairy tales in Russian @en
preferred label: Sagor på ryska @sv

Ukrainankieliset sadut. Valkovenäjänkieliset sadut
type: Concept
type: YKL-luokka
broader: Slaavilaisilla ja balttilaisilla kielillä julkaistut sadut
in scheme: YKL - Yleisten kirjastojen luokitusjärjestelmä
narrower: Ukrainankieliset sadut
narrower: Valkovenäjänkieliset sadut
notation: 85.172
preferred label: Fairy tales in Ukrainian. Fairy tales in Byelorussian @en
preferred label: Sagor på ukrainska. Sagor på vitryska @sv

Ukrainankieliset sadut
type: Concept
type: YKL-luokka
alternative label: Ukrainan kieli, sadut (85.1721)
alternative label: Ukrainska, sagor (85.1721) @sv
broader: Ukrainankieliset sadut. Valkovenäjänkieliset sadut
in scheme: YKL - Yleisten kirjastojen luokitusjärjestelmä
notation: 85.1721
preferred label: Fairy tales in Ukrainian @en
preferred label: Sagor på ukrainska @sv

Valkovenäjänkieliset sadut
type: Concept
type: YKL-luokka
alternative label: Valkovenäjän kieli, sadut (85.1722)
alternative label: Vitryska, sagor (85.1722) @sv
broader: Ukrainankieliset sadut. Valkovenäjänkieliset sadut
in scheme: YKL - Yleisten kirjastojen luokitusjärjestelmä
notation: 85.1722
preferred label: Fairy tales in Byelorussian @en
preferred label: Sagor på vitryska @sv

Puolankieliset sadut
type: Concept
type: YKL-luokka
alternative label: Polsk skönlitteratur,sagor (85.173) @sv
alternative label: Polska, sagor (85.173) @sv
alternative label: Puolan kieli, sadut (85.173)
alternative label: Puolankielinen kaunokirjallisuus, sadut (85.173)
broader: Slaavilaisilla ja balttilaisilla kielillä julkaistut sadut
in scheme: YKL - Yleisten kirjastojen luokitusjärjestelmä
notation: 85.173
preferred label: Fairy tales in Polish @en
preferred label: Sagor på polska @sv

Tšekinkieliset sadut
type: Concept
type: YKL-luokka
alternative label: Tjeckisk skönlitteratur, sagor (85.174) @sv
alternative label: Tjeckiska, sagor (85.174) @sv
alternative label: Tšekin kieli, sadut (85.174)
alternative label: Tšekinkielinen kaunokirjallisuus, sadut (85.174)
broader: Slaavilaisilla ja balttilaisilla kielillä julkaistut sadut
in scheme: YKL - Yleisten kirjastojen luokitusjärjestelmä
notation: 85.174
preferred label: Fairy tales in Czech @en
preferred label: Sagor på tjeckiska @sv

Slovakinkieliset sadut
type: Concept
type: YKL-luokka
alternative label: Slovakin kieli, sadut (85.175)
alternative label: Slovakinkielinen kaunokirjallisuus, sadut (85.175)
alternative label: Slovakisk skönlitteratur, sagor (85.175) @sv
alternative label: Slovakiska, sagor (85.175) @sv
broader: Slaavilaisilla ja balttilaisilla kielillä julkaistut sadut
in scheme: YKL - Yleisten kirjastojen luokitusjärjestelmä
notation: 85.175
preferred label: Fairy tales in Slovak @en
preferred label: Sagor på slovakiska @sv

Eteläslaavilaisilla kielillä julkaistut sadut
type: Concept
type: YKL-luokka
broader: Slaavilaisilla ja balttilaisilla kielillä julkaistut sadut
in scheme: YKL - Yleisten kirjastojen luokitusjärjestelmä
narrower: Bulgariankieliset sadut
narrower: Makedoniankieliset sadut
narrower: Sloveeninkieliset sadut
narrower: Serbiankieliset sadut
narrower: Kroatiankieliset sadut
narrower: Bosniankieliset sadut
notation: 85.176
preferred label: Fairy tales in South-Slavonic languages @en
preferred label: Sagor på sydslaviska språk @sv

Bulgariankieliset sadut
type: Concept
type: YKL-luokka
alternative label: Bulgarian kieli, sadut (85.1761)
alternative label: Bulgariankielinen kaunokirjallisuus, sadut (85.1761)
alternative label: Bulgarisk skönlitteratur, sagor (85.1761) @sv
alternative label: Bulgariska, sagor (85.1761) @sv
broader: Eteläslaavilaisilla kielillä julkaistut sadut
in scheme: YKL - Yleisten kirjastojen luokitusjärjestelmä
notation: 85.1761
preferred label: Fairy tales in Bulgarian @en
preferred label: Sagor på bulgariska @sv

Makedoniankieliset sadut
type: Concept
type: YKL-luokka
alternative label: Makedonian kieli, sadut (85.1762)
alternative label: Makedoniankielinen kaunokirjallisuus, sadut (85.1762)
alternative label: Makedonsk skönlitteratur, sagor (85.1762) @sv
alternative label: Makedonska, sagor (85.1762) @sv
broader: Eteläslaavilaisilla kielillä julkaistut sadut
in scheme: YKL - Yleisten kirjastojen luokitusjärjestelmä
notation: 85.1762
preferred label: Fairy tales in Macedonian @en
preferred label: Sagor på makedonska @sv

Sloveeninkieliset sadut
type: Concept
type: YKL-luokka
alternative label: Sloveenin kieli, sadut (85.1763)
alternative label: Sloveeninkielinen kaunokirjallisuus, sadut (85.1763)
alternative label: Slovensk skönlitteratur, sagor (85.1763) @sv
alternative label: Slovenska, sagor (85.1763) @sv
broader: Eteläslaavilaisilla kielillä julkaistut sadut
in scheme: YKL - Yleisten kirjastojen luokitusjärjestelmä
notation: 85.1763
preferred label: Fairy tales in Slovenian @en
preferred label: Sagor på slovenska @sv

Serbiankieliset sadut
type: Concept
type: YKL-luokka
alternative label: Serbian kieli, sadut (85.1764)
alternative label: Serbiankielinen kaunokirjallisuus, sadut (85.1764)
alternative label: Serbisk skönlitteratur, sagor (85.1764) @sv
alternative label: Serbiska, sagor (85.1764) @sv
broader: Eteläslaavilaisilla kielillä julkaistut sadut
in scheme: YKL - Yleisten kirjastojen luokitusjärjestelmä
notation: 85.1764
preferred label: Fairy tales in Serbian @en
preferred label: Sagor på serbiska @sv

Kroatiankieliset sadut
type: Concept
type: YKL-luokka
alternative label: Kroaatin kieli, sadut (85.1765)
alternative label: Kroaatinkielinen kaunokirjallisuus, sadut (85.1765)
alternative label: Kroatian kieli, sadut (85.1765)
alternative label: Kroatiankielinen kaunokirjallisuus, sadut (85.1765)
alternative label: Kroatisk skönlitteratur, sagor (85.1765) @sv
alternative label: Kroatiska, sagor (85.1765) @sv
broader: Eteläslaavilaisilla kielillä julkaistut sadut
in scheme: YKL - Yleisten kirjastojen luokitusjärjestelmä
notation: 85.1765
preferred label: Fairy tales in Croatian @en
preferred label: Sagor på kroatiska @sv

Bosniankieliset sadut
type: Concept
type: YKL-luokka
alternative label: Bosnian kieli, sadut (85.1766)
alternative label: Bosniankielinen kaunokirjallisuus, sadut (85.1766)
alternative label: Bosnisk skönlitteratur, sagor (85.1766) @sv
alternative label: Bosniska, sagor (85.1766) @sv
broader: Eteläslaavilaisilla kielillä julkaistut sadut
in scheme: YKL - Yleisten kirjastojen luokitusjärjestelmä
notation: 85.1766
preferred label: Fairy tales in Bosnian @en
preferred label: Sagor på bosniska @sv

Balttilaisilla kielillä julkaistut sadut
type: Concept
type: YKL-luokka
broader: Slaavilaisilla ja balttilaisilla kielillä julkaistut sadut
in scheme: YKL - Yleisten kirjastojen luokitusjärjestelmä
narrower: Latviankieliset sadut
narrower: Liettuankieliset sadut
notation: 85.178
preferred label: Fairy tales in Baltic languages @en
preferred label: Sagor på baltiska språk @sv

Latviankieliset sadut
type: Concept
type: YKL-luokka
alternative label: Latvian kieli, sadut (85.1781)
alternative label: Latviankielinen kaunokirjallisuus, sadut (85.1781)
alternative label: Lettisk skönlitteratur, sagor (85.1781) @sv
alternative label: Lettiska, sagor (85.1781) @sv
broader: Balttilaisilla kielillä julkaistut sadut
in scheme: YKL - Yleisten kirjastojen luokitusjärjestelmä
notation: 85.1781
preferred label: Fairy tales in Latvian @en
preferred label: Sagor på lettiska @sv

Liettuankieliset sadut
type: Concept
type: YKL-luokka
alternative label: Liettuan kieli, sadut (85.1782)
alternative label: Liettuankielinen kaunokirjallisuus, sadut (85.1782)
alternative label: Litauisk skönlitteratur, sagor (85.1782) @sv
alternative label: Litauiska, sagor (85.1782) @sv
broader: Balttilaisilla kielillä julkaistut sadut
in scheme: YKL - Yleisten kirjastojen luokitusjärjestelmä
notation: 85.1782
preferred label: Fairy tales in Lithuanian @en
preferred label: Sagor på litauiska @sv

Muilla indoeurooppalaisilla kielillä julkaistut sadut
type: Concept
type: YKL-luokka
broader: SADUT
in scheme: YKL - Yleisten kirjastojen luokitusjärjestelmä
narrower: Kreikankieliset sadut
narrower: Latinankieliset sadut
narrower: Indoiraanisilla kielillä julkaistut sadut
narrower: Albaniankieliset sadut
narrower: Armeniankieliset sadut
narrower: Kelttiläisillä kielillä julkaistut sadut
notation: 85.18
preferred label: Fairy tales in other Indo-European languages @en
preferred label: Sagor på övriga indoeuropeiska språk @sv

Kreikankieliset sadut
type: Concept
type: YKL-luokka
alternative label: Grekisk skönlitteratur, forngrekiska, sagor (85.181) @sv
alternative label: Grekiska, forngrekiska, sagor (85.181) @sv
alternative label: Kreikan kieli, muinaiskreikka, sadut (85.181)
alternative label: Kreikankielinen kaunokirjallisuus, muinaiskreikka, sadut (85.181)
broader: Muilla indoeurooppalaisilla kielillä julkaistut sadut
in scheme: YKL - Yleisten kirjastojen luokitusjärjestelmä
narrower: Nykykreikankieliset sadut
notation: 85.181
preferred label: Fairy tales in Greek @en
preferred label: Sagor på grekiska @sv

Nykykreikankieliset sadut
type: Concept
type: YKL-luokka
alternative label: Grekisk skönlitteratur, nygrekiska, sagor (85.1812) @sv
alternative label: Grekiska, nygrekiska, sagor (85.1812) @sv
alternative label: Kreikan kieli, nykykreikka, sadut (85.1812)
alternative label: Kreikankielinen kaunokirjallisuus, nykykreikka, sadut (85.1812)
broader: Kreikankieliset sadut
in scheme: YKL - Yleisten kirjastojen luokitusjärjestelmä
notation: 85.1812
preferred label: Fairy tales in Modern Greek @en
preferred label: Sagor på nygrekiska @sv

Latinankieliset sadut
type: Concept
type: YKL-luokka
alternative label: Latin, sagor (85.182) @sv
alternative label: Latinan kieli, sadut (85.182)
alternative label: Latinankielinen kaunokirjallisuus, sadut (85.182)
alternative label: Latinsk skönlitteratur, sagor (85.182) @sv
broader: Muilla indoeurooppalaisilla kielillä julkaistut sadut
in scheme: YKL - Yleisten kirjastojen luokitusjärjestelmä
notation: 85.182
preferred label: Fairy tales in Latin @en
preferred label: Sagor på latin @sv

Indoiraanisilla kielillä julkaistut sadut
type: Concept
type: YKL-luokka
broader: Muilla indoeurooppalaisilla kielillä julkaistut sadut
in scheme: YKL - Yleisten kirjastojen luokitusjärjestelmä
narrower: Persiankieliset sadut
narrower: Kurdinkieliset sadut
narrower: Paštunkieliset sadut
narrower: Indoarjalaisilla kielillä julkaistut sadut
notation: 85.183
preferred label: Fairy tales in Indo-Iranian languages @en
preferred label: Sagor på indoiranska språk @sv
scope note: Intialaisilla ja iranilaisilla kielillä julkaistut sadut
scope note: Sagor på indiska och iranska språk @sv

Persiankieliset sadut
type: Concept
type: YKL-luokka
alternative label: Persian kieli, sadut (85.1831)
alternative label: Persiankielinen kaunokirjallisuus, sadut (85.1831)
alternative label: Persisk skönlitteratur, sagor (85.1831) @sv
alternative label: Persiska, sagor (85.1831) @sv
broader: Indoiraanisilla kielillä julkaistut sadut
in scheme: YKL - Yleisten kirjastojen luokitusjärjestelmä
narrower: Darinkieliset sadut
notation: 85.1831
preferred label: Fairy tales in Persian @en
preferred label: Sagor på persiska @sv

Darinkieliset sadut
type: Concept
type: YKL-luokka
alternative label: Dari, sagor (85.18311) @sv
alternative label: Darin kieli, sadut (85.18311)
alternative label: Darinkielinen kaunokirjallisuus, sadut (85.18311)
alternative label: Skönlitteratur på dari, sagor (85.18311) @sv
broader: Persiankieliset sadut
in scheme: YKL - Yleisten kirjastojen luokitusjärjestelmä
notation: 85.18311
preferred label: Fairy tales in Dari language @en
preferred label: Sagor på dari @sv

Kurdinkieliset sadut
type: Concept
type: YKL-luokka
alternative label: Kurdin kieli, sadut (85.1832)
alternative label: Kurdinkielinen kaunokirjallisuus, sadut (85.1832)
alternative label: Kurdisk skönlitteratur, sagor (85.1832) @sv
alternative label: Kurdiska, sagor (85.1832) @sv
broader: Indoiraanisilla kielillä julkaistut sadut
in scheme: YKL - Yleisten kirjastojen luokitusjärjestelmä
narrower: Kurmandžinkieliset sadut
narrower: Soraninkieliset sadut
notation: 85.1832
preferred label: Fairy tales in Kurdish @en
preferred label: Sagor på kurdiska @sv

Kurmandžinkieliset sadut
type: Concept
type: YKL-luokka
alternative label: Kurmandžin kieli, sadut (85.18321)
alternative label: Kurmanji, sagor (85.18321) @sv
broader: Kurdinkieliset sadut
in scheme: YKL - Yleisten kirjastojen luokitusjärjestelmä
notation: 85.18321
preferred label: Fairy tales in Kurmanji language @en
preferred label: Sagor på kurmanji @sv

Soraninkieliset sadut
type: Concept
type: YKL-luokka
alternative label: Sorani, sagor (85.18322) @sv
alternative label: Soranin kieli, sadut (85.18322)
broader: Kurdinkieliset sadut
in scheme: YKL - Yleisten kirjastojen luokitusjärjestelmä
notation: 85.18322
preferred label: Fairy tales in Sorani language @en
preferred label: Sagor på sorani @sv

Paštunkieliset sadut
type: Concept
type: YKL-luokka
alternative label: Pashto, sagor (85.1833) @sv
alternative label: Paštun kieli, sadut (85.1833)
broader: Indoiraanisilla kielillä julkaistut sadut
in scheme: YKL - Yleisten kirjastojen luokitusjärjestelmä
notation: 85.1833
preferred label: Fairy tales in Pushto language @en
preferred label: Sagor på pashto @sv

Indoarjalaisilla kielillä julkaistut sadut
type: Concept
type: YKL-luokka
broader: Indoiraanisilla kielillä julkaistut sadut
in scheme: YKL - Yleisten kirjastojen luokitusjärjestelmä
narrower: Bengalinkieliset sadut
narrower: Gudžaratinkieliset sadut
narrower: Hindinkieliset sadut
narrower: Pandzabinkieliset sadut
narrower: Romanikieliset sadut
narrower: Urdunkieliset sadut
narrower: Nepalinkieliset sadut
narrower: Sinhalankieliset sadut
notation: 85.1836
preferred label: Fairy tales in Indo-Aryan languages @en
preferred label: Sagor på indoariska spåk @sv

Bengalinkieliset sadut
type: Concept
type: YKL-luokka
alternative label: Bengali, sagor (85.18361) @sv
alternative label: Bengalin kieli, sadut (85.18361)
broader: Indoarjalaisilla kielillä julkaistut sadut
in scheme: YKL - Yleisten kirjastojen luokitusjärjestelmä
notation: 85.18361
preferred label: Fairy tales in Bengali language @en
preferred label: Sagor på bengali @sv

Gudžaratinkieliset sadut
type: Concept
type: YKL-luokka
alternative label: Gudžaratin kieli, sadut (85.18362)
alternative label: Gujarati, sagor (85.18362) @sv
broader: Indoarjalaisilla kielillä julkaistut sadut
in scheme: YKL - Yleisten kirjastojen luokitusjärjestelmä
notation: 85.18362
preferred label: Fairy tales in Gujarati language @en
preferred label: Sagor på gujarati @sv

Hindinkieliset sadut
type: Concept
type: YKL-luokka
alternative label: Hindi, sagor (85.18363) @sv
alternative label: Hindin kieli, sadut (85.18363)
broader: Indoarjalaisilla kielillä julkaistut sadut
in scheme: YKL - Yleisten kirjastojen luokitusjärjestelmä
notation: 85.18363
preferred label: Fairy tales in Hindi language @en
preferred label: Sagor på hindi @sv

Pandzabinkieliset sadut
type: Concept
type: YKL-luokka
alternative label: Pandzabin kieli, sadut (85.18364)
alternative label: Panjabi, sagor (85.18364) @sv
broader: Indoarjalaisilla kielillä julkaistut sadut
in scheme: YKL - Yleisten kirjastojen luokitusjärjestelmä
notation: 85.18364
preferred label: Fairy tales in Punjabi language @en
preferred label: Sagor på panjabi @sv

Romanikieliset sadut
type: Concept
type: YKL-luokka
alternative label: Romani, sagor (85.18365) @sv
alternative label: Romanikieli, sadut (85.18365)
broader: Indoarjalaisilla kielillä julkaistut sadut
in scheme: YKL - Yleisten kirjastojen luokitusjärjestelmä
notation: 85.18365
preferred label: Fairy tales in Romani language @en
preferred label: Sagor på romani @sv

Urdunkieliset sadut
type: Concept
type: YKL-luokka
alternative label: Urdu, sagor (85.18366) @sv
alternative label: Urdun kieli, sadut (85.18366)
broader: Indoarjalaisilla kielillä julkaistut sadut
in scheme: YKL - Yleisten kirjastojen luokitusjärjestelmä
notation: 85.18366
preferred label: Fairy tales in Urdu language @en
preferred label: Sagor på urdu @sv

Nepalinkieliset sadut
type: Concept
type: YKL-luokka
alternative label: Nepali, sagor (85.18367) @sv
alternative label: Nepalin kieli, sadut (85.18367)
broader: Indoarjalaisilla kielillä julkaistut sadut
in scheme: YKL - Yleisten kirjastojen luokitusjärjestelmä
notation: 85.18367
preferred label: Fairy tales in Nepali language @en
preferred label: Sagor på nepali @sv

Sinhalankieliset sadut
type: Concept
type: YKL-luokka
alternative label: Singalesiska, sagor (85.18368) @sv
alternative label: Sinhalan kieli, sadut (85.18368)
broader: Indoarjalaisilla kielillä julkaistut sadut
in scheme: YKL - Yleisten kirjastojen luokitusjärjestelmä
notation: 85.18368
preferred label: Fairy tales in Sinhalese language @en
preferred label: Singalesiska på nepali @sv

Albaniankieliset sadut
type: Concept
type: YKL-luokka
alternative label: Albanian kieli, sadut (85.184)
alternative label: Albaniankielinen kaunokirjallisuus, sadut (85.184)
alternative label: Albansk skönlitteratur, sagor (85.184) @sv
alternative label: Albanska, sagor (85.184) @sv
broader: Muilla indoeurooppalaisilla kielillä julkaistut sadut
in scheme: YKL - Yleisten kirjastojen luokitusjärjestelmä
notation: 85.184
preferred label: Fairy tales in Albanian @en
preferred label: Sagor på albanska @sv

Armeniankieliset sadut
type: Concept
type: YKL-luokka
alternative label: Armenian kieli, sadut (85.185)
alternative label: Armeniska, sagor (85.185) @sv
broader: Muilla indoeurooppalaisilla kielillä julkaistut sadut
in scheme: YKL - Yleisten kirjastojen luokitusjärjestelmä
notation: 85.185
preferred label: Fairy tales in Armenian language @en
preferred label: Sagor på armeniska @sv

Kelttiläisillä kielillä julkaistut sadut
type: Concept
type: YKL-luokka
broader: Muilla indoeurooppalaisilla kielillä julkaistut sadut
in scheme: YKL - Yleisten kirjastojen luokitusjärjestelmä
notation: 85.188
preferred label: Fairy tales in Celtic languages @en
preferred label: Sagor på keltiska språk @sv

Muilla kielillä julkaistut sadut
type: Concept
type: YKL-luokka
broader: SADUT
in scheme: YKL - Yleisten kirjastojen luokitusjärjestelmä
narrower: Turkkilaisilla kielillä julkaistut sadut
narrower: Afroaasialaisilla kielillä julkaistut sadut
narrower: Sinotiibetiläisillä ja austroaasialaisilla kielillä julkaistut sadut
narrower: Japanin- ja koreankieliset sadut
narrower: Afrikkalaisilla kielillä julkaistut sadut
narrower: Kaukasialaisilla kielillä julkaistut sadut
narrower: Eskimo- ja intiaanikielillä julkaistut sadut
narrower: Muilla ei-indoeurooppalaisilla kielillä julkaistut sadut
notation: 85.19
preferred label: Fairy tales in other languages @en
preferred label: Sagor på övriga språk @sv

Turkkilaisilla kielillä julkaistut sadut
type: Concept
type: YKL-luokka
broader: Muilla kielillä julkaistut sadut
in scheme: YKL - Yleisten kirjastojen luokitusjärjestelmä
narrower: Turkinkieliset sadut
narrower: Azerinkieliset sadut
narrower: Turkmeeninkieliset sadut
narrower: Uiguurinkieliset sadut
narrower: Uzbekinkieliset sadut
notation: 85.191
preferred label: Fairy tales in Turkic languages @en
preferred label: Sagor på turkiska spåk @sv

Turkinkieliset sadut
type: Concept
type: YKL-luokka
alternative label: Turkin kieli, sadut (85.1911)
alternative label: Turkiska, sagor (85.1911) @sv
broader: Turkkilaisilla kielillä julkaistut sadut
in scheme: YKL - Yleisten kirjastojen luokitusjärjestelmä
notation: 85.1911
preferred label: Fairy tales in Turkish @en
preferred label: Sagor på turkiska @sv

Azerinkieliset sadut
type: Concept
type: YKL-luokka
alternative label: Azerbajdzjanska, sagor (85.1912) @sv
alternative label: Azerin kieli, sadut (85.1912)
broader: Turkkilaisilla kielillä julkaistut sadut
in scheme: YKL - Yleisten kirjastojen luokitusjärjestelmä
notation: 85.1912
preferred label: Fairy tales in Azerbaijani language @en
preferred label: Sagor på azerbajdzjanska @sv

Turkmeeninkieliset sadut
type: Concept
type: YKL-luokka
alternative label: Turkmeenin kieli, sadut (85.1913)
alternative label: Turkmeniska, sagor (85.1913) @sv
broader: Turkkilaisilla kielillä julkaistut sadut
in scheme: YKL - Yleisten kirjastojen luokitusjärjestelmä
notation: 85.1913
preferred label: Fairy tales in Turkmen language @en
preferred label: Sagor på turkmeniska @sv

Uiguurinkieliset sadut
type: Concept
type: YKL-luokka
alternative label: Uiguriska, sagor (85.1914) @sv
alternative label: Uiguurin kieli, sadut (85.1914)
broader: Turkkilaisilla kielillä julkaistut sadut
in scheme: YKL - Yleisten kirjastojen luokitusjärjestelmä
notation: 85.1914
preferred label: Fairy tales in Uighur language @en
preferred label: Sagor på uiguriska @sv

Uzbekinkieliset sadut
type: Concept
type: YKL-luokka
alternative label: Uzbekin kieli, sadut (85.1915)
alternative label: Uzbekiska, sagor (85.1915) @sv
broader: Turkkilaisilla kielillä julkaistut sadut
in scheme: YKL - Yleisten kirjastojen luokitusjärjestelmä
notation: 85.1915
preferred label: Fairy tales in Uzbek language @en
preferred label: Sagor på uzbekiska @sv

Afroaasialaisilla kielillä julkaistut sadut
type: Concept
type: YKL-luokka
broader: Muilla kielillä julkaistut sadut
in scheme: YKL - Yleisten kirjastojen luokitusjärjestelmä
narrower: Hepreankieliset sadut
narrower: Arabiankieliset sadut
narrower: Amharankieliset sadut
narrower: Tigrinjankieliset sadut
narrower: Somalinkieliset sadut
notation: 85.192
preferred label: Fairy tales in Afroasiatic languages @en
preferred label: Sagor på afroasiatiska @sv

Hepreankieliset sadut
type: Concept
type: YKL-luokka
alternative label: Hebreisk skönlitteratur, sagor (85.1922) @sv
alternative label: Hebreiska, sagor (85.1922) @sv
alternative label: Heprean kieli, sadut (85.1922)
alternative label: Hepreankielinen kaunokirjallisuus, sadut (85.1922)
broader: Afroaasialaisilla kielillä julkaistut sadut
in scheme: YKL - Yleisten kirjastojen luokitusjärjestelmä
notation: 85.1922
preferred label: Fairy tales in Hebrew @en
preferred label: Sagor på hebreiska @sv

Arabiankieliset sadut
type: Concept
type: YKL-luokka
alternative label: Arabian kieli, sadut (85.1923)
alternative label: Arabiankielinen kaunokirjallisuus, sadut (85.1923)
alternative label: Arabisk skönlitteratur, sagor (85.1923) @sv
alternative label: Arabiska, sagor (85.1923) @sv
broader: Afroaasialaisilla kielillä julkaistut sadut
in scheme: YKL - Yleisten kirjastojen luokitusjärjestelmä
notation: 85.1923
preferred label: Fairy tales in Arabic @en
preferred label: Sagor på arabiska @sv

Amharankieliset sadut
type: Concept
type: YKL-luokka
alternative label: Amharan kieli, sadut (85.1924)
alternative label: Amhariska, sagor (85.1924) @sv
broader: Afroaasialaisilla kielillä julkaistut sadut
in scheme: YKL - Yleisten kirjastojen luokitusjärjestelmä
notation: 85.1924
preferred label: Fairy tales in Amharic language @en
preferred label: Sagor på amhariska @sv

Tigrinjankieliset sadut
type: Concept
type: YKL-luokka
alternative label: Tigrinja, sagor (85.1925) @sv
alternative label: Tigrinjan kieli, sadut (85.1925)
broader: Afroaasialaisilla kielillä julkaistut sadut
in scheme: YKL - Yleisten kirjastojen luokitusjärjestelmä
notation: 85.1925
preferred label: Fairy tales in Tigrinya language @en
preferred label: Sagor på tigrinja @sv

Somalinkieliset sadut
type: Concept
type: YKL-luokka
alternative label: Somalin kieli, sadut (85.1926)
alternative label: Somaliska, sagor (85.1926) @sv
broader: Afroaasialaisilla kielillä julkaistut sadut
in scheme: YKL - Yleisten kirjastojen luokitusjärjestelmä
notation: 85.1926
preferred label: Fairy tales in Somali language @en
preferred label: Sagor på somaliska @sv

Sinotiibetiläisillä ja austroaasialaisilla kielillä julkaistut sadut
type: Concept
type: YKL-luokka
broader: Muilla kielillä julkaistut sadut
in scheme: YKL - Yleisten kirjastojen luokitusjärjestelmä
narrower: Kiinankieliset sadut
narrower: Burmankieliset sadut
narrower: Kareninkieliset sadut
narrower: Thainkieliset sadut
narrower: Vietnaminkieliset sadut
narrower: Khmerinkieliset sadut
notation: 85.194
preferred label: Fairy tales in Sino-Tibetan and Austroasiatic languages @en
preferred label: Sagor på sinotibetanska och austroasiatiska språk @sv

Kiinankieliset sadut
type: Concept
type: YKL-luokka
alternative label: Kiinan kieli, sadut (85.1943)
alternative label: Kiinankielinen kaunokirjallisuus, sadut (85.1943)
alternative label: Kinesisk skönlitteratur, sagor (85.1943) @sv
alternative label: Kinesiska, sagor (85.1943) @sv
broader: Sinotiibetiläisillä ja austroaasialaisilla kielillä julkaistut sadut
in scheme: YKL - Yleisten kirjastojen luokitusjärjestelmä
notation: 85.1943
preferred label: Fairy tales in Chinese @en
preferred label: Sagor på kinesiska @sv

Burmankieliset sadut
type: Concept
type: YKL-luokka
alternative label: Burman kieli, sadut (85.1944)
alternative label: Burmesiska, sagor (85.1944) @sv
broader: Sinotiibetiläisillä ja austroaasialaisilla kielillä julkaistut sadut
in scheme: YKL - Yleisten kirjastojen luokitusjärjestelmä
notation: 85.1944
preferred label: Fairy tales in Burmese language @en
preferred label: Sagor på burmesiska @sv

Kareninkieliset sadut
type: Concept
type: YKL-luokka
alternative label: Karenin kieli, sadut (85.1945)
alternative label: Karenska, sagor (85.1945) @sv
broader: Sinotiibetiläisillä ja austroaasialaisilla kielillä julkaistut sadut
in scheme: YKL - Yleisten kirjastojen luokitusjärjestelmä
notation: 85.1945
preferred label: Fairy tales in Karen languages @en
preferred label: Sagor på karenska @sv

Thainkieliset sadut
type: Concept
type: YKL-luokka
alternative label: Thai, sagor (85.1946) @sv
alternative label: Thailändsk skönlitteratur, sagor (85.1946) @sv
alternative label: Thain kieli, sadut (85.1946)
alternative label: Thainkielinen kaunokirjallisuus, sadut (85.1946)
broader: Sinotiibetiläisillä ja austroaasialaisilla kielillä julkaistut sadut
in scheme: YKL - Yleisten kirjastojen luokitusjärjestelmä
notation: 85.1946
preferred label: Fairy tales in Thai @en
preferred label: Sagor på thailändska @sv

Vietnaminkieliset sadut
type: Concept
type: YKL-luokka
alternative label: Vietnamesisk skönlitteratur, sagor (85.1948) @sv
alternative label: Vietnamesiska, sagor (85.1948) @sv
alternative label: Vietnamin kieli, sadut (85.1948)
alternative label: Vietnaminkielinen kaunokirjallisuus, sadut (85.1948)
broader: Sinotiibetiläisillä ja austroaasialaisilla kielillä julkaistut sadut
in scheme: YKL - Yleisten kirjastojen luokitusjärjestelmä
notation: 85.1948
preferred label: Fairy tales in Vietnamese @en
preferred label: Sagor på vietnamesiska @sv

Khmerinkieliset sadut
type: Concept
type: YKL-luokka
alternative label: Khmer, sagor (85.1949) @sv
alternative label: Khmerin kieli, sadut (85.1949)
broader: Sinotiibetiläisillä ja austroaasialaisilla kielillä julkaistut sadut
in scheme: YKL - Yleisten kirjastojen luokitusjärjestelmä
notation: 85.1949
preferred label: Fairy tales in Khmer language @en
preferred label: Sagor på khmer @sv

Japanin- ja koreankieliset sadut
type: Concept
type: YKL-luokka
broader: Muilla kielillä julkaistut sadut
in scheme: YKL - Yleisten kirjastojen luokitusjärjestelmä
narrower: Japaninkieliset sadut
narrower: Koreankieliset sadut
notation: 85.195
preferred label: Fairy tales in Japanese. Fairy tales in Korean @en
preferred label: Sagor på japanska. Sagor på koreanska @sv

Japaninkieliset sadut
type: Concept
type: YKL-luokka
alternative label: Japanin kieli, sadut (85.1951)
alternative label: Japaninkielinen kaunokirjallisuus, sadut (85.1951)
alternative label: Japansk skönlitteratur, sagor (85.1951) @sv
alternative label: Japanska, sagor (85.1951) @sv
broader: Japanin- ja koreankieliset sadut
in scheme: YKL - Yleisten kirjastojen luokitusjärjestelmä
notation: 85.1951
preferred label: Fairy tales in Japanese @en
preferred label: Sagor på japanska @sv

Koreankieliset sadut
type: Concept
type: YKL-luokka
alternative label: Korean kieli, sadut (85.1955)
alternative label: Koreankielinen kaunokirjallisuus, sadut (85.1955)
alternative label: Koreansk skönlitteratur, sagor (85.1955) @sv
alternative label: Koreanska, sagor (85.1955) @sv
broader: Japanin- ja koreankieliset sadut
in scheme: YKL - Yleisten kirjastojen luokitusjärjestelmä
notation: 85.1955
preferred label: Fairy tales in Korean @en
preferred label: Sagor på koreanska @sv

Afrikkalaisilla kielillä julkaistut sadut
type: Concept
type: YKL-luokka
broader: Muilla kielillä julkaistut sadut
in scheme: YKL - Yleisten kirjastojen luokitusjärjestelmä
narrower: Swahilinkieliset sadut
narrower: Lingalankieliset sadut
notation: 85.196
preferred label: Fairy tales in African languages @en
preferred label: Sagor på afrikanska språk @sv
scope note: Hit sagor på afrikanska språk som talas söder om Sahara, Etiopien och Somalia @sv
scope note: Tähän Saharan, Etiopian ja Somalian eteläpuolella puhutuilla afrikkalaisilla kielillä julkaistut sadut

Swahilinkieliset sadut
type: Concept
type: YKL-luokka
alternative label: Swahili, sagor (85.1961) @sv
alternative label: Swahilin kieli, sadut (85.1961)
broader: Afrikkalaisilla kielillä julkaistut sadut
in scheme: YKL - Yleisten kirjastojen luokitusjärjestelmä
notation: 85.1961
preferred label: Fairy tales in Swahili language @en
preferred label: Sagor på afrikanska språk @sv

Lingalankieliset sadut
type: Concept
type: YKL-luokka
alternative label: Lingala, sagor (85.1962) @sv
alternative label: Lingalan kieli, sadut (85.1962)
broader: Afrikkalaisilla kielillä julkaistut sadut
in scheme: YKL - Yleisten kirjastojen luokitusjärjestelmä
notation: 85.1962
preferred label: Fairy tales in Lingala language @en
preferred label: Sagor på lingala @sv

Kaukasialaisilla kielillä julkaistut sadut
type: Concept
type: YKL-luokka
broader: Muilla kielillä julkaistut sadut
in scheme: YKL - Yleisten kirjastojen luokitusjärjestelmä
narrower: Georgiankieliset sadut
narrower: Abhaasin, kabardin ja adygenkieliset sadut
narrower: Tšetšeeninkieliset sadut
notation: 85.197
preferred label: Fairy tales in Caucasian languages @en
preferred label: Sagor på kaukasiska spåk @sv

Georgiankieliset sadut
type: Concept
type: YKL-luokka
alternative label: Georgian kieli, sadut (85.1971)
alternative label: Georgiska, sagor (85.1971) @sv
broader: Kaukasialaisilla kielillä julkaistut sadut
in scheme: YKL - Yleisten kirjastojen luokitusjärjestelmä
notation: 85.1971
preferred label: Fairy tales in Georgian language @en
preferred label: Sagor på georgiska @sv

Abhaasin, kabardin ja adygenkieliset sadut
type: Concept
type: YKL-luokka
alternative label: Abchaziska, sagor (85.1972) @sv
alternative label: Abhaasin kieli, sadut (85.1972)
alternative label: Adygeiska, sagor (85.1972) @sv
alternative label: Adygen kieli, sadut (85.1972)
alternative label: Kabardin kieli, sadut (85.1972)
alternative label: Kabardinska, sagor (85.1972) @sv
broader: Kaukasialaisilla kielillä julkaistut sadut
in scheme: YKL - Yleisten kirjastojen luokitusjärjestelmä
notation: 85.1972
preferred label: Fairy tales in Abkhaz, Kabardian and Adyghe languages @en
preferred label: Sagor på abchaziska, kabardinska och adygeiska @sv

Tšetšeeninkieliset sadut
type: Concept
type: YKL-luokka
alternative label: Tjetjenska, sagor (85.1973) @sv
alternative label: Tšetšeenin kieli, sadut (85.1973)
broader: Kaukasialaisilla kielillä julkaistut sadut
in scheme: YKL - Yleisten kirjastojen luokitusjärjestelmä
notation: 85.1973
preferred label: Fairy tales in Chechen language @en
preferred label: Sagor på tjetjenska @sv

Eskimo- ja intiaanikielillä julkaistut sadut
type: Concept
type: YKL-luokka
broader: Muilla kielillä julkaistut sadut
in scheme: YKL - Yleisten kirjastojen luokitusjärjestelmä
narrower: Grönlanninkieliset sadut
notation: 85.198
preferred label: Fairy tales in Eskimo and Indian languages @en
preferred label: Sagor på eskimå- och indianspråk @sv

Grönlanninkieliset sadut
type: Concept
type: YKL-luokka
alternative label: Grönlannin kieli, sadut (85.1981)
alternative label: Grönländska, sagor (85.1981) @sv
broader: Eskimo- ja intiaanikielillä julkaistut sadut
in scheme: YKL - Yleisten kirjastojen luokitusjärjestelmä
notation: 85.1981
preferred label: Fairy tales in Greenlandic language @en
preferred label: Sagor på grönländska @sv

Muilla ei-indoeurooppalaisilla kielillä julkaistut sadut
type: Concept
type: YKL-luokka
broader: Muilla kielillä julkaistut sadut
in scheme: YKL - Yleisten kirjastojen luokitusjärjestelmä
narrower: Keinotekoisilla kielillä julkaistut sadut
narrower: Baskinkieliset sadut
narrower: Dravidakieliset sadut
narrower: Austronesialaisilla kielillä julkaistut sadut
notation: 85.199
preferred label: Fairy tales in other Non-Indoeuropean languages @en
preferred label: Sagor på övriga icke-indoeuropeiska språk @sv

Keinotekoisilla kielillä julkaistut sadut
type: Concept
type: YKL-luokka
broader: Muilla ei-indoeurooppalaisilla kielillä julkaistut sadut
in scheme: YKL - Yleisten kirjastojen luokitusjärjestelmä
notation: 85.1991
preferred label: Fairy tales in artificial languages @en
preferred label: Sagor på artificiella språk @sv

Baskinkieliset sadut
type: Concept
type: YKL-luokka
alternative label: Baskin kieli, sadut (85.1992)
alternative label: Baskiska, sagor (85.1992) @sv
broader: Muilla ei-indoeurooppalaisilla kielillä julkaistut sadut
in scheme: YKL - Yleisten kirjastojen luokitusjärjestelmä
notation: 85.1992
preferred label: Fairy tales in Basque language @en
preferred label: Sagor på baskiska @sv

Dravidakieliset sadut
type: Concept
type: YKL-luokka
broader: Muilla ei-indoeurooppalaisilla kielillä julkaistut sadut
in scheme: YKL - Yleisten kirjastojen luokitusjärjestelmä
narrower: Malajalaminkieliset sadut
narrower: Kannadankieliset sadut
narrower: Tamilinkieliset sadut
narrower: Telugunkieliset sadut
notation: 85.1994
preferred label: Fairy tales in Dravidian languages @en
preferred label: Sagor på dravidiska @sv

Malajalaminkieliset sadut
type: Concept
type: YKL-luokka
alternative label: Malajalamin kieli, sadut (85.19941)
alternative label: Malayalam, sagor (85.19941) @sv
broader: Dravidakieliset sadut
in scheme: YKL - Yleisten kirjastojen luokitusjärjestelmä
notation: 85.19941
preferred label: Fairy tales in Malayalam language @en
preferred label: Sagor på malayalam @sv

Kannadankieliset sadut
type: Concept
type: YKL-luokka
alternative label: Kannada, sagor (85.19942) @sv
alternative label: Kannadan kieli, sadut (85.19942)
broader: Dravidakieliset sadut
in scheme: YKL - Yleisten kirjastojen luokitusjärjestelmä
notation: 85.19942
preferred label: Fairy tales in Kannada language @en
preferred label: Sagor på kannada @sv

Tamilinkieliset sadut
type: Concept
type: YKL-luokka
alternative label: Tamil, sagor (85.19943) @sv
alternative label: Tamilin kieli, sadut (85.19943)
broader: Dravidakieliset sadut
in scheme: YKL - Yleisten kirjastojen luokitusjärjestelmä
notation: 85.19943
preferred label: Fairy tales in Tamil language @en
preferred label: Sagor på tamil @sv

Telugunkieliset sadut
type: Concept
type: YKL-luokka
alternative label: Telugu, sagor (85.19944) @sv
alternative label: Telugun kieli, sadut (85.19944)
broader: Dravidakieliset sadut
in scheme: YKL - Yleisten kirjastojen luokitusjärjestelmä
notation: 85.19944
preferred label: Fairy tales in Telugu language @en
preferred label: Sagor på telugu @sv

Austronesialaisilla kielillä julkaistut sadut
type: Concept
type: YKL-luokka
broader: Muilla ei-indoeurooppalaisilla kielillä julkaistut sadut
in scheme: YKL - Yleisten kirjastojen luokitusjärjestelmä
narrower: Tagaloginkieliset sadut
narrower: Malaijinkieliset sadut
narrower: Indonesiankieliset sadut
notation: 85.1995
preferred label: Fairy tales in Austronesian languages @en
preferred label: Sagor på austronesiska @sv

Tagaloginkieliset sadut
type: Concept
type: YKL-luokka
alternative label: Tagalog, sagor (85.19951) @sv
alternative label: Tagalogin kieli, sadut (85.19951)
broader: Austronesialaisilla kielillä julkaistut sadut
in scheme: YKL - Yleisten kirjastojen luokitusjärjestelmä
notation: 85.19951
preferred label: Fairy tales in Tagalog language @en
preferred label: Sagor på tagalog @sv

Malaijinkieliset sadut
type: Concept
type: YKL-luokka
alternative label: Malaijin kieli, sadut (85.19952)
alternative label: Malajiska, sagor (85.19952) @sv
broader: Austronesialaisilla kielillä julkaistut sadut
in scheme: YKL - Yleisten kirjastojen luokitusjärjestelmä
notation: 85.19952
preferred label: Fairy tales in Malay language @en
preferred label: Sagor på malajiska @sv

Indonesiankieliset sadut
type: Concept
type: YKL-luokka
alternative label: Indonesian kieli, sadut (85.19953)
alternative label: Indonesiska, sagor (85.19953) @sv
broader: Austronesialaisilla kielillä julkaistut sadut
in scheme: YKL - Yleisten kirjastojen luokitusjärjestelmä
notation: 85.19953
preferred label: Fairy tales in Indonesian language @en
preferred label: Sagor på indonesiska @sv

KUVAKIRJAT
type: Concept
References: MAALAUSTAIDE. PIIRUSTUSTAIDE
References: Pilapiirrokset. Karikatyyrit
References: Kuvitustaide
References: SADUT
References: SARJAKUVAT
References: Lasten- ja nuortenkirjallisuuden historia ja tutkimus
type: YKL-luokka
alternative label: Bilderböcker, skönlitteratur (85.2+) @sv
alternative label: Diktbilderböcker (85.2+) @sv
alternative label: Kuvakirjat, kaunokirjallisuus (85.2+)
alternative label: Kuvalliset vitsit (85.2)
alternative label: Meemit, vitsit (85.2)
alternative label: Memer, vitsar (85.2) @sv
alternative label: Runokuvakirjat (85.2+)
alternative label: Skämtteckningar (85.2) @sv
alternative label: Vitser, illustrerade (85.2+) @sv
alternative label: Vitsit, kuvalliset (85.2+)
broader: SADUT. KUVAKIRJAT. SARJAKUVAT
in scheme: YKL - Yleisten kirjastojen luokitusjärjestelmä
narrower: Suomenkieliset kuvakirjat
narrower: Pohjoismaisilla kielillä julkaistut kuvakirjat
narrower: Saksankieliset kuvakirjat
narrower: Englanninkieliset kuvakirjat
narrower: Romaanisilla kielillä julkaistut kuvakirjat
narrower: Slaavilaisilla ja balttilaisilla kielillä julkaistut kuvakirjat
narrower: Muilla indoeurooppalaisilla kielillä julkaistut kuvakirjat
narrower: Muilla kielillä julkaistut kuvakirjat
notation: 85.2
preferred label: BILDERBÖCKER @sv
preferred label: PICTURE BOOKS @en
scope note: Hit och till underklasserna bilderböcker och illustrerade vitser för barn eller vuxna som räknas till skönlitteraturen Hit och till underklasserna också bilderböcker med text i versform samt andra bilderböcker med utgångspunkt i skönlitterära genrer Verken klassificeras enligt publikationens språk, inte efter originalspråk eller publikationsland Om det ena språket i ett tvåspråkigt verk är översättningsspråk klassificeras verket efter detta språk Om texterna i ett två- eller flerspråkigt verk inte är översättningar av varandra klassificeras verket efter publikationens huvudspråk Om verket inte har något huvudspråk klassificeras det efter publikationens första språk Formtilläggen 01, 02, 03+, 06+, 07, 08+ och 09 används inte i samband med klasserna 80-85+ @sv
scope note: Tähän ja alaluokkiin aikuisille tai lapsille tarkoitetut kaunokirjallisuuteen kuuluvat kuvakirjat ja kuvalliset vitsit Tähän ja alaluokkiin myös tekstiltään runomuotoiset kuvakirjat sekä muiden kaunokirjallisuustyyppien pohjalta laaditut kuvakirjat Teokset luokitetaan julkaisun kielen, ei julkaisumaan tai alkuteoksen kielen mukaan Jos kaksikielisen teoksen toinen kieli on käännöskieli, luokitetaan teos käännöskielen mukaan Jos kaksi- tai useampikielisen teoksen tekstit eivät ole toistensa käännöksiä, luokitetaan teos julkaisun pääkielen mukaan Jos teoksella ei ole pääkieltä, se luokitetaan julkaisun ensimmäisen kielen mukaan Muotoluokkia 01, 02, 03+, 06+, 07, 08+ ja 09 ei käytetä luokkien 80-85+ yhteydessä

Suomenkieliset kuvakirjat
type: Concept
type: YKL-luokka
alternative label: Finsk skönlitteratur, bilderböcker (85.22) @sv
alternative label: Finska, bilderböcker (85.22) @sv
alternative label: Suomen kieli, kuvakirjat (85.22)
alternative label: Suomenkielinen kaunokirjallisuus, kuvakirjat (85.22)
broader: KUVAKIRJAT
in scheme: YKL - Yleisten kirjastojen luokitusjärjestelmä
narrower: Meänkieliset kuvakirjat
narrower: Kveeninkieliset kuvakirjat
narrower: Vironkieliset kuvakirjat
narrower: Muilla itämerensuomalaisilla kielillä julkaistut kuvakirjat
narrower: Muilla suomalais-ugrilaisilla ja uralilaisilla kielillä julkaistut kuvakirjat
notation: 85.22
preferred label: Bilderböcker på finska @sv
preferred label: Picture books in Finnish @en

Meänkieliset kuvakirjat
type: Concept
type: YKL-luokka
alternative label: Meänkieli, bilderböcker (85.221) @sv
alternative label: Meänkieli, kuvakirjat (85.221)
alternative label: Meänkielinen kaunokirjallisuus, kuvakirjat (85.221)
alternative label: Skönlitteratur på meänkieli, bilderböcker (85.221) @sv
alternative label: Skönlitteratur på tornedalsfinska, bilderböcker (85.221) @sv
broader: Suomenkieliset kuvakirjat
in scheme: YKL - Yleisten kirjastojen luokitusjärjestelmä
notation: 85.221
preferred label: Bilderböcker på meänkieli @sv
preferred label: Picture books in Meänkieli @en

Kveeninkieliset kuvakirjat
type: Concept
type: YKL-luokka
alternative label: Kveenin kieli, kuvakirjat (85.222)
alternative label: Kveeninkielinen kaunokirjallisuus, kuvakirjat (85.222)
alternative label: Kvänsk skönlitteratur, bilderböcker (85.222) @sv
alternative label: Kvänska, bilderböcker (85.222) @sv
broader: Suomenkieliset kuvakirjat
in scheme: YKL - Yleisten kirjastojen luokitusjärjestelmä
notation: 85.222
preferred label: Bilderböcker på kvänska @sv
preferred label: Picture books in Kven language @en

Vironkieliset kuvakirjat
type: Concept
type: YKL-luokka
alternative label: Estnisk skönlitteratur, bilderböcker (85.223) @sv
alternative label: Estniska, bilderböcker (85.223) @sv
alternative label: Viron kieli, kuvakirjat (85.223)
alternative label: Vironkielinen kaunokirjallisuus, kuvakirjat (85.223)
broader: Suomenkieliset kuvakirjat
in scheme: YKL - Yleisten kirjastojen luokitusjärjestelmä
notation: 85.223
preferred label: Bilderböcker på estniska @sv
preferred label: Picture books in Estonian @en

Muilla itämerensuomalaisilla kielillä julkaistut kuvakirjat
type: Concept
type: YKL-luokka
broader: Suomenkieliset kuvakirjat
in scheme: YKL - Yleisten kirjastojen luokitusjärjestelmä
narrower: Karjajalankieliset kuvakirjat
notation: 85.224
preferred label: Bilderböcker på övriga östersjöfinska språk @sv
preferred label: Picture books in other Balto-Finnic languages @en

Karjajalankieliset kuvakirjat
type: Concept
type: YKL-luokka
alternative label: Karelska, bilderböcker (85.2241) @sv
alternative label: Karjalan kieli, kuvakirjat (85.2241)
broader: Muilla itämerensuomalaisilla kielillä julkaistut kuvakirjat
in scheme: YKL - Yleisten kirjastojen luokitusjärjestelmä
notation: 85.2241
preferred label: Bilderböcker på karelska @sv
preferred label: Picture books in Karelian language @en

Muilla suomalais-ugrilaisilla ja uralilaisilla kielillä julkaistut kuvakirjat
type: Concept
type: YKL-luokka
broader: Suomenkieliset kuvakirjat
in scheme: YKL - Yleisten kirjastojen luokitusjärjestelmä
narrower: Unkarinkieliset kuvakirjat
narrower: Saamenkieliset kuvakirjat
notation: 85.225
preferred label: Bilderböcker på övriga finsk-ugriska och uraliska språk @sv
preferred label: Picture books in other Finno-Ugric and Uralic languages @en

Unkarinkieliset kuvakirjat
type: Concept
type: YKL-luokka
alternative label: Ungersk skönlitteratur, bilderböcker (85.2251) @sv
alternative label: Ungerska, bilderböcker (85.2251) @sv
alternative label: Unkarin kieli, kuvakirjat (85.2251)
alternative label: Unkarinkielinen kaunokirjallisuus, kuvakirjat (85.2251)
broader: Muilla suomalais-ugrilaisilla ja uralilaisilla kielillä julkaistut kuvakirjat
in scheme: YKL - Yleisten kirjastojen luokitusjärjestelmä
notation: 85.2251
preferred label: Bilderböcker på ungerska @sv
preferred label: Picture books in Hungarian @en

Saamenkieliset kuvakirjat
type: Concept
type: YKL-luokka
alternative label: Saamen kieli, kuvakirjat (85.2252)
alternative label: Saamenkielinen kaunokirjallisuus, kuvakirjat (85.2252)
alternative label: Samisk skönlitteratur, bilderböcker (85.2252) @sv
alternative label: Samiska, bilderböcker (85.2252) @sv
broader: Muilla suomalais-ugrilaisilla ja uralilaisilla kielillä julkaistut kuvakirjat
in scheme: YKL - Yleisten kirjastojen luokitusjärjestelmä
notation: 85.2252
preferred label: Bilderböcker på samiska @sv
preferred label: Picture books in Sami @en

Pohjoismaisilla kielillä julkaistut kuvakirjat
type: Concept
type: YKL-luokka
broader: KUVAKIRJAT
in scheme: YKL - Yleisten kirjastojen luokitusjärjestelmä
narrower: Ruotsinkieliset kuvakirjat
narrower: Norjankieliset kuvakirjat
narrower: Tanskankieliset kuvakirjat
narrower: Islanninkieliset kuvakirjat
narrower: Fäärinkieliset kuvakirjat
notation: 85.23
preferred label: Bilderböcker på nordiska språk @sv
preferred label: Picture books in Nordic languages @en

Ruotsinkieliset kuvakirjat
type: Concept
type: YKL-luokka
alternative label: Ruotsin kieli, kuvakirjat (85.231)
alternative label: Ruotsinkielinen kaunokirjallisuus, kuvakirjat (85.231)
alternative label: Svensk skönlitteratur, bilderböcker (85.231) @sv
alternative label: Svenska, bilderböcker (85.231) @sv
broader: Pohjoismaisilla kielillä julkaistut kuvakirjat
in scheme: YKL - Yleisten kirjastojen luokitusjärjestelmä
notation: 85.231
preferred label: Bilderböcker på svenska @sv
preferred label: Picture books in Swedish @en

Norjankieliset kuvakirjat
type: Concept
type: YKL-luokka
alternative label: Norjan kieli, kuvakirjat (85.232)
alternative label: Norjankielinen kaunokirjallisuus, kuvakirjat (85.232)
alternative label: Norsk skönlitteratur, bilderböcker (85.232) @sv
alternative label: Norska, bilderböcker (85.232) @sv
broader: Pohjoismaisilla kielillä julkaistut kuvakirjat
in scheme: YKL - Yleisten kirjastojen luokitusjärjestelmä
notation: 85.232
preferred label: Bilderböcker på norska @sv
preferred label: Picture books in Norwegian @en

Tanskankieliset kuvakirjat
type: Concept
type: YKL-luokka
alternative label: Dansk skönlitteratur, bilderböcker (85.233) @sv
alternative label: Danska, bilderböcker (85.233) @sv
alternative label: Tanskan kieli, kuvakirjat (85.233)
alternative label: Tanskankielinen kaunokirjallisuus, kuvakirjat (85.233)
broader: Pohjoismaisilla kielillä julkaistut kuvakirjat
in scheme: YKL - Yleisten kirjastojen luokitusjärjestelmä
notation: 85.233
preferred label: Bilderböcker på danska @sv
preferred label: Picture books in Danish @en

Islanninkieliset kuvakirjat
type: Concept
type: YKL-luokka
alternative label: Islannin kieli, kuvakirjat (85.234)
alternative label: Islanninkielinen kaunokirjallisuus, kuvakirjat (85.234)
alternative label: Isländsk skönlitteratur, bilderböcker (85.234) @sv
alternative label: Isländska, bilderböcker (85.234) @sv
broader: Pohjoismaisilla kielillä julkaistut kuvakirjat
in scheme: YKL - Yleisten kirjastojen luokitusjärjestelmä
notation: 85.234
preferred label: Bilderböcker på isländska @sv
preferred label: Picture books in Icelandic @en

Fäärinkieliset kuvakirjat
type: Concept
type: YKL-luokka
alternative label: Färöisk skönlitteratur, bilderböcker (85.235) @sv
alternative label: Färöiska, bilderböcker (85.235) @sv
alternative label: Fäärin kieli, kuvakirjat (85.235)
alternative label: Fäärinkielinen kaunokirjallisuus, kuvakirjat (85.235)
broader: Pohjoismaisilla kielillä julkaistut kuvakirjat
in scheme: YKL - Yleisten kirjastojen luokitusjärjestelmä
notation: 85.235
preferred label: Bilderböcker på färöiska @sv
preferred label: Picture books in Faeroese @en

Saksankieliset kuvakirjat
type: Concept
type: YKL-luokka
alternative label: Saksan kieli, kuvakirjat (85.24)
alternative label: Saksankielinen kaunokirjallisuus, kuvakirjat (85.24)
alternative label: Tysk skönlitteratur, bilderböcker (85.24) @sv
alternative label: Tyska, bilderböcker (85.24) @sv
broader: KUVAKIRJAT
in scheme: YKL - Yleisten kirjastojen luokitusjärjestelmä
narrower: Jiddišinkieliset kuvakirjat
narrower: Friisinkieliset kuvakirjat
narrower: Hollanninkieliset kuvakirjat
notation: 85.24
preferred label: Bilderböcker på tyska @sv
preferred label: Picture books in German @en
scope note: Hit och till underklassen också bilderböcker på andra germanska språk Hit bilderböcker på jiddisch @sv
scope note: Tähän ja alaluokkaan myös muilla germaanisilla kielillä julkaistut kuvakirjat Tähän jiddisinkieliset kuvakirjat

Jiddišinkieliset kuvakirjat
type: Concept
type: YKL-luokka
alternative label: Jiddisch, bilderböcker (85.241) @sv
alternative label: Jiddišin kieli, kuvakirjat (85.241)
broader: Saksankieliset kuvakirjat
in scheme: YKL - Yleisten kirjastojen luokitusjärjestelmä
notation: 85.241
preferred label: Bilderböcker på jiddisch @sv
preferred label: Picture books in Yiddish language @en

Friisinkieliset kuvakirjat
type: Concept
type: YKL-luokka
broader: Saksankieliset kuvakirjat
in scheme: YKL - Yleisten kirjastojen luokitusjärjestelmä
notation: 85.243
preferred label: Bilderböcker på frisiska @sv
preferred label: Picture books in Frisian @en

Hollanninkieliset kuvakirjat
type: Concept
type: YKL-luokka
alternative label: Hollannin kieli, kuvakirjat (85.248)
alternative label: Hollanninkielinen kaunokirjallisuus, kuvakirjat (85.248)
alternative label: Nederländsk skönlitteratur, bilderböcker (85.248) @sv
alternative label: Nederländska, bilderböcker (85.248) @sv
broader: Saksankieliset kuvakirjat
in scheme: YKL - Yleisten kirjastojen luokitusjärjestelmä
narrower: Afrikaansinkieliset kuvakirjat
notation: 85.248
preferred label: Bilderböcker på holländska @sv
preferred label: Picture books in Dutch @en
scope note: Hit också bilderböcker på flamländska @sv
scope note: Tähän myös flaaminkieliset kuvakirjat

Afrikaansinkieliset kuvakirjat
type: Concept
type: YKL-luokka
alternative label: Afrikaans, bilderböcker (85.2481) @sv
alternative label: Afrikaansin kieli, kuvakirjat (85.2481)
broader: Hollanninkieliset kuvakirjat
in scheme: YKL - Yleisten kirjastojen luokitusjärjestelmä
notation: 85.2481
preferred label: Bilderböcker på afrikaans @sv
preferred label: Picture books in Afrikaans language @en
scope note: Hit också bilderböcker på flamländska @sv
scope note: Tähän myös flaaminkieliset kuvakirjat

Englanninkieliset kuvakirjat
type: Concept
type: YKL-luokka
alternative label: Engelsk skönlitteratur, bilderböcker (85.25) @sv
alternative label: Engelska, bilderböcker (85.25) @sv
alternative label: Englannin kieli, kuvakirjat (85.25)
alternative label: Englanninkielinen kaunokirjallisuus, kuvakirjat (85.25)
broader: KUVAKIRJAT
in scheme: YKL - Yleisten kirjastojen luokitusjärjestelmä
notation: 85.25
preferred label: Bilderböcker på engelska @sv
preferred label: Picture books in English @en

Romaanisilla kielillä julkaistut kuvakirjat
type: Concept
type: YKL-luokka
broader: KUVAKIRJAT
in scheme: YKL - Yleisten kirjastojen luokitusjärjestelmä
narrower: Ranskankieliset kuvakirjat
narrower: Italiankieliset kuvakirjat
narrower: Espanjankieliset kuvakirjat
narrower: Portugalinkieliset kuvakirjat
narrower: Romaniankieliset kuvakirjat
narrower: Muilla romaanisilla kielillä julkaistut kuvakirjat
notation: 85.26
preferred label: Bilderböcker på romanska språk @sv
preferred label: Picture books in Romanic languages @en

Ranskankieliset kuvakirjat
type: Concept
type: YKL-luokka
alternative label: Fransk skönlitteratur, bilderböcker (85.261) @sv
alternative label: Franska, bilderböcker (85.261) @sv
alternative label: Ranskan kieli, kuvakirjat (85.261)
alternative label: Ranskankielinen kaunokirjallisuus, kuvakirjat (85.261)
broader: Romaanisilla kielillä julkaistut kuvakirjat
in scheme: YKL - Yleisten kirjastojen luokitusjärjestelmä
notation: 85.261
preferred label: Bilderböcker på franska @sv
preferred label: Picture books in French @en

Italiankieliset kuvakirjat
type: Concept
type: YKL-luokka
alternative label: Italian kieli, kuvakirjat (85.262)
alternative label: Italiankielinen kaunokirjallisuus, kuvakirjat (85.262)
alternative label: Italiensk skönlitteratur, bilderböcker (85.262) @sv
alternative label: Italienska, bilderböcker (85.262) @sv
broader: Romaanisilla kielillä julkaistut kuvakirjat
in scheme: YKL - Yleisten kirjastojen luokitusjärjestelmä
notation: 85.262
preferred label: Bilderböcker på italienska @sv
preferred label: Picture books in Italian @en

Espanjankieliset kuvakirjat
type: Concept
type: YKL-luokka
alternative label: Espanjan kieli, kuvakirjat (85.263)
alternative label: Espanjankielinen kaunokirjallisuus, kuvakirjat (85.263)
alternative label: Spansk skönlitteratur, bilderböcker (85.263) @sv
alternative label: Spanska, bilderböcker (85.263) @sv
broader: Romaanisilla kielillä julkaistut kuvakirjat
in scheme: YKL - Yleisten kirjastojen luokitusjärjestelmä
notation: 85.263
preferred label: Bilderböcker på spanska @sv
preferred label: Picture books in Spanish @en

Portugalinkieliset kuvakirjat
type: Concept
type: YKL-luokka
alternative label: Portugalin kieli, kuvakirjat (85.264)
alternative label: Portugalinkielinen kaunokirjallisuus, kuvakirjat (85.264)
alternative label: Portugisisk skönlitteratur, bilderböcker (85.264) @sv
alternative label: Portugisiska, bilderböcker (85.264) @sv
broader: Romaanisilla kielillä julkaistut kuvakirjat
in scheme: YKL - Yleisten kirjastojen luokitusjärjestelmä
notation: 85.264
preferred label: Bilderböcker på portugisiska @sv
preferred label: Picture books in Portuguese @en

Romaniankieliset kuvakirjat
type: Concept
type: YKL-luokka
alternative label: Romanian kieli, kuvakirjat (85.265)
alternative label: Romaniankielinen kaunokirjallisuus, kuvakirjat (85.265)
alternative label: Rumänsk skönlitteratur, bilderböcker (85.265) @sv
alternative label: Rumänska, bilderböcker (85.265) @sv
broader: Romaanisilla kielillä julkaistut kuvakirjat
in scheme: YKL - Yleisten kirjastojen luokitusjärjestelmä
notation: 85.265
preferred label: Bilderböcker på rumänska @sv
preferred label: Picture books in Romanian @en

Muilla romaanisilla kielillä julkaistut kuvakirjat
type: Concept
type: YKL-luokka
broader: Romaanisilla kielillä julkaistut kuvakirjat
in scheme: YKL - Yleisten kirjastojen luokitusjärjestelmä
narrower: Katalaaninkieliset kuvakirjat
notation: 85.267
preferred label: Bilderböcker på övriga romanska språk @sv
preferred label: Picture books in other Romanic languages @en

Katalaaninkieliset kuvakirjat
type: Concept
type: YKL-luokka
alternative label: Katalaanin kieli, kuvakirjat (85.2671)
alternative label: Katalanska, bilderböcker (85.2671) @sv
broader: Muilla romaanisilla kielillä julkaistut kuvakirjat
in scheme: YKL - Yleisten kirjastojen luokitusjärjestelmä
notation: 85.2671
preferred label: Bilderböcker på katalanska @sv
preferred label: Picture books in Catalan language @en

Slaavilaisilla ja balttilaisilla kielillä julkaistut kuvakirjat
type: Concept
type: YKL-luokka
broader: KUVAKIRJAT
in scheme: YKL - Yleisten kirjastojen luokitusjärjestelmä
narrower: Venäjänkieliset kuvakirjat
narrower: Ukrainankieliset kuvakirjat. Valkovenäjänkieliset kuvakirjat
narrower: Puolankieliset kuvakirjat
narrower: Tšekinkieliset kuvakirjat
narrower: Slovakinkieliset kuvakirjat
narrower: Eteläslaavilaisilla kielillä julkaistut kuvakirjat
narrower: Balttilaisilla kielillä julkaistut kuvakirjat
notation: 85.27
preferred label: Bilderböcker på slaviska och baltiska språk @sv
preferred label: Picture books in Slavonic and Baltic languages @en

Venäjänkieliset kuvakirjat
type: Concept
type: YKL-luokka
alternative label: Rysk skönlitteratur, bilderböcker (85.271) @sv
alternative label: Ryska, bilderböcker (85.271) @sv
alternative label: Venäjän kieli, kuvakirjat (85.271)
alternative label: Venäjänkielinen kaunokirjallisuus, kuvakirjat (85.271)
broader: Slaavilaisilla ja balttilaisilla kielillä julkaistut kuvakirjat
in scheme: YKL - Yleisten kirjastojen luokitusjärjestelmä
notation: 85.271
preferred label: Bilderböcker på ryska @sv
preferred label: Picture books in Russian @en

Ukrainankieliset kuvakirjat. Valkovenäjänkieliset kuvakirjat
type: Concept
type: YKL-luokka
broader: Slaavilaisilla ja balttilaisilla kielillä julkaistut kuvakirjat
in scheme: YKL - Yleisten kirjastojen luokitusjärjestelmä
narrower: Ukrainankieliset kuvakirjat
narrower: Valkovenäjänkieliset kuvakirjat
notation: 85.272
preferred label: Bilderböcker på ukrainska. Bilderböcker på vitryska @sv
preferred label: Picture books in Ukrainian. Picture books in Byelorussian @en

Ukrainankieliset kuvakirjat
type: Concept
type: YKL-luokka
alternative label: Ukrainan kieli, kuvakirjat (85.2721)
alternative label: Ukrainska, bilderböcker (85.2721) @sv
broader: Ukrainankieliset kuvakirjat. Valkovenäjänkieliset kuvakirjat
in scheme: YKL - Yleisten kirjastojen luokitusjärjestelmä
notation: 85.2721
preferred label: Bilderböcker på ukrainska @sv
preferred label: Picture books in Ukrainian @en

Valkovenäjänkieliset kuvakirjat
type: Concept
type: YKL-luokka
alternative label: Valkovenäjän kieli, kuvakirjat (85.2722)
alternative label: Vitryska, bilderböcker (85.2722) @sv
broader: Ukrainankieliset kuvakirjat. Valkovenäjänkieliset kuvakirjat
in scheme: YKL - Yleisten kirjastojen luokitusjärjestelmä
notation: 85.2722
preferred label: Bilderböcker på vitryska @sv
preferred label: Picture books in Byelorussian @en

Puolankieliset kuvakirjat
type: Concept
type: YKL-luokka
alternative label: Polsk skönlitteratur, bilderböcker (85.273) @sv
alternative label: Polska, bilderböcker (85.273) @sv
alternative label: Puolan kieli, kuvakirjat (85.273)
alternative label: Puolankielinen kaunokirjallisuus, kuvakirjat (85.273)
broader: Slaavilaisilla ja balttilaisilla kielillä julkaistut kuvakirjat
in scheme: YKL - Yleisten kirjastojen luokitusjärjestelmä
notation: 85.273
preferred label: Bilderböcker på polska @sv
preferred label: Picture books in Polish @en

Tšekinkieliset kuvakirjat
type: Concept
type: YKL-luokka
alternative label: Tjeckisk skönlitteratur, bilderböcker (85.274) @sv
alternative label: Tjeckiska, bilderböcker (85.274) @sv
alternative label: Tšekin kieli, kuvakirjat (85.274)
alternative label: Tšekinkielinen kaunokirjallisuus, kuvakirjat (85.274)
broader: Slaavilaisilla ja balttilaisilla kielillä julkaistut kuvakirjat
in scheme: YKL - Yleisten kirjastojen luokitusjärjestelmä
notation: 85.274
preferred label: Bilderböcker på tjeckiska @sv
preferred label: Picture books in Czech @en

Slovakinkieliset kuvakirjat
type: Concept
type: YKL-luokka
alternative label: Slovakin kieli, kuvakirjat (85.275)
alternative label: Slovakinkielinen kaunokirjallisuus, kuvakirjat (85.275)
alternative label: Slovakisk skönlitteratur, bilderböcker (85.275) @sv
alternative label: Slovakiska, bilderböcker (85.275) @sv
broader: Slaavilaisilla ja balttilaisilla kielillä julkaistut kuvakirjat
in scheme: YKL - Yleisten kirjastojen luokitusjärjestelmä
notation: 85.275
preferred label: Bilderböcker på slovakiska @sv
preferred label: Picture books in Slovak @en

Eteläslaavilaisilla kielillä julkaistut kuvakirjat
type: Concept
type: YKL-luokka
broader: Slaavilaisilla ja balttilaisilla kielillä julkaistut kuvakirjat
in scheme: YKL - Yleisten kirjastojen luokitusjärjestelmä
narrower: Bulgariankieliset kuvakirjat
narrower: Makedoniankieliset kuvakirjat
narrower: Sloveeninkieliset kuvakirjat
narrower: Serbiankieliset kuvakirjat
narrower: Kroatiankieliset kuvakirjat
narrower: Bosniankieliset kuvakirjat
notation: 85.276
preferred label: Bilderböcker på sydslaviska språk @sv
preferred label: Picture books in South-Slavonic languages @en

Bulgariankieliset kuvakirjat
type: Concept
type: YKL-luokka
alternative label: Bulgarian kieli, kuvakirjat (85.2761)
alternative label: Bulgariankielinen kaunokirjallisuus, kuvakirjat (85.2761)
alternative label: Bulgarisk skönlitteratur, bilderböcker (85.2761) @sv
alternative label: Bulgariska, bilderböcker (85.2761) @sv
broader: Eteläslaavilaisilla kielillä julkaistut kuvakirjat
in scheme: YKL - Yleisten kirjastojen luokitusjärjestelmä
notation: 85.2761
preferred label: Bilderböcker på bulgariska @sv
preferred label: Picture books in Bulgarian @en

Makedoniankieliset kuvakirjat
type: Concept
type: YKL-luokka
alternative label: Makedonian kieli, kuvakirjat (85.2762)
alternative label: Makedoniankielinen kaunokirjallisuus, kuvakirjat (85.2762)
alternative label: Makedonsk skönlitteratur, bilderböcker (85.2762) @sv
alternative label: Makedonska, bilderböcker (85.2762) @sv
broader: Eteläslaavilaisilla kielillä julkaistut kuvakirjat
in scheme: YKL - Yleisten kirjastojen luokitusjärjestelmä
notation: 85.2762
preferred label: Bilderböcker på makedonska @sv
preferred label: Picture books in Macedonian @en

Sloveeninkieliset kuvakirjat
type: Concept
type: YKL-luokka
alternative label: Sloveenin kieli, kuvakirjat (85.2763)
alternative label: Sloveeninkielinen kaunokirjallisuus, kuvakirjat (85.2763)
alternative label: Slovensk skönlitteratur, bilderböcker (85.2763) @sv
alternative label: Slovenska, bilderböcker (85.2763) @sv
broader: Eteläslaavilaisilla kielillä julkaistut kuvakirjat
in scheme: YKL - Yleisten kirjastojen luokitusjärjestelmä
notation: 85.2763
preferred label: Bilderböcker på slovenska @sv
preferred label: Picture books in Slovenian @en

Serbiankieliset kuvakirjat
type: Concept
type: YKL-luokka
alternative label: Serbian kieli, kuvakirjat (85.2764)
alternative label: Serbiankielinen kaunokirjallisuus, kuvakirjat (85.2764)
alternative label: Serbisk skönlitteratur, bilderböcker (85.2764) @sv
alternative label: Serbiska, bilderböcker (85.2764) @sv
broader: Eteläslaavilaisilla kielillä julkaistut kuvakirjat
in scheme: YKL - Yleisten kirjastojen luokitusjärjestelmä
notation: 85.2764
preferred label: Bilderböcker på serbiska @sv
preferred label: Picture books in Serbian @en

Kroatiankieliset kuvakirjat
type: Concept
type: YKL-luokka
alternative label: Kroaatin kieli, kuvakirjat (85.2765)
alternative label: Kroaatinkielinen kaunokirjallisuus, kuvakirjat (85.2765)
alternative label: Kroatian kieli, kuvakirjat (85.2765)
alternative label: Kroatiankielinen kaunokirjallisuus, kuvakirjat (85.2765)
alternative label: Kroatisk skönlitteratur, bilderböcker (85.2765) @sv
alternative label: Kroatiska, bilderböcker (85.2765) @sv
broader: Eteläslaavilaisilla kielillä julkaistut kuvakirjat
in scheme: YKL - Yleisten kirjastojen luokitusjärjestelmä
notation: 85.2765
preferred label: Bilderböcker på kroatiska @sv
preferred label: Picture books in Croatian @en

Bosniankieliset kuvakirjat
type: Concept
type: YKL-luokka
alternative label: Bosnian kieli, kuvakirjat (85.2766)
alternative label: Bosniankielinen kaunokirjallisuus, kuvakirjat (85.2766)
alternative label: Bosnisk skönlitteratur, bilderböcker (85.2766) @sv
alternative label: Bosniska, bilderböcker (85.2766) @sv
broader: Eteläslaavilaisilla kielillä julkaistut kuvakirjat
in scheme: YKL - Yleisten kirjastojen luokitusjärjestelmä
notation: 85.2766
preferred label: Bilderböcker på bosniska @sv
preferred label: Picture books in Bosnian @en

Balttilaisilla kielillä julkaistut kuvakirjat
type: Concept
type: YKL-luokka
broader: Slaavilaisilla ja balttilaisilla kielillä julkaistut kuvakirjat
in scheme: YKL - Yleisten kirjastojen luokitusjärjestelmä
narrower: Latviankieliset kuvakirjat
narrower: Liettuankieliset kuvakirjat
notation: 85.278
preferred label: Bilderböcker på baltiska språk @sv
preferred label: Picture books in Baltic languages @en

Latviankieliset kuvakirjat
type: Concept
type: YKL-luokka
alternative label: Latvian kieli, kuvakirjat (85.2781)
alternative label: Latviankielinen kaunokirjallisuus, kuvakirjat (85.2781)
alternative label: Lettisk skönlitteratur, bilderböcker (85.2781) @sv
alternative label: Lettiska, bilderböcker (85.2781) @sv
broader: Balttilaisilla kielillä julkaistut kuvakirjat
in scheme: YKL - Yleisten kirjastojen luokitusjärjestelmä
notation: 85.2781
preferred label: Bilderböcker på lettiska @sv
preferred label: Picture books in Latvian @en

Liettuankieliset kuvakirjat
type: Concept
type: YKL-luokka
alternative label: Liettuan kieli, kuvakirjat (85.2782)
alternative label: Liettuankielinen kaunokirjallisuus, kuvakirjat (85.2782)
alternative label: Litauisk skönlitteratur, bilderböcker (85.2782) @sv
alternative label: Litauiska, bilderböcker (85.2782) @sv
broader: Balttilaisilla kielillä julkaistut kuvakirjat
in scheme: YKL - Yleisten kirjastojen luokitusjärjestelmä
notation: 85.2782
preferred label: Bilderböcker på litauiska @sv
preferred label: Picture books in Lithuanian @en

Muilla indoeurooppalaisilla kielillä julkaistut kuvakirjat
type: Concept
type: YKL-luokka
broader: KUVAKIRJAT
in scheme: YKL - Yleisten kirjastojen luokitusjärjestelmä
narrower: Kreikankieliset kuvakirjat
narrower: Latinankieliset kuvakirjat
narrower: Indoiraanisilla kielillä julkaistut kuvakirjat
narrower: Albaniankieliset kuvakirjat
narrower: Armeniankieliset kuvakirjat
narrower: Kelttiläisillä kielillä julkaistut kuvakirjat
notation: 85.28
preferred label: Bilderböcker på övriga indoeuropeiska språk @sv
preferred label: Picture books in other Indo-European languages @en

Kreikankieliset kuvakirjat
type: Concept
type: YKL-luokka
alternative label: Grekisk skönlitteratur, forngrekiska, bilderböcker (85.281) @sv
alternative label: Grekiska, forngrekiska, bilderböcker (85.281) @sv
alternative label: Kreikan kieli, muinaiskreikka, kuvakirjat (85.281)
alternative label: Kreikankielinen kaunokirjallisuus, muinaiskreikka, kuvakirjat (85.281)
broader: Muilla indoeurooppalaisilla kielillä julkaistut kuvakirjat
in scheme: YKL - Yleisten kirjastojen luokitusjärjestelmä
narrower: Nykykreikankieliset kuvakirjat
notation: 85.281
preferred label: Bilderböcker på grekiska @sv
preferred label: Picture books in Greek @en

Nykykreikankieliset kuvakirjat
type: Concept
type: YKL-luokka
alternative label: Grekisk skönlitteratur, nygrekiska, bilderböcker (85.2812) @sv
alternative label: Grekiska, nygrekiska, bilderböcker (85.2812) @sv
alternative label: Kreikan kieli, nykykreikka, kuvakirjat (85.2812)
alternative label: Kreikankielinen kaunokirjallisuus, nykykreikka, kuvakirjat (85.2812)
broader: Kreikankieliset kuvakirjat
in scheme: YKL - Yleisten kirjastojen luokitusjärjestelmä
notation: 85.2812
preferred label: Bilderböcker på nygrekiska @sv
preferred label: Picture books in Modern Greek @en

Latinankieliset kuvakirjat
type: Concept
type: YKL-luokka
alternative label: Latin, bilderböcker (85.282) @sv
alternative label: Latinan kieli, kuvakirjat (85.282)
alternative label: Latinankielinen kaunokirjallisuus, kuvakirjat (85.282)
alternative label: Latinsk skönlitteratur, bilderböcker (85.282) @sv
broader: Muilla indoeurooppalaisilla kielillä julkaistut kuvakirjat
in scheme: YKL - Yleisten kirjastojen luokitusjärjestelmä
notation: 85.282
preferred label: Bilderböcker på latin @sv
preferred label: Picture books in Latin @en

Indoiraanisilla kielillä julkaistut kuvakirjat
type: Concept
type: YKL-luokka
broader: Muilla indoeurooppalaisilla kielillä julkaistut kuvakirjat
in scheme: YKL - Yleisten kirjastojen luokitusjärjestelmä
narrower: Persiankieliset kuvakirjat
narrower: Kurdinkieliset kuvakirjat
narrower: Paštunkieliset kuvakirjat
narrower: Indoarjalaisilla kielillä julkaistut kuvakirjat
notation: 85.283
preferred label: Bilderböcker på indoiranska språk @sv
preferred label: Picture books in Indo-Iranian languages @en
scope note: Bilderböcker på indiska och iranska språk @sv
scope note: Intialaisilla ja iranilaisilla kielillä julkaistut kuvakirjat

Persiankieliset kuvakirjat
type: Concept
type: YKL-luokka
alternative label: Persian kieli, kuvakirjat (85.2831)
alternative label: Persiankielinen kaunokirjallisuus, kuvakirjat (85.2831)
alternative label: Persisk skönlitteratur, bilderböcker (85.2831) @sv
alternative label: Persiska, bilderböcker (85.2831) @sv
broader: Indoiraanisilla kielillä julkaistut kuvakirjat
in scheme: YKL - Yleisten kirjastojen luokitusjärjestelmä
narrower: Darinkieliset kuvakirjat
notation: 85.2831
preferred label: Bilderböcker på persiska @sv
preferred label: Picture books in Persian @en

Darinkieliset kuvakirjat
type: Concept
type: YKL-luokka
alternative label: Dari, bilderböcker (85.28311) @sv
alternative label: Darin kieli, kuvakirjat (85.28311)
alternative label: Darinkielinen kaunokirjallisuus, kuvakirjat (85.28311)
alternative label: Skönlitteratur op dari, bilderböcker (85.28311) @sv
broader: Persiankieliset kuvakirjat
in scheme: YKL - Yleisten kirjastojen luokitusjärjestelmä
notation: 85.28311
preferred label: Bilderböcker på dari @sv
preferred label: Picture books in Dari language @en

Kurdinkieliset kuvakirjat
type: Concept
type: YKL-luokka
alternative label: Kurdin kieli, kuvakirjat (85.2832)
alternative label: Kurdinkielinen kaunokirjallisuus, kuvakirjat (85.2832)
alternative label: Kurdisk skönlitteratur, bilderböcker (85.2832) @sv
alternative label: Kurdiska, bilderböcker (85.2832) @sv
broader: Indoiraanisilla kielillä julkaistut kuvakirjat
in scheme: YKL - Yleisten kirjastojen luokitusjärjestelmä
narrower: Kurmandžinkieliset kuvakirjat
narrower: Soraninkieliset kuvakirjat
notation: 85.2832
preferred label: Bilderböcker på kurdiska @sv
preferred label: Picture books in Kurdish @en

Kurmandžinkieliset kuvakirjat
type: Concept
type: YKL-luokka
alternative label: Kurmandžin kieli, kuvakirjat (85.28321)
alternative label: Kurmanji, bilderböcker (85.28321) @sv
broader: Kurdinkieliset kuvakirjat
in scheme: YKL - Yleisten kirjastojen luokitusjärjestelmä
notation: 85.28321
preferred label: Bilderböcker på kurmanji @sv
preferred label: Picture books in Kurmanji language @en

Soraninkieliset kuvakirjat
type: Concept
type: YKL-luokka
alternative label: Sorani, bilderböcker (85.28322) @sv
alternative label: Soranin kieli, kuvakirjat (85.28322)
broader: Kurdinkieliset kuvakirjat
in scheme: YKL - Yleisten kirjastojen luokitusjärjestelmä
notation: 85.28322
preferred label: Bilderböcker på sorani @sv
preferred label: Picture books in Sorani language @en

Paštunkieliset kuvakirjat
type: Concept
type: YKL-luokka
alternative label: Pashto, bilderböcker (85.2833) @sv
alternative label: Paštun kieli, kuvakirjat (85.2833)
broader: Indoiraanisilla kielillä julkaistut kuvakirjat
in scheme: YKL - Yleisten kirjastojen luokitusjärjestelmä
notation: 85.2833
preferred label: Bilderböcker på pashto @sv
preferred label: Picture books in Pushto language @en

Indoarjalaisilla kielillä julkaistut kuvakirjat
type: Concept
type: YKL-luokka
broader: Indoiraanisilla kielillä julkaistut kuvakirjat
in scheme: YKL - Yleisten kirjastojen luokitusjärjestelmä
narrower: Bengalinkieliset kuvakirjat
narrower: Gudžaratinkieliset kuvakirjat
narrower: Hindinkieliset kuvakirjat
narrower: Pandzabinkieliset kuvakirjat
narrower: Romanikieliset kuvakirjat
narrower: Urdunkieliset kuvakirjat
narrower: Nepalinkieliset kuvakirjat
narrower: Sinhalankieliset kuvakirjat
notation: 85.2836
preferred label: Bilderböcker på indoariska spåk @sv
preferred label: Picture books in Indo-Aryan languages @en

Bengalinkieliset kuvakirjat
type: Concept
type: YKL-luokka
alternative label: Bengali, bilderböcker (85.28361) @sv
alternative label: Bengalin kieli, kuvakirjat (85.28361)
broader: Indoarjalaisilla kielillä julkaistut kuvakirjat
in scheme: YKL - Yleisten kirjastojen luokitusjärjestelmä
notation: 85.28361
preferred label: Bilderböcker på bengali @sv
preferred label: Picture books in Bengali language @en

Gudžaratinkieliset kuvakirjat
type: Concept
type: YKL-luokka
alternative label: Gudžaratin kieli, kuvakirjat (85.28362)
alternative label: Gujarati, bilderböcker (85.28362) @sv
broader: Indoarjalaisilla kielillä julkaistut kuvakirjat
in scheme: YKL - Yleisten kirjastojen luokitusjärjestelmä
notation: 85.28362
preferred label: Bilderböcker på gujarati @sv
preferred label: Picture books in Gujarati language @en

Hindinkieliset kuvakirjat
type: Concept
type: YKL-luokka
alternative label: Hindi, bilderböcker (85.28363) @sv
alternative label: Hindin kieli, kuvakirjat (85.28363)
broader: Indoarjalaisilla kielillä julkaistut kuvakirjat
in scheme: YKL - Yleisten kirjastojen luokitusjärjestelmä
notation: 85.28363
preferred label: Bilderböcker på hindi @sv
preferred label: Picture books in Hindi language @en

Pandzabinkieliset kuvakirjat
type: Concept
type: YKL-luokka
alternative label: Panjabi, bilderböcker (85.28364) @sv
alternative label: Panzabin kieli, kuvakirjat (85.28364)
broader: Indoarjalaisilla kielillä julkaistut kuvakirjat
in scheme: YKL - Yleisten kirjastojen luokitusjärjestelmä
notation: 85.28364
preferred label: Bilderböcker på panjabi @sv
preferred label: Picture books in Punjabi language @en

Romanikieliset kuvakirjat
type: Concept
type: YKL-luokka
alternative label: Romani, bilderböcker (85.28365) @sv
alternative label: Romanikieli, kuvakirjat (85.28365)
broader: Indoarjalaisilla kielillä julkaistut kuvakirjat
in scheme: YKL - Yleisten kirjastojen luokitusjärjestelmä
notation: 85.28365
preferred label: Bilderböcker på romani @sv
preferred label: Picture books in Romani language @en

Urdunkieliset kuvakirjat
type: Concept
type: YKL-luokka
alternative label: Urdu, bilderböcker (85.28366) @sv
alternative label: Urdun kieli, kuvakirjat (85.28366)
broader: Indoarjalaisilla kielillä julkaistut kuvakirjat
in scheme: YKL - Yleisten kirjastojen luokitusjärjestelmä
notation: 85.28366
preferred label: Bilderböcker på urdu @sv
preferred label: Picture books in Urdu language @en

Nepalinkieliset kuvakirjat
type: Concept
type: YKL-luokka
alternative label: Nepali, bilderböcker (85.28367) @sv
alternative label: Nepalin kieli, kuvakirjat (85.28367)
broader: Indoarjalaisilla kielillä julkaistut kuvakirjat
in scheme: YKL - Yleisten kirjastojen luokitusjärjestelmä
notation: 85.28367
preferred label: Bilderböcker på nepali @sv
preferred label: Picture books in Nepali language @en

Sinhalankieliset kuvakirjat
type: Concept
type: YKL-luokka
alternative label: Singalesiska, bilderböcker (85.28368) @sv
alternative label: Sinhalan kieli, kuvakirjat (85.28368)
broader: Indoarjalaisilla kielillä julkaistut kuvakirjat
in scheme: YKL - Yleisten kirjastojen luokitusjärjestelmä
notation: 85.28368
preferred label: Bilderböcker på singalesiska @sv
preferred label: Picture books in Sinhalese language @en

Albaniankieliset kuvakirjat
type: Concept
type: YKL-luokka
alternative label: Albanian kieli, kuvakirjat (85.284)
alternative label: Albaniankielinen kaunokirjallisuus, kuvakirjat (85.284)
alternative label: Albansk skönlitteratur, bilderböcker (85.284) @sv
alternative label: Albanska, bilderböcker (85.284) @sv
broader: Muilla indoeurooppalaisilla kielillä julkaistut kuvakirjat
in scheme: YKL - Yleisten kirjastojen luokitusjärjestelmä
notation: 85.284
preferred label: Bilderböcker på albanska @sv
preferred label: Picture books in Albanian @en

Armeniankieliset kuvakirjat
type: Concept
type: YKL-luokka
alternative label: Armenian kieli, kuvakirjat (85.285)
alternative label: Armeniska, bilderböcker (85.285) @sv
broader: Muilla indoeurooppalaisilla kielillä julkaistut kuvakirjat
in scheme: YKL - Yleisten kirjastojen luokitusjärjestelmä
notation: 85.285
preferred label: Bilderböcker på armeniska @sv
preferred label: Picture books in Armenian language @en

Kelttiläisillä kielillä julkaistut kuvakirjat
type: Concept
type: YKL-luokka
broader: Muilla indoeurooppalaisilla kielillä julkaistut kuvakirjat
in scheme: YKL - Yleisten kirjastojen luokitusjärjestelmä
notation: 85.288
preferred label: Bilderböcker på keltiska språk @sv
preferred label: Picture books in Celtic languages @en

Muilla kielillä julkaistut kuvakirjat
type: Concept
type: YKL-luokka
broader: KUVAKIRJAT
in scheme: YKL - Yleisten kirjastojen luokitusjärjestelmä
narrower: Turkkilaisilla kielillä julkaistut kuvakirjat
narrower: Afroaasialaisilla kielillä julkaistut kuvakirjat
narrower: Sinotiibetiläisillä ja austroaasialaisilla kielillä julkaistut kuvakirjat
narrower: Japanin- ja koreankieliset kuvakirjat
narrower: Afrikkalaisilla kielillä julkaistut kuvakirjat
narrower: Kaukasialaisilla kielillä julkaistut kuvakirjat
narrower: Eskimo- ja intiaanikielillä julkaistut kuvakirjat
narrower: Muilla ei-indoeurooppalaisilla kielillä julkaistut kuvakirjat
notation: 85.29
preferred label: Bilderböcker på övriga språk @sv
preferred label: Picture books in other languages @en

Turkkilaisilla kielillä julkaistut kuvakirjat
type: Concept
type: YKL-luokka
broader: Muilla kielillä julkaistut kuvakirjat
in scheme: YKL - Yleisten kirjastojen luokitusjärjestelmä
narrower: Turkinkieliset kuvakirjat
narrower: Azerinkieliset kuvakirjat
narrower: Turkmeeninkieliset kuvakirjat
narrower: Uiguurinkieliset kuvakirjat
narrower: Uzbekinkieliset kuvakirjat
notation: 85.291
preferred label: Bilderböcker på turkiska spåk @sv
preferred label: Picture books in Turkic languages @en

Turkinkieliset kuvakirjat
type: Concept
type: YKL-luokka
alternative label: Turkin kieli, kuvakirjat (85.2911)
alternative label: Turkiska, bilderböcker (85.2911) @sv
broader: Turkkilaisilla kielillä julkaistut kuvakirjat
in scheme: YKL - Yleisten kirjastojen luokitusjärjestelmä
notation: 85.2911
preferred label: Bilderböcker på turkiska @sv
preferred label: Picture books in Turkish language @en

Azerinkieliset kuvakirjat
type: Concept
type: YKL-luokka
alternative label: Azerbajdzjanska, bilderböcker (85.2912) @sv
alternative label: Azerin kieli, kuvakirjat (85.2912)
broader: Turkkilaisilla kielillä julkaistut kuvakirjat
in scheme: YKL - Yleisten kirjastojen luokitusjärjestelmä
notation: 85.2912
preferred label: Bilderböcker på azerbajdzjanska @sv
preferred label: Picture books in Azerbaijani language @en

Turkmeeninkieliset kuvakirjat
type: Concept
type: YKL-luokka
alternative label: Turkmeenin kieli, kuvakirjat (85.2913)
alternative label: Turkmeniska, bilderböcker (85.2913) @sv
broader: Turkkilaisilla kielillä julkaistut kuvakirjat
in scheme: YKL - Yleisten kirjastojen luokitusjärjestelmä
notation: 85.2913
preferred label: Bilderböcker på turkmeniska @sv
preferred label: Picture books in Turkmen language @en

Uiguurinkieliset kuvakirjat
type: Concept
type: YKL-luokka
alternative label: Uiguriska, bilderböcker (85.2914) @sv
alternative label: Uiguurin kieli, kuvakirjat (85.2914)
broader: Turkkilaisilla kielillä julkaistut kuvakirjat
in scheme: YKL - Yleisten kirjastojen luokitusjärjestelmä
notation: 85.2914
preferred label: Bilderböcker på uiguriska @sv
preferred label: Picture books in Uighur language @en

Uzbekinkieliset kuvakirjat
type: Concept
type: YKL-luokka
alternative label: Uzbekinkieli, kuvakirjat (85.2915)
alternative label: Uzbekiska, bilderböcker (85.2915) @sv
broader: Turkkilaisilla kielillä julkaistut kuvakirjat
in scheme: YKL - Yleisten kirjastojen luokitusjärjestelmä
notation: 85.2915
preferred label: Bilderböcker på uzbekiska @sv
preferred label: Picture books in Uzbek language @en

Afroaasialaisilla kielillä julkaistut kuvakirjat
type: Concept
type: YKL-luokka
broader: Muilla kielillä julkaistut kuvakirjat
in scheme: YKL - Yleisten kirjastojen luokitusjärjestelmä
narrower: Hepreankieliset kuvakirjat
narrower: Arabiankieliset kuvakirjat
narrower: Amharankieliset kuvakirjat
narrower: Tigrinjankieliset kuvakirjat
narrower: Somalinkieliset kuvakirjat
notation: 85.292
preferred label: Bilderböcker på afroasiatiska @sv
preferred label: Picture books in Afroasiatic languages @en

Hepreankieliset kuvakirjat
type: Concept
type: YKL-luokka
alternative label: Hebreisk skönlitteratur, bilderböcker (85.2922) @sv
alternative label: Hebreiska, bilderböcker (85.2922) @sv
alternative label: Heprean kieli, kuvakirjat (85.2922)
alternative label: Hepreankielinen kaunokirjallisuus, kuvakirjat (85.2922)
broader: Afroaasialaisilla kielillä julkaistut kuvakirjat
in scheme: YKL - Yleisten kirjastojen luokitusjärjestelmä
notation: 85.2922
preferred label: Bilderböcker på hebreiska @sv
preferred label: Picture books in Hebrew @en

Arabiankieliset kuvakirjat
type: Concept
type: YKL-luokka
alternative label: Arabian kieli, kuvakirjat (85.2923)
alternative label: Arabiankielinen kaunokirjallisuus, kuvakirjat (85.2923)
alternative label: Arabisk skönlitteratur, bilderböcker (85.2923) @sv
alternative label: Arabiska, bilderböcker (85.2923) @sv
broader: Afroaasialaisilla kielillä julkaistut kuvakirjat
in scheme: YKL - Yleisten kirjastojen luokitusjärjestelmä
notation: 85.2923
preferred label: Bilderböcker på arabiska @sv
preferred label: Picture books in Arabic @en

Amharankieliset kuvakirjat
type: Concept
type: YKL-luokka
alternative label: Amharan kieli, kuvakirjat (85.2924)
alternative label: Amhariska, bilderböcker (85.2924) @sv
broader: Afroaasialaisilla kielillä julkaistut kuvakirjat
in scheme: YKL - Yleisten kirjastojen luokitusjärjestelmä
notation: 85.2924
preferred label: Bilderböcker på amhariska @sv
preferred label: Picture books in Amharic language @en

Tigrinjankieliset kuvakirjat
type: Concept
type: YKL-luokka
alternative label: Tigrinja, bilderböcker (85.2925) @sv
alternative label: Tigrinjan kieli, kuvakirjat (85.2925)
broader: Afroaasialaisilla kielillä julkaistut kuvakirjat
in scheme: YKL - Yleisten kirjastojen luokitusjärjestelmä
notation: 85.2925
preferred label: Bilderböcker på tigrinja @sv
preferred label: Picture books in Tigrinya language @en

Somalinkieliset kuvakirjat
type: Concept
type: YKL-luokka
alternative label: Somalin kieli, kuvakirjat (85.2926)
alternative label: Somaliska, bilderböcker (85.2926) @sv
broader: Afroaasialaisilla kielillä julkaistut kuvakirjat
in scheme: YKL - Yleisten kirjastojen luokitusjärjestelmä
notation: 85.2926
preferred label: Bilderböcker på somaliska @sv
preferred label: Picture books in Somali language @en

Sinotiibetiläisillä ja austroaasialaisilla kielillä julkaistut kuvakirjat
type: Concept
type: YKL-luokka
broader: Muilla kielillä julkaistut kuvakirjat
in scheme: YKL - Yleisten kirjastojen luokitusjärjestelmä
narrower: Kiinankieliset kuvakirjat
narrower: Burmankieliset kuvakirjat
narrower: Kareninkieliset kuvakirjat
narrower: Thainkieliset kuvakirjat
narrower: Vietnaminkieliset kuvakirjat
narrower: Khmerinkieliset kuvakirjat
notation: 85.294
preferred label: Bilderböcker på sinotibetanska och austroasiatiska språk @sv
preferred label: Picture books in Sino-Tibetan and Austroasiatic languages @en

Kiinankieliset kuvakirjat
type: Concept
type: YKL-luokka
alternative label: Kiinan kieli, kuvakirjat (85.2943)
alternative label: Kiinankielinen kaunokirjallisuus, kuvakirjat (85.2943)
alternative label: Kinesisk skönlitteratur, bilderböcker (85.2943) @sv
alternative label: Kinesiska, bilderböcker (85.2943) @sv
broader: Sinotiibetiläisillä ja austroaasialaisilla kielillä julkaistut kuvakirjat
in scheme: YKL - Yleisten kirjastojen luokitusjärjestelmä
notation: 85.2943
preferred label: Bilderböcker på kinesiska @sv
preferred label: Picture books in Chinese @en

Burmankieliset kuvakirjat
type: Concept
type: YKL-luokka
alternative label: Burman kieli, kuvakirjat (85.2944)
alternative label: Burmesiska, bilderböcker (85.2944) @sv
broader: Sinotiibetiläisillä ja austroaasialaisilla kielillä julkaistut kuvakirjat
in scheme: YKL - Yleisten kirjastojen luokitusjärjestelmä
notation: 85.2944
preferred label: Bilderböcker på burmesiska @sv
preferred label: Picture books in Burmese language @en

Kareninkieliset kuvakirjat
type: Concept
type: YKL-luokka
alternative label: Karenin kieli, kuvakirjat (85.2945)
alternative label: Karenska, bilderböcker (85.2945) @sv
broader: Sinotiibetiläisillä ja austroaasialaisilla kielillä julkaistut kuvakirjat
in scheme: YKL - Yleisten kirjastojen luokitusjärjestelmä
notation: 85.2945
preferred label: Bilderböcker på karenska @sv
preferred label: Picture books in Karen languages @en

Thainkieliset kuvakirjat
type: Concept
type: YKL-luokka
alternative label: Thai, bilderböcker (85.2946) @sv
alternative label: Thailändsk skönlitteratur, bilderböcker (85.2946) @sv
alternative label: Thain kieli, kuvakirjat (85.2946)
alternative label: Thainkielinen kaunokirjallisuus, kuvakirjat (85.2946)
broader: Sinotiibetiläisillä ja austroaasialaisilla kielillä julkaistut kuvakirjat
in scheme: YKL - Yleisten kirjastojen luokitusjärjestelmä
notation: 85.2946
preferred label: Bilderböcker på thailändska @sv
preferred label: Picture books in Thai @en

Vietnaminkieliset kuvakirjat
type: Concept
type: YKL-luokka
alternative label: Vietnamesisk skönlitteratur, bilderböcker (85.2948) @sv
alternative label: Vietnamesiska, bilderböcker (85.2948) @sv
alternative label: Vietnamin kieli, kuvakirjat (85.2948)
alternative label: Vietnaminkielinen kaunokirjallisuus, kuvakirjat (85.2948)
broader: Sinotiibetiläisillä ja austroaasialaisilla kielillä julkaistut kuvakirjat
in scheme: YKL - Yleisten kirjastojen luokitusjärjestelmä
notation: 85.2948
preferred label: Bilderböcker på vietnamesiska @sv
preferred label: Picture books in Vietnamese @en

Khmerinkieliset kuvakirjat
type: Concept
type: YKL-luokka
alternative label: Khmer, bilderböcker (85.2949) @sv
alternative label: Khmerin kieli, kuvakirjat (85.2949)
broader: Sinotiibetiläisillä ja austroaasialaisilla kielillä julkaistut kuvakirjat
in scheme: YKL - Yleisten kirjastojen luokitusjärjestelmä
notation: 85.2949
preferred label: Bilderböcker på khmer @sv
preferred label: Picture books in Khmer language @en

Japanin- ja koreankieliset kuvakirjat
type: Concept
type: YKL-luokka
broader: Muilla kielillä julkaistut kuvakirjat
in scheme: YKL - Yleisten kirjastojen luokitusjärjestelmä
narrower: Japaninkieliset kuvakirjat
narrower: Koreankieliset kuvakirjat
notation: 85.295
preferred label: Bilderböcker på japanska. Bilderböcker på koreanska @sv
preferred label: Picture books in Japanese. Picture books in Korean @en

Japaninkieliset kuvakirjat
type: Concept
type: YKL-luokka
alternative label: Japanin kieli, kuvakirjat (85.2951)
alternative label: Japaninkielinen kaunokirjallisuus, kuvakirjat (85.2951)
alternative label: Japansk skönlitteratur, bilderböcker (85.2951) @sv
alternative label: Japanska, bilderböcker (85.2951) @sv
broader: Japanin- ja koreankieliset kuvakirjat
in scheme: YKL - Yleisten kirjastojen luokitusjärjestelmä
notation: 85.2951
preferred label: Bilderböcker på japanska @sv
preferred label: Picture books in Japanese @en

Koreankieliset kuvakirjat
type: Concept
type: YKL-luokka
alternative label: Korean kieli, kuvakirjat (85.2955)
alternative label: Koreankielinen kaunokirjallisuus, kuvakirjat (85.2955)
alternative label: Koreansk skönlitteratur, bilderböcker (85.2955) @sv
alternative label: Koreanska, bilderböcker (85.2955) @sv
broader: Japanin- ja koreankieliset kuvakirjat
in scheme: YKL - Yleisten kirjastojen luokitusjärjestelmä
notation: 85.2955
preferred label: Bilderböcker på koreanska @sv
preferred label: Picture books in Korean @en

Afrikkalaisilla kielillä julkaistut kuvakirjat
type: Concept
type: YKL-luokka
broader: Muilla kielillä julkaistut kuvakirjat
in scheme: YKL - Yleisten kirjastojen luokitusjärjestelmä
narrower: Swahilinkieliset kuvakirjat
narrower: Lingalankieliset kuvakirjat
notation: 85.296
preferred label: Bilderböcker på afrikanska språk @sv
preferred label: Picture books in African languages @en
scope note: Hit bilderböcker på afrikanska språk som talas söder om Sahara, Etiopien och Somalia @sv
scope note: Tähän Saharan, Etiopian ja Somalian eteläpuolella puhutuilla afrikkalaisilla kielillä julkaistut kuvakirjat

Swahilinkieliset kuvakirjat
type: Concept
type: YKL-luokka
alternative label: Swahili, bilderböcker (85.2961) @sv
alternative label: Swahilin kieli, kuvakirjat (85.2961)
broader: Afrikkalaisilla kielillä julkaistut kuvakirjat
in scheme: YKL - Yleisten kirjastojen luokitusjärjestelmä
notation: 85.2961
preferred label: Bilderböcker på swahili @sv
preferred label: Picture books in Swahili language @en

Lingalankieliset kuvakirjat
type: Concept
type: YKL-luokka
alternative label: Lingala, bilderböcker (85.2962) @sv
alternative label: Lingalan kieli, kuvakirjat (85.2962)
broader: Afrikkalaisilla kielillä julkaistut kuvakirjat
in scheme: YKL - Yleisten kirjastojen luokitusjärjestelmä
notation: 85.2962
preferred label: Bilderböcker på lingala @sv
preferred label: Picture books in Lingala language @en

Kaukasialaisilla kielillä julkaistut kuvakirjat
type: Concept
type: YKL-luokka
broader: Muilla kielillä julkaistut kuvakirjat
in scheme: YKL - Yleisten kirjastojen luokitusjärjestelmä
narrower: Georgiankieliset kuvakirjat
narrower: Abhaasin, kabardin ja adygenkieliset kuvakirjat
narrower: Tšetšeeninkieliset kuvakirjat
notation: 85.297
preferred label: Bilderböcker på kaukasiska spåk @sv
preferred label: Picture books in Caucasian languages @en

Georgiankieliset kuvakirjat
type: Concept
type: YKL-luokka
alternative label: Georgian kieli, kuvakirjat (85.2971)
alternative label: Georgiska, bilderböcker (85.2971) @sv
broader: Kaukasialaisilla kielillä julkaistut kuvakirjat
in scheme: YKL - Yleisten kirjastojen luokitusjärjestelmä
notation: 85.2971
preferred label: Bilderböcker på georgiska @sv
preferred label: Picture books in Georgian language @en

Abhaasin, kabardin ja adygenkieliset kuvakirjat
type: Concept
type: YKL-luokka
alternative label: Abchaziska, bilderböcker (85.2972) @sv
alternative label: Abhaasin kieli, kuvakirjat (85.2972)
alternative label: Adygeiska, bilderböcker (85.2972) @sv
alternative label: Adygen kieli, kuvakirjat (85.2972)
alternative label: Kabardin kieli, kuvakirjat (85.2972)
alternative label: Kabardinska, bilderböcker (85.2972) @sv
broader: Kaukasialaisilla kielillä julkaistut kuvakirjat
in scheme: YKL - Yleisten kirjastojen luokitusjärjestelmä
notation: 85.2972
preferred label: Bilderböcker på abchaziska, kabardinska och adygeiska @sv
preferred label: Picture books in Abkhaz, Kabardian and Adyghe languages @en

Tšetšeeninkieliset kuvakirjat
type: Concept
type: YKL-luokka
alternative label: Tjetjenska, bilderböcker (85.2973) @sv
alternative label: Tšetšeenin kieli, kuvakirjat (85.2973)
broader: Kaukasialaisilla kielillä julkaistut kuvakirjat
in scheme: YKL - Yleisten kirjastojen luokitusjärjestelmä
notation: 85.2973
preferred label: Bilderböcker på tjetjenska @sv
preferred label: Picture books in Chechen language @en

Eskimo- ja intiaanikielillä julkaistut kuvakirjat
type: Concept
type: YKL-luokka
broader: Muilla kielillä julkaistut kuvakirjat
in scheme: YKL - Yleisten kirjastojen luokitusjärjestelmä
narrower: Grönlanninkieliset kuvakirjat
notation: 85.298
preferred label: Bilderböcker på eskimå- och indianspråk @sv
preferred label: Picture books in Eskimo and Indian languages @en

Grönlanninkieliset kuvakirjat
type: Concept
type: YKL-luokka
alternative label: Grönlannin kieli, kuvakirjat (85.2981)
alternative label: Grönländska, bilderböcker (85.2981) @sv
broader: Eskimo- ja intiaanikielillä julkaistut kuvakirjat
in scheme: YKL - Yleisten kirjastojen luokitusjärjestelmä
notation: 85.2981
preferred label: Bilderböcker på grönländska @sv
preferred label: Picture books in Greenlandic language @en

Muilla ei-indoeurooppalaisilla kielillä julkaistut kuvakirjat
type: Concept
type: YKL-luokka
broader: Muilla kielillä julkaistut kuvakirjat
in scheme: YKL - Yleisten kirjastojen luokitusjärjestelmä
narrower: Keinotekoisilla kielillä julkaistut kuvakirjat
narrower: Baskinkieliset kuvakirjat
narrower: Dravidakieliset kuvakirjat
narrower: Austronesialaisilla kielillä julkaistut kuvakirjat
notation: 85.299
preferred label: Bilderböcker på övriga icke-indoeuropeiska språk @sv
preferred label: Picture books in other Non-Indoeuropean languages @en

Keinotekoisilla kielillä julkaistut kuvakirjat
type: Concept
type: YKL-luokka
broader: Muilla ei-indoeurooppalaisilla kielillä julkaistut kuvakirjat
in scheme: YKL - Yleisten kirjastojen luokitusjärjestelmä
notation: 85.2991
preferred label: Bilderböcker på artificiella språk @sv
preferred label: Picture books in artificial languages @en

Baskinkieliset kuvakirjat
type: Concept
type: YKL-luokka
alternative label: Baskin kieli, kuvakirjat (85.2992)
alternative label: Baskiska, bilderböcker (85.2992) @sv
broader: Muilla ei-indoeurooppalaisilla kielillä julkaistut kuvakirjat
in scheme: YKL - Yleisten kirjastojen luokitusjärjestelmä
notation: 85.2992
preferred label: Bilderböcker på baskiska @sv
preferred label: Picture books in Basque language @en

Dravidakieliset kuvakirjat
type: Concept
type: YKL-luokka
broader: Muilla ei-indoeurooppalaisilla kielillä julkaistut kuvakirjat
in scheme: YKL - Yleisten kirjastojen luokitusjärjestelmä
narrower: Malajalaminkieliset kuvakirjat
narrower: Kannadankieliset kuvakirjat
narrower: Tamilinkieliset kuvakirjat
narrower: Telugunkieliset kuvakirjat
notation: 85.2994
preferred label: Bilderböcker på dravidiska @sv
preferred label: Picture books in Dravidian languages @en

Malajalaminkieliset kuvakirjat
type: Concept
type: YKL-luokka
alternative label: Malajalamin kieli, kuvakirjat (85.29941)
alternative label: Malayalam, bilderböcker (85.29941) @sv
broader: Dravidakieliset kuvakirjat
in scheme: YKL - Yleisten kirjastojen luokitusjärjestelmä
notation: 85.29941
preferred label: Bilderböcker på malayalam @sv
preferred label: Picture books in Malayalam language @en

Kannadankieliset kuvakirjat
type: Concept
type: YKL-luokka
alternative label: Kannada, bilderböcker (85.29942) @sv
alternative label: Kannadan kieli, kuvakirjat (85.29942)
broader: Dravidakieliset kuvakirjat
in scheme: YKL - Yleisten kirjastojen luokitusjärjestelmä
notation: 85.29942
preferred label: Bilderböcker på kannada @sv
preferred label: Picture books in Kannada language @en

Tamilinkieliset kuvakirjat
type: Concept
type: YKL-luokka
alternative label: Tamil, bilderböcker (85.29943) @sv
alternative label: Tamilin kieli, kuvakirjat (85.29943)
broader: Dravidakieliset kuvakirjat
in scheme: YKL - Yleisten kirjastojen luokitusjärjestelmä
notation: 85.29943
preferred label: Bilderböcker på tamil @sv
preferred label: Picture books in Tamil language @en

Telugunkieliset kuvakirjat
type: Concept
type: YKL-luokka
alternative label: Telugu, bilderböcker (85.29944) @sv
alternative label: Telugun kieli, kuvakirjat (85.29944)
broader: Dravidakieliset kuvakirjat
in scheme: YKL - Yleisten kirjastojen luokitusjärjestelmä
notation: 85.29944
preferred label: Bilderböcker på telugu @sv
preferred label: Picture books in Telugu language @en

Austronesialaisilla kielillä julkaistut kuvakirjat
type: Concept
type: YKL-luokka
broader: Muilla ei-indoeurooppalaisilla kielillä julkaistut kuvakirjat
in scheme: YKL - Yleisten kirjastojen luokitusjärjestelmä
narrower: Tagaloginkieliset kuvakirjat
narrower: Malaijinkieliset kuvakirjat
narrower: Indonesiankieliset kuvakirjat
notation: 85.2995
preferred label: Bilderböcker på austronesiska @sv
preferred label: Picture books in Austronesian languages @en

Tagaloginkieliset kuvakirjat
type: Concept
type: YKL-luokka
alternative label: Tagalog, bilderböcker (85.29951) @sv
alternative label: Tagalogin kieli, kuvakirjat (85.29951)
broader: Austronesialaisilla kielillä julkaistut kuvakirjat
in scheme: YKL - Yleisten kirjastojen luokitusjärjestelmä
notation: 85.29951
preferred label: Bilderböcker på tagalog @sv
preferred label: Picture books in Tagalog language @en

Malaijinkieliset kuvakirjat
type: Concept
type: YKL-luokka
alternative label: Malaijin kieli, kuvakirjat (85.29952)
alternative label: Malajiska, bilderböcker (85.29952) @sv
broader: Austronesialaisilla kielillä julkaistut kuvakirjat
in scheme: YKL - Yleisten kirjastojen luokitusjärjestelmä
notation: 85.29952
preferred label: Bilderböcker på malajiska @sv
preferred label: Picture books in Malay language @en

Indonesiankieliset kuvakirjat
type: Concept
type: YKL-luokka
alternative label: Indonesian kieli, kuvakirjat (85.29953)
alternative label: Indonesiska, bilderböcker (85.29953) @sv
broader: Austronesialaisilla kielillä julkaistut kuvakirjat
in scheme: YKL - Yleisten kirjastojen luokitusjärjestelmä
notation: 85.29953
preferred label: Bilderböcker på indonesiska @sv
preferred label: Picture books in Indonesian language @en

SARJAKUVAT
type: Concept
References: MAALAUSTAIDE. PIIRUSTUSTAIDE
References: Pilapiirrokset. Karikatyyrit
References: Kuvitustaide
References: KUVAKIRJAT
References: Lasten- ja nuortenkirjallisuuden historia ja tutkimus
References: Sarjakuvien historia ja tutkimus
type: YKL-luokka
alternative label: Biografiska tecknade serier (85.3+) @sv
alternative label: Elämäkertasarjakuvat (85.3+)
alternative label: Fantasiakirjallisuus, sarjakuvat (85.3+)
alternative label: Fantasylitteratur, tecknade serier (85.3+) @sv
alternative label: Sarjakuvaromaanit (85.3+)
alternative label: Sarjakuvat, kaunokirjallisuus (85.3+)
alternative label: Science fiction, tecknade serier (85.3+) @sv
alternative label: Scifi, sarjakuvat (85.3+)
alternative label: Scifi, tecknade serier (85.3+) @sv
alternative label: Seriebilder, skönlitteratur (85.3+) @sv
alternative label: Serieromaner (85.3+) @sv
alternative label: Tieteiskirjallisuus, sarjakuvat (85.3+)
broader: SADUT. KUVAKIRJAT. SARJAKUVAT
in scheme: YKL - Yleisten kirjastojen luokitusjärjestelmä
narrower: Suomenkieliset sarjakuvat
narrower: Pohjoismaisilla kielillä julkaistut sarjakuvat
narrower: Saksankieliset sarjakuvat
narrower: Englanninkieliset sarjakuvat
narrower: Romaanisilla kielillä julkaistut sarjakuvat
narrower: Slaavilaisilla ja balttilaisilla kielillä julkaistut sarjakuvat
narrower: Muilla indoeurooppalaisilla kielillä julkaistut sarjakuvat
narrower: Muilla kielillä julkaistut sarjakuvat
notation: 85.3
preferred label: COMICS @en
preferred label: TECKNADE SERIER @sv
scope note: Hit och till underklasserna tecknade serier för barn och vuxna som hänförs till skönlitteraturen. Hit och till underklasserna också tecknade serier med utgångspunkt i övriga skönlitterära genrer. Verken klassificeras efter publikationens språk, inte efter originalspråk eller publikationsland. Om ett av språken i en tvåspråkig publikation är översättningsspråk klassificeras verket efter detta språk. Om texterna i ett två- eller flerspråkigt verk inte är översättningar av varandra klassificeras verket efter publikationens huvudspråk. Om verket inte har något huvudspråk klassificeras det efter publikationens första språk. Faktaserier klassificeras enligt ämne. Formtilläggen 01, 02, 03+, 06+, 07, 08+ och 09 används inte i samband med klasserna 80-85+ @sv
scope note: Tähän ja alaluokkiin aikuisille tai lapsille tarkoitetut kaunokirjallisuuteen kuuluvat sarjakuvat. Tähän ja alaluokkiin myös muiden kaunokirjallisuustyyppien pohjalta laaditut sarjakuvat. Teokset luokitetaan julkaisun kielen, ei julkaisumaan tai alkuteoksen kielen mukaan. Jos kaksikielisen teoksen toinen kieli on käännöskieli, luokitetaan teos käännöskielen mukaan. Jos kaksi- tai useampikielisen teoksen tekstit eivät ole toistensa käännöksiä, luokitetaan teos julkaisun pääkielen mukaan. Jos teoksella ei ole pääkieltä, se luokitetaan julkaisun ensimmäisen kielen mukaan. Tietosarjakuvat luokitetaan aiheen mukaiseen luokkaan. Muotoluokkia 01, 02, 03+, 06+, 07, 08+ ja 09 ei käytetä luokkien 80-85+ yhteydessä

Suomenkieliset sarjakuvat
type: Concept
type: YKL-luokka
alternative label: Finsk skönlitteratur, tecknade serier (85.32) @sv
alternative label: Finska, tecknade serier (85.32) @sv
alternative label: Suomen kieli, sarjakuvat (85.32)
alternative label: Suomenkielinen kaunokirjallisuus, sarjakuvat (85.32)
broader: SARJAKUVAT
in scheme: YKL - Yleisten kirjastojen luokitusjärjestelmä
narrower: Meänkieliset sarjakuvat
narrower: Kveeninkieliset sarjakuvat
narrower: Vironkieliset sarjakuvat
narrower: Muilla itämerensuomalaisilla kielillä julkaistut sarjakuvat
narrower: Muilla suomalais-ugrilaisilla ja uralilaisilla kielillä julkaistut sarjakuvat
notation: 85.32
preferred label: Comics in Finnish @en
preferred label: Tecknade serier på finska @sv

Meänkieliset sarjakuvat
type: Concept
type: YKL-luokka
alternative label: Meänkieli, sarjakuvat (85.321)
alternative label: Meänkieli, tecknade serier (85.321) @sv
alternative label: Meänkielinen kaunokirjallisuus, sarjakuvat (85.321)
alternative label: Skönlitteratur på meänkieli, tecknade serier (85.321) @sv
alternative label: Skönlitteratur på tornedalsfinska, tecknade serier (85.321) @sv
broader: Suomenkieliset sarjakuvat
in scheme: YKL - Yleisten kirjastojen luokitusjärjestelmä
notation: 85.321
preferred label: Comics in Meänkieli @en
preferred label: Tecknade serier på meänkieli @sv

Kveeninkieliset sarjakuvat
type: Concept
type: YKL-luokka
alternative label: Kveenin kieli, sarjakuvat (85.322)
alternative label: Kveeninkielinen kaunokirjallisuus, sarjakuvat (85.322)
alternative label: Kvänsk skönlitteratur, tecknade serier (85.322) @sv
alternative label: Kvänska, tecknade serier (85.322) @sv
broader: Suomenkieliset sarjakuvat
in scheme: YKL - Yleisten kirjastojen luokitusjärjestelmä
notation: 85.322
preferred label: Comics in Kven language @en
preferred label: Tecknade serier på kvänska @sv

Vironkieliset sarjakuvat
type: Concept
type: YKL-luokka
alternative label: Estnisk skönlitteratur, tecknade serier (85.323) @sv
alternative label: Estniska, tecknade serier (85.323) @sv
alternative label: Viron kieli, sarjakuvat (85.323)
alternative label: Vironkielinen kaunokirjallisuus, sarjakuvat (85.323)
broader: Suomenkieliset sarjakuvat
in scheme: YKL - Yleisten kirjastojen luokitusjärjestelmä
notation: 85.323
preferred label: Comics in Estonian @en
preferred label: Tecknade serier på estniska @sv

Muilla itämerensuomalaisilla kielillä julkaistut sarjakuvat
type: Concept
type: YKL-luokka
broader: Suomenkieliset sarjakuvat
in scheme: YKL - Yleisten kirjastojen luokitusjärjestelmä
narrower: Karjajalankieliset sarjakuvat
notation: 85.324
preferred label: Comics in other Balto-Finnic languages @en
preferred label: Tecknade serier på övriga östersjöfinska språk @sv

Karjajalankieliset sarjakuvat
type: Concept
type: YKL-luokka
alternative label: Karelska, tecknade serier (85.3241) @sv
alternative label: Karjalan kieli, sarjakuvat (85.3241)
broader: Muilla itämerensuomalaisilla kielillä julkaistut sarjakuvat
in scheme: YKL - Yleisten kirjastojen luokitusjärjestelmä
notation: 85.3241
preferred label: Comics in Karelian language @en
preferred label: Tecknade serier på karelska @sv

Muilla suomalais-ugrilaisilla ja uralilaisilla kielillä julkaistut sarjakuvat
type: Concept
type: YKL-luokka
broader: Suomenkieliset sarjakuvat
in scheme: YKL - Yleisten kirjastojen luokitusjärjestelmä
narrower: Unkarinkieliset sarjakuvat
narrower: Saamenkieliset sarjakuvat
notation: 85.325
preferred label: Comics in other Finno-Ugric and Uralic languages @en
preferred label: Tecknade serier på övriga finsk-ugriska och uraliska språk @sv

Unkarinkieliset sarjakuvat
type: Concept
type: YKL-luokka
alternative label: Ungersk skönlitteratur, tecknade serier (85.3251) @sv
alternative label: Ungerska, tecknade serier (85.3251) @sv
alternative label: Unkarin kieli, sarjakuvat (85.3251)
alternative label: Unkarinkielinen kaunokirjallisuus, sarjakuvat (85.3251)
broader: Muilla suomalais-ugrilaisilla ja uralilaisilla kielillä julkaistut sarjakuvat
in scheme: YKL - Yleisten kirjastojen luokitusjärjestelmä
notation: 85.3251
preferred label: Comics in Hungarian @en
preferred label: Tecknade serier på ungerska @sv

Saamenkieliset sarjakuvat
type: Concept
type: YKL-luokka
alternative label: Saamen kieli, sarjakuvat (85.3252)
alternative label: Saamenkielinen kaunokirjallisuus, sarjakuvat (85.3252)
alternative label: Samisk skönlitteratur, tecknade serier (85.3252) @sv
alternative label: Samiska, tecknade serier (85.3252) @sv
broader: Muilla suomalais-ugrilaisilla ja uralilaisilla kielillä julkaistut sarjakuvat
in scheme: YKL - Yleisten kirjastojen luokitusjärjestelmä
notation: 85.3252
preferred label: Comics in Sami @en
preferred label: Tecknade serier på samiska @sv

Pohjoismaisilla kielillä julkaistut sarjakuvat
type: Concept
type: YKL-luokka
broader: SARJAKUVAT
in scheme: YKL - Yleisten kirjastojen luokitusjärjestelmä
narrower: Ruotsinkieliset sarjakuvat
narrower: Norjankieliset sarjakuvat
narrower: Tanskankieliset sarjakuvat
narrower: Islanninkieliset sarjakuvat
narrower: Fäärinkieliset sarjakuvat
notation: 85.33
preferred label: Comics in Nordic languages @en
preferred label: Tecknade serier på nordiska språk @sv

Ruotsinkieliset sarjakuvat
type: Concept
type: YKL-luokka
alternative label: Ruotsin kieli, sarjakuvat (85.331)
alternative label: Ruotsinkielinen kaunokirjallisuus, sarjakuvat (85.331)
alternative label: Svensk skönlitteratur, tecknade serier (85.331) @sv
alternative label: Svenska, tecknade serier (85.331) @sv
broader: Pohjoismaisilla kielillä julkaistut sarjakuvat
in scheme: YKL - Yleisten kirjastojen luokitusjärjestelmä
notation: 85.331
preferred label: Comics in Swedish @en
preferred label: Tecknade serier på svenska @sv

Norjankieliset sarjakuvat
type: Concept
type: YKL-luokka
alternative label: Norjan kieli, sarjakuvat (85.332)
alternative label: Norjankielinen kaunokirjallisuus, sarjakuvat (85.332)
alternative label: Norsk skönlitteratur, tecknade serier (85.332) @sv
alternative label: Norska, tecknade serier (85.332) @sv
broader: Pohjoismaisilla kielillä julkaistut sarjakuvat
in scheme: YKL - Yleisten kirjastojen luokitusjärjestelmä
notation: 85.332
preferred label: Comics in Norwegian @en
preferred label: Tecknade serier på norska @sv

Tanskankieliset sarjakuvat
type: Concept
type: YKL-luokka
alternative label: Dansk skönlitteratur, tecknade serier (85.333) @sv
alternative label: Danska, tecknade serier (85.333) @sv
alternative label: Tanskan kieli, sarjakuvat (85.333)
alternative label: Tanskankielinen kaunokirjallisuus, sarjakuvat (85.333)
broader: Pohjoismaisilla kielillä julkaistut sarjakuvat
in scheme: YKL - Yleisten kirjastojen luokitusjärjestelmä
notation: 85.333
preferred label: Comics in Danish @en
preferred label: Tecknade serier på danska @sv

Islanninkieliset sarjakuvat
type: Concept
type: YKL-luokka
alternative label: Islannin kieli, sarjakuvat (85.334)
alternative label: Islanninkielinen kaunokirjallisuus, sarjakuvat (85.334)
alternative label: Isländsk skönlitteratur, tecknade serier (85.334) @sv
alternative label: Isländska, tecknade serier (85.334) @sv
broader: Pohjoismaisilla kielillä julkaistut sarjakuvat
in scheme: YKL - Yleisten kirjastojen luokitusjärjestelmä
notation: 85.334
preferred label: Comics in Icelandic @en
preferred label: Tecknade serier på isländska @sv

Fäärinkieliset sarjakuvat
type: Concept
type: YKL-luokka
alternative label: Färöisk skönlitteratur, tecknade serier (85.335) @sv
alternative label: Färöiska, tecknade serier (85.335) @sv
alternative label: Fäärin kieli, sarjakuvat (85.335)
alternative label: Fäärinkielinen kaunokirjallisuus, sarjakuvat (85.335)
broader: Pohjoismaisilla kielillä julkaistut sarjakuvat
in scheme: YKL - Yleisten kirjastojen luokitusjärjestelmä
notation: 85.335
preferred label: Comics in Faeroese @en
preferred label: Tecknade serier på färöiska @sv

Saksankieliset sarjakuvat
type: Concept
type: YKL-luokka
alternative label: Saksan kieli, sarjakuvat (85.34)
alternative label: Saksankielinen kaunokirjallisuus, sarjakuvat (85.34)
alternative label: Tysk skönlitteratur, tecknade serier (85.34) @sv
alternative label: Tyska, tecknade serier (85.34) @sv
broader: SARJAKUVAT
in scheme: YKL - Yleisten kirjastojen luokitusjärjestelmä
narrower: Jiddišinkieliset sarjakuvat
narrower: Friisinkieliset sarjakuvat
narrower: Hollanninkieliset sarjakuvat
notation: 85.34
preferred label: Comics in German @en
preferred label: Tecknade serier på tyska @sv
scope note: Hit och till underklassen också tecknade serier på andra germanska språk @sv
scope note: Tähän ja alaluokkaan myös muilla germaanisilla kielillä julkaistut sarjakuvat

Jiddišinkieliset sarjakuvat
type: Concept
type: YKL-luokka
alternative label: Jiddisch, tecknade serier (85.341) @sv
alternative label: Jiddišin kieli, sarjakuvat (85.341)
broader: Saksankieliset sarjakuvat
in scheme: YKL - Yleisten kirjastojen luokitusjärjestelmä
notation: 85.341
preferred label: Comics in Yiddish language @en
preferred label: Tecknade serier på jiddisch @sv

Friisinkieliset sarjakuvat
type: Concept
type: YKL-luokka
broader: Saksankieliset sarjakuvat
in scheme: YKL - Yleisten kirjastojen luokitusjärjestelmä
notation: 85.343
preferred label: Comics in Frisian @en
preferred label: Tecknade serier på frisiska @sv

Hollanninkieliset sarjakuvat
type: Concept
type: YKL-luokka
alternative label: Hollannin kieli, sarjakuvat (85.348)
alternative label: Hollanninkielinen kaunokirjallisuus, sarjakuvat (85.348)
alternative label: Nederländsk skönlitteratur, tecknade serier (85.348) @sv
alternative label: Nederländska, tecknade serier (85.348) @sv
broader: Saksankieliset sarjakuvat
in scheme: YKL - Yleisten kirjastojen luokitusjärjestelmä
narrower: Afrikaansinkieliset sarjakuvat
notation: 85.348
preferred label: Comics in Dutch @en
preferred label: Tecknade serier på holländska @sv
scope note: Hit också tecknade serier på flamländska @sv
scope note: Tähän myös flaaminkieliset sarjakuvat

Afrikaansinkieliset sarjakuvat
type: Concept
type: YKL-luokka
alternative label: Afrikaans, tecknade serier (85.3481) @sv
alternative label: Afrikaansin kieli, sarjakuvat (85.3481)
broader: Hollanninkieliset sarjakuvat
in scheme: YKL - Yleisten kirjastojen luokitusjärjestelmä
notation: 85.3481
preferred label: Comics in Afrikaans language @en
preferred label: Tecknade serier på afrikaans @sv

Englanninkieliset sarjakuvat
type: Concept
type: YKL-luokka
alternative label: Engelsk skönlitteratur, tecknade serier (85.35) @sv
alternative label: Engelska, tecknade serier (85.35) @sv
alternative label: Englannin kieli, sarjakuvat (85.35)
alternative label: Englanninkielinen kaunokirjallisuus, sarjakuvat (85.35)
broader: SARJAKUVAT
in scheme: YKL - Yleisten kirjastojen luokitusjärjestelmä
notation: 85.35
preferred label: Comics in English @en
preferred label: Tecknade serier på engelska @sv

Romaanisilla kielillä julkaistut sarjakuvat
type: Concept
type: YKL-luokka
broader: SARJAKUVAT
in scheme: YKL - Yleisten kirjastojen luokitusjärjestelmä
narrower: Ranskankieliset sarjakuvat
narrower: Italiankieliset sarjakuvat
narrower: Espanjankieliset sarjakuvat
narrower: Portugalinkieliset sarjakuvat
narrower: Romaniankieliset sarjakuvat
narrower: Muilla romaanisilla kielillä julkaistut sarjakuvat
notation: 85.36
preferred label: Comics in Romanic languages @en
preferred label: Tecknade serier på romanska språk @sv

Ranskankieliset sarjakuvat
type: Concept
type: YKL-luokka
alternative label: Fransk skönlitteratur, tecknade serier (85.361) @sv
alternative label: Franska, tecknade serier (85.361) @sv
alternative label: Ranskan kieli, sarjakuvat (85.361)
alternative label: Ranskankielinen kaunokirjallisuus, sarjakuvat (85.361)
broader: Romaanisilla kielillä julkaistut sarjakuvat
in scheme: YKL - Yleisten kirjastojen luokitusjärjestelmä
notation: 85.361
preferred label: Comics in French @en
preferred label: Tecknade serier på franska @sv

Italiankieliset sarjakuvat
type: Concept
type: YKL-luokka
alternative label: Italian kieli, sarjakuvat (85.362)
alternative label: Italiankielinen kaunokirjallisuus, sarjakuvat (85.362)
alternative label: Italiensk skönlitteratur, tecknade serier (85.362) @sv
alternative label: Italienska, tecknade serier (85.362) @sv
broader: Romaanisilla kielillä julkaistut sarjakuvat
in scheme: YKL - Yleisten kirjastojen luokitusjärjestelmä
notation: 85.362
preferred label: Comics in Italian @en
preferred label: Tecknade serier på italienska @sv

Espanjankieliset sarjakuvat
type: Concept
type: YKL-luokka
alternative label: Espanjan kieli, sarjakuvat (85.363)
alternative label: Espanjankielinen kaunokirjallisuus, sarjakuvat (85.363)
alternative label: Spansk skönlitteratur, tecknade serier (85.363) @sv
alternative label: Spanska, tecknade serier (85.363) @sv
broader: Romaanisilla kielillä julkaistut sarjakuvat
in scheme: YKL - Yleisten kirjastojen luokitusjärjestelmä
notation: 85.363
preferred label: Comics in Spanish @en
preferred label: Tecknade serier på spanska @sv

Portugalinkieliset sarjakuvat
type: Concept
type: YKL-luokka
alternative label: Portugalin kieli, sarjakuvat (85.364)
alternative label: Portugalinkielinen kaunokirjallisuus, sarjakuvat (85.364)
alternative label: Portugisisk skönlitteratur, tecknade serier (85.364) @sv
alternative label: Portugisiska, tecknade serier (85.364) @sv
broader: Romaanisilla kielillä julkaistut sarjakuvat
in scheme: YKL - Yleisten kirjastojen luokitusjärjestelmä
notation: 85.364
preferred label: Comics in Portuguese @en
preferred label: Tecknade serier på portugisiska @sv

Romaniankieliset sarjakuvat
type: Concept
type: YKL-luokka
alternative label: Romanian kieli, sarjakuvat (85.365)
alternative label: Romaniankielinen kaunokirjallisuus, sarjakuvat (85.365)
alternative label: Rumänsk skönlitteratur, tecknade serier (85.365) @sv
alternative label: Rumänska, tecknade serier (85.365) @sv
broader: Romaanisilla kielillä julkaistut sarjakuvat
in scheme: YKL - Yleisten kirjastojen luokitusjärjestelmä
notation: 85.365
preferred label: Comics in Romanian @en
preferred label: Tecknade serier på rumänska @sv

Muilla romaanisilla kielillä julkaistut sarjakuvat
type: Concept
type: YKL-luokka
broader: Romaanisilla kielillä julkaistut sarjakuvat
in scheme: YKL - Yleisten kirjastojen luokitusjärjestelmä
narrower: Katalaaninkieliset sarjakuvat
notation: 85.367
preferred label: Comics in other Romanic languages @en
preferred label: Tecknade serier på övriga romanska språk @sv

Katalaaninkieliset sarjakuvat
type: Concept
type: YKL-luokka
alternative label: Katalaanin kieli, sarjakuvat (85.3671)
alternative label: Katalanska, tecknade serier (85.3671) @sv
broader: Muilla romaanisilla kielillä julkaistut sarjakuvat
in scheme: YKL - Yleisten kirjastojen luokitusjärjestelmä
notation: 85.3671
preferred label: Comics in Catalan language @en
preferred label: Tecknade serier på katalanska @sv

Slaavilaisilla ja balttilaisilla kielillä julkaistut sarjakuvat
type: Concept
type: YKL-luokka
broader: SARJAKUVAT
in scheme: YKL - Yleisten kirjastojen luokitusjärjestelmä
narrower: Venäjänkieliset sarjakuvat
narrower: Ukrainankieliset sarjakuvat. Valkovenäjänkieliset sarjakuvat
narrower: Puolankieliset sarjakuvat
narrower: Tšekinkieliset sarjakuvat
narrower: Slovakinkieliset sarjakuvat
narrower: Eteläslaavilaisilla kielillä julkaistut sarjakuvat
narrower: Balttilaisilla kielillä julkaistut sarjakuvat
notation: 85.37
preferred label: Comics in Slavonic and Baltic languages @en
preferred label: Tecknade serier på slaviska och baltiska språk @sv

Venäjänkieliset sarjakuvat
type: Concept
type: YKL-luokka
alternative label: Rysk skönlitteratur, tecknade serier (85.371) @sv
alternative label: Ryska, tecknade serier (85.371) @sv
alternative label: Venäjän kieli, sarjakuvat (85.371)
alternative label: Venäjänkielinen kaunokirjallisuus, sarjakuvat (85.371)
broader: Slaavilaisilla ja balttilaisilla kielillä julkaistut sarjakuvat
in scheme: YKL - Yleisten kirjastojen luokitusjärjestelmä
notation: 85.371
preferred label: Comics in Russian @en
preferred label: Tecknade serier på ryska @sv

Ukrainankieliset sarjakuvat. Valkovenäjänkieliset sarjakuvat
type: Concept
type: YKL-luokka
broader: Slaavilaisilla ja balttilaisilla kielillä julkaistut sarjakuvat
in scheme: YKL - Yleisten kirjastojen luokitusjärjestelmä
narrower: Ukrainankieliset sarjakuvat
narrower: Valkovenäjänkieliset sarjakuvat
notation: 85.372
preferred label: Comics in Ukrainian. Comics in Byelorussian @en
preferred label: Tecknade serier på ukrainska. Tecknade serier på vitryska @sv

Ukrainankieliset sarjakuvat
type: Concept
type: YKL-luokka
alternative label: Ukrainan kieli, sarjakuvat (85.3721)
alternative label: Ukrainska, tecknade serier (85.3721) @sv
broader: Ukrainankieliset sarjakuvat. Valkovenäjänkieliset sarjakuvat
in scheme: YKL - Yleisten kirjastojen luokitusjärjestelmä
notation: 85.3721
preferred label: Comics in Ukrainian @en
preferred label: Tecknade serier på ukrainska @sv

Valkovenäjänkieliset sarjakuvat
type: Concept
type: YKL-luokka
alternative label: Valkovenäjän kieli, sarjakuvat (85.3722)
alternative label: Vitryska, tecknade serier (85.3722) @sv
broader: Ukrainankieliset sarjakuvat. Valkovenäjänkieliset sarjakuvat
in scheme: YKL - Yleisten kirjastojen luokitusjärjestelmä
notation: 85.3722
preferred label: Comics in Byelorussian @en
preferred label: Tecknade serier på vitryska @sv

Puolankieliset sarjakuvat
type: Concept
type: YKL-luokka
alternative label: Polsk skönlitteratur, tecknade serier (85.373) @sv
alternative label: Polska, tecknade serier (85.373) @sv
alternative label: Puolan kieli, sarjakuvat (85.373)
alternative label: Puolankielinen kaunokirjallisuus, sarjakuvat (85.373)
broader: Slaavilaisilla ja balttilaisilla kielillä julkaistut sarjakuvat
in scheme: YKL - Yleisten kirjastojen luokitusjärjestelmä
notation: 85.373
preferred label: Comics in Polish @en
preferred label: Tecknade serier på polska @sv

Tšekinkieliset sarjakuvat
type: Concept
type: YKL-luokka
alternative label: Tjeckisk skönlitteratur, tecknade serier (85.374) @sv
alternative label: Tjeckiska, tecknade serier (85.374) @sv
alternative label: Tšekin kieli, sarjakuvat (85.374)
alternative label: Tšekinkielinen kaunokirjallisuus, sarjakuvat (85.374)
broader: Slaavilaisilla ja balttilaisilla kielillä julkaistut sarjakuvat
in scheme: YKL - Yleisten kirjastojen luokitusjärjestelmä
notation: 85.374
preferred label: Comics in Czech @en
preferred label: Tecknade serier på tjeckiska @sv

Slovakinkieliset sarjakuvat
type: Concept
type: YKL-luokka
alternative label: Slovakin kieli, sarjakuvat (85.375)
alternative label: Slovakinkielinen kaunokirjallisuus, sarjakuvat (85.375)
alternative label: Slovakisk skönlitteratur, tecknade serier (85.375) @sv
alternative label: Slovakiska, tecknade serier (85.375) @sv
broader: Slaavilaisilla ja balttilaisilla kielillä julkaistut sarjakuvat
in scheme: YKL - Yleisten kirjastojen luokitusjärjestelmä
notation: 85.375
preferred label: Comics in Slovak @en
preferred label: Tecknade serier på slovakiska @sv

Eteläslaavilaisilla kielillä julkaistut sarjakuvat
type: Concept
type: YKL-luokka
broader: Slaavilaisilla ja balttilaisilla kielillä julkaistut sarjakuvat
in scheme: YKL - Yleisten kirjastojen luokitusjärjestelmä
narrower: Bulgariankieliset sarjakuvat
narrower: Makedoniankieliset sarjakuvat
narrower: Sloveeninkieliset sarjakuvat
narrower: Serbiankieliset sarjakuvat
narrower: Kroatiankieliset sarjakuvat
narrower: Bosniankieliset sarjakuvat
notation: 85.376
preferred label: Comics in South-Slavonic languages @en
preferred label: Tecknade serier på sydslaviska språk @sv

Bulgariankieliset sarjakuvat
type: Concept
type: YKL-luokka
alternative label: Bulgarian kieli, sarjakuvat (85.3761)
alternative label: Bulgariankielinen kaunokirjallisuus, sarjakuvat (85.3761)
alternative label: Bulgarisk skönlitteratur, tecknade serier (85.3761) @sv
alternative label: Bulgariska, tecknade serier (85.3761) @sv
broader: Eteläslaavilaisilla kielillä julkaistut sarjakuvat
in scheme: YKL - Yleisten kirjastojen luokitusjärjestelmä
notation: 85.3761
preferred label: Comics in Bulgarian @en
preferred label: Tecknade serier på bulgariska @sv

Makedoniankieliset sarjakuvat
type: Concept
type: YKL-luokka
alternative label: Makedonian kieli, sarjakuvat (85.3762)
alternative label: Makedoniankielinen kaunokirjallisuus, sarjakuvat (85.3762)
alternative label: Makedonsk skönlitteratur, tecknade serier (85.3762) @sv
alternative label: Makedonska, tecknade serier (85.3762) @sv
broader: Eteläslaavilaisilla kielillä julkaistut sarjakuvat
in scheme: YKL - Yleisten kirjastojen luokitusjärjestelmä
notation: 85.3762
preferred label: Comics in Macedonian @en
preferred label: Tecknade serier på makedonska @sv

Sloveeninkieliset sarjakuvat
type: Concept
type: YKL-luokka
alternative label: Sloveenin kieli, sarjakuvat (85.3763)
alternative label: Sloveeninkielinen kaunokirjallisuus, sarjakuvat (85.3763)
alternative label: Slovensk skönlitteratur, tecknade serier (85.3763) @sv
alternative label: Slovenska, tecknade serier (85.3763) @sv
broader: Eteläslaavilaisilla kielillä julkaistut sarjakuvat
in scheme: YKL - Yleisten kirjastojen luokitusjärjestelmä
notation: 85.3763
preferred label: Comics in Slovenian @en
preferred label: Tecknade serier på slovenska @sv

Serbiankieliset sarjakuvat
type: Concept
type: YKL-luokka
alternative label: Serbian kieli, sarjakuvat (85.3764)
alternative label: Serbiankielinen kaunokirjallisuus, sarjakuvat (85.3764)
alternative label: Serbisk skönlitteratur, tecknade serier (85.3764) @sv
alternative label: Serbiska, tecknade serier (85.3764) @sv
broader: Eteläslaavilaisilla kielillä julkaistut sarjakuvat
in scheme: YKL - Yleisten kirjastojen luokitusjärjestelmä
notation: 85.3764
preferred label: Comics in Serbian @en
preferred label: Tecknade serier på serbiska @sv

Kroatiankieliset sarjakuvat
type: Concept
type: YKL-luokka
alternative label: Kroaatin kieli, sarjakuvat (85.3765)
alternative label: Kroaatinkielinen kaunokirjallisuus, sarjakuvat (85.3765)
alternative label: Kroatian kieli, sarjakuvat (85.3765)
alternative label: Kroatiankielinen kaunokirjallisuus, sarjakuvat (85.3765)
alternative label: Kroatisk skönlitteratur, tecknade serier (85.3765) @sv
alternative label: Kroatiska, tecknade serier (85.3765) @sv
broader: Eteläslaavilaisilla kielillä julkaistut sarjakuvat
in scheme: YKL - Yleisten kirjastojen luokitusjärjestelmä
notation: 85.3765
preferred label: Comics in Croatian @en
preferred label: Tecknade serier på kroatiska @sv

Bosniankieliset sarjakuvat
type: Concept
type: YKL-luokka
alternative label: Bosnian kieli, sarjakuvat (85.3766)
alternative label: Bosniankielinen kaunokirjallisuus, sarjakuvat (85.3766)
alternative label: Bosnisk skönlitteratur, tecknade serier (85.3766) @sv
alternative label: Bosniska, tecknade serier (85.3766) @sv
broader: Eteläslaavilaisilla kielillä julkaistut sarjakuvat
in scheme: YKL - Yleisten kirjastojen luokitusjärjestelmä
notation: 85.3766
preferred label: Comics in Bosnian @en
preferred label: Tecknade serier på bosniska @sv

Balttilaisilla kielillä julkaistut sarjakuvat
type: Concept
type: YKL-luokka
broader: Slaavilaisilla ja balttilaisilla kielillä julkaistut sarjakuvat
in scheme: YKL - Yleisten kirjastojen luokitusjärjestelmä
narrower: Latviankieliset sarjakuvat
narrower: Liettuankieliset sarjakuvat
notation: 85.378
preferred label: Comics in Baltic languages @en
preferred label: Tecknade serier på baltiska språk @sv

Latviankieliset sarjakuvat
type: Concept
type: YKL-luokka
alternative label: Latvian kieli, sarjakuvat (85.3781)
alternative label: Latviankielinen kaunokirjallisuus, sarjakuvat (85.3781)
alternative label: Lettisk skönlitteratur, tecknade serier (85.3781) @sv
alternative label: Lettiska, tecknade serier (85.3781) @sv
broader: Balttilaisilla kielillä julkaistut sarjakuvat
in scheme: YKL - Yleisten kirjastojen luokitusjärjestelmä
notation: 85.3781
preferred label: Comics in Latvian @en
preferred label: Tecknade serier på lettiska @sv

Liettuankieliset sarjakuvat
type: Concept
type: YKL-luokka
alternative label: Liettuan kieli, sarjakuvat (85.3782)
alternative label: Liettuankielinen kaunokirjallisuus, sarjakuvat (85.3782)
alternative label: Litauisk skönlitteratur, tecknade serier (85.3782) @sv
alternative label: Litauiska, tecknade serier (85.3782) @sv
broader: Balttilaisilla kielillä julkaistut sarjakuvat
in scheme: YKL - Yleisten kirjastojen luokitusjärjestelmä
notation: 85.3782
preferred label: Comics in Lithuanian @en
preferred label: Tecknade serier på litauiska @sv

Muilla indoeurooppalaisilla kielillä julkaistut sarjakuvat
type: Concept
type: YKL-luokka
broader: SARJAKUVAT
in scheme: YKL - Yleisten kirjastojen luokitusjärjestelmä
narrower: Kreikankieliset sarjakuvat
narrower: Latinankieliset sarjakuvat
narrower: Indoiraanisilla kielillä julkaistut sarjakuvat
narrower: Albaniankieliset sarjakuvat
narrower: Armeniankieliset sarjakuvat
narrower: Kelttiläisillä kielillä julkaistut sarjakuvat
notation: 85.38
preferred label: Comics in other Indo-European languages @en
preferred label: Tecknade serier på övriga indoeuropeiska språk @sv

Kreikankieliset sarjakuvat
type: Concept
type: YKL-luokka
alternative label: Grekisk skönlitteratur, forngrekiska, tecknade serier (85.381) @sv
alternative label: Grekiska, forngrekiska, tecknade serier (85.381) @sv
alternative label: Kreikan kieli, muinaiskreikka, sarjakuvat (85.381)
alternative label: Kreikankielinen kaunokirjallisuus, muinaiskreikka, sarjakuvat (85.381)
broader: Muilla indoeurooppalaisilla kielillä julkaistut sarjakuvat
in scheme: YKL - Yleisten kirjastojen luokitusjärjestelmä
narrower: Nykykreikankieliset sarjakuvat
notation: 85.381
preferred label: Comics in Greek @en
preferred label: Tecknade serier på grekiska @sv

Nykykreikankieliset sarjakuvat
type: Concept
type: YKL-luokka
alternative label: Grekisk skönlitteratur, nygrekiska, tecknade serier (85.3812) @sv
alternative label: Grekiska, nygrekiska, tecknade serier (85.3812) @sv
alternative label: Kreikan kieli, nykykreikka, sarjakuvat (85.3812)
alternative label: Kreikankielinen kaunokirjallisuus, nykykreikka, sarjakuvat (85.3812)
broader: Kreikankieliset sarjakuvat
in scheme: YKL - Yleisten kirjastojen luokitusjärjestelmä
notation: 85.3812
preferred label: Comics in Modern Greek @en
preferred label: Tecknade serier på nygrekiska @sv

Latinankieliset sarjakuvat
type: Concept
type: YKL-luokka
alternative label: Latin, tecknade serier (85.382) @sv
alternative label: Latinan kieli, sarjakuvat (85.382)
alternative label: Latinankielinen kaunokirjallisuus, sarjakuvat (85.382)
alternative label: Latinsk skönlitteratur, tecknade serier (85.382) @sv
broader: Muilla indoeurooppalaisilla kielillä julkaistut sarjakuvat
in scheme: YKL - Yleisten kirjastojen luokitusjärjestelmä
notation: 85.382
preferred label: Comics in Latin @en
preferred label: Tecknade serier på latin @sv

Indoiraanisilla kielillä julkaistut sarjakuvat
type: Concept
type: YKL-luokka
broader: Muilla indoeurooppalaisilla kielillä julkaistut sarjakuvat
in scheme: YKL - Yleisten kirjastojen luokitusjärjestelmä
narrower: Persiankieliset sarjakuvat
narrower: Kurdinkieliset sarjakuvat
narrower: Pastonkieliset sarjakuvat
narrower: Indoarjalaisilla kielillä julkaistut sarjakuvat
notation: 85.383
preferred label: Comics in Indo-Iranian languages @en
preferred label: Tecknade serier på indoiranska språk @sv
scope note: Intialaisilla ja iranilaisilla kielillä julkaistut sarjakuvat
scope note: Tecknade serier på indiska och iranska språk @sv

Persiankieliset sarjakuvat
type: Concept
type: YKL-luokka
alternative label: Persian kieli, sarjakuvat (85.3831)
alternative label: Persiankielinen kaunokirjallisuus, sarjakuvat (85.3831)
alternative label: Persisk skönlitteratur, tecknade serier (85.3831) @sv
alternative label: Persiska, tecknade serier (85.3831) @sv
broader: Indoiraanisilla kielillä julkaistut sarjakuvat
in scheme: YKL - Yleisten kirjastojen luokitusjärjestelmä
narrower: Darinkieliset sarjakuvat
notation: 85.3831
preferred label: Comics in Persian @en
preferred label: Tecknade serier på persiska @sv

Darinkieliset sarjakuvat
type: Concept
type: YKL-luokka
alternative label: Dari kieli, sarjakuvat (85.38311)
alternative label: Dari, tecknade serier (85.38311) @sv
alternative label: Darinkielinen kaunokirjallisuus, sarjakuvat (85.38311)
alternative label: Skönlitteratur på dari, tecknade serier (85.38311) @sv
broader: Persiankieliset sarjakuvat
in scheme: YKL - Yleisten kirjastojen luokitusjärjestelmä
notation: 85.38311
preferred label: Comics in Dari language @en
preferred label: Tecknade serier på dari @sv

Kurdinkieliset sarjakuvat
type: Concept
type: YKL-luokka
alternative label: Kurdin kieli, sarjakuvat (85.3832)
alternative label: Kurdinkielinen kaunokirjallisuus, sarjakuvat (85.3832)
alternative label: Kurdisk skönlitteratur, tecknade serier (85.3832) @sv
alternative label: Kurdiska, tecknade serier (85.3832) @sv
broader: Indoiraanisilla kielillä julkaistut sarjakuvat
in scheme: YKL - Yleisten kirjastojen luokitusjärjestelmä
narrower: Kurmandžinkieliset sarjakuvat
narrower: Soraninkieliset sarjakuvat
notation: 85.3832
preferred label: Comics in Kurdish @en
preferred label: Tecknade serier på kurdiska @sv

Kurmandžinkieliset sarjakuvat
type: Concept
type: YKL-luokka
alternative label: Kurmandžin kieli, sarjakuvat (85.38321)
alternative label: Kurmanji, tecknade serier (85.38321) @sv
broader: Kurdinkieliset sarjakuvat
in scheme: YKL - Yleisten kirjastojen luokitusjärjestelmä
notation: 85.38321
preferred label: Comics in Kurmanji language @en
preferred label: Tecknade serier på kurmanji @sv

Soraninkieliset sarjakuvat
type: Concept
type: YKL-luokka
alternative label: Sorani, tecknade serier (85.38322) @sv
alternative label: Soranin kieli, sarjakuvat (85.38322)
broader: Kurdinkieliset sarjakuvat
in scheme: YKL - Yleisten kirjastojen luokitusjärjestelmä
notation: 85.38322
preferred label: Comics in Sorani language @en
preferred label: Tecknade serier på sorani @sv

Pastonkieliset sarjakuvat
type: Concept
type: YKL-luokka
alternative label: Pashto, tecknade serier (85.3833) @sv
alternative label: Paston kieli, sarjakuvat (85.3833)
broader: Indoiraanisilla kielillä julkaistut sarjakuvat
in scheme: YKL - Yleisten kirjastojen luokitusjärjestelmä
notation: 85.3833
preferred label: Comics in Pushto language @en
preferred label: Tecknade serier på pashto @sv

Indoarjalaisilla kielillä julkaistut sarjakuvat
type: Concept
type: YKL-luokka
broader: Indoiraanisilla kielillä julkaistut sarjakuvat
in scheme: YKL - Yleisten kirjastojen luokitusjärjestelmä
narrower: Bengalinkieliset sarjakuvat
narrower: Gudžaratinkieliset sarjakuvat
narrower: Hindinkieliset sarjakuvat
narrower: Pandzabinkieliset sarjakuvat
narrower: Romanikieliset sarjakuvat
narrower: Urdunkieliset sarjakuvat
narrower: Nepalinkieliset sarjakuvat
narrower: Sinhalankieliset sarjakuvat
notation: 85.3836
preferred label: Comics in Indo-Aryan languages @en
preferred label: Tecknade serier på indoariska spåk @sv

Bengalinkieliset sarjakuvat
type: Concept
type: YKL-luokka
alternative label: Bengali, tecknade serier (85.38361) @sv
alternative label: Bengalin kieli, sarjakuvat (85.38361)
broader: Indoarjalaisilla kielillä julkaistut sarjakuvat
in scheme: YKL - Yleisten kirjastojen luokitusjärjestelmä
notation: 85.38361
preferred label: Comics in Bengali language @en
preferred label: Tecknade serier på bengali @sv

Gudžaratinkieliset sarjakuvat
type: Concept
type: YKL-luokka
alternative label: Gudžaratin kieli, sarjakuvat (85.38362)
alternative label: Gujarati, tecknade serier (85.38362) @sv
broader: Indoarjalaisilla kielillä julkaistut sarjakuvat
in scheme: YKL - Yleisten kirjastojen luokitusjärjestelmä
notation: 85.38362
preferred label: Comics in Gujarati language @en
preferred label: Tecknade serier på gujarati @sv

Hindinkieliset sarjakuvat
type: Concept
type: YKL-luokka
alternative label: Hindi, tecknade serier (85.38363) @sv
alternative label: Hindin kieli, sarjakuvat (85.38363)
broader: Indoarjalaisilla kielillä julkaistut sarjakuvat
in scheme: YKL - Yleisten kirjastojen luokitusjärjestelmä
notation: 85.38363
preferred label: Comics in Hindi language @en
preferred label: Tecknade serier på hindi @sv

Pandzabinkieliset sarjakuvat
type: Concept
type: YKL-luokka
alternative label: Pandzabin kieli, sarjakuvat (85.38364)
alternative label: Panjabi, tecknade serier (85.38364) @sv
broader: Indoarjalaisilla kielillä julkaistut sarjakuvat
in scheme: YKL - Yleisten kirjastojen luokitusjärjestelmä
notation: 85.38364
preferred label: Comics in Punjabi language @en
preferred label: Tecknade serier på panjabi @sv

Romanikieliset sarjakuvat
type: Concept
type: YKL-luokka
alternative label: Romani, tecknade serier (85.38365) @sv
alternative label: Romanikieli, sarjakuvat (85.38365)
broader: Indoarjalaisilla kielillä julkaistut sarjakuvat
in scheme: YKL - Yleisten kirjastojen luokitusjärjestelmä
notation: 85.38365
preferred label: Comics in Romani language @en
preferred label: Tecknade serier på romani @sv

Urdunkieliset sarjakuvat
type: Concept
type: YKL-luokka
alternative label: Urdu, tecknade serier (85.38366) @sv
alternative label: Urdun kieli, sarjakuvat (85.38366)
broader: Indoarjalaisilla kielillä julkaistut sarjakuvat
in scheme: YKL - Yleisten kirjastojen luokitusjärjestelmä
notation: 85.38366
preferred label: Comics in Urdu language @en
preferred label: Tecknade serier på urdu @sv

Nepalinkieliset sarjakuvat
type: Concept
type: YKL-luokka
alternative label: Nepali, tecknade serier (85.38367) @sv
alternative label: Nepalin kieli, sarjakuvat (85.38367)
broader: Indoarjalaisilla kielillä julkaistut sarjakuvat
in scheme: YKL - Yleisten kirjastojen luokitusjärjestelmä
notation: 85.38367
preferred label: Comics in Nepali language @en
preferred label: Tecknade serier på nepali @sv

Sinhalankieliset sarjakuvat
type: Concept
type: YKL-luokka
alternative label: Singalesiska, tecknade serier (85.38368) @sv
alternative label: Sinhalan kieli, sarjakuvat (85.38368)
broader: Indoarjalaisilla kielillä julkaistut sarjakuvat
in scheme: YKL - Yleisten kirjastojen luokitusjärjestelmä
notation: 85.38368
preferred label: Comics in Sinhalese language @en
preferred label: Tecknade serier på singalesiska @sv

Albaniankieliset sarjakuvat
type: Concept
type: YKL-luokka
alternative label: Albanian kieli, sarjakuvat (85.384)
alternative label: Albaniankielinen kaunokirjallisuus, sarjakuvat (85.384)
alternative label: Albansk skönlitteratur, tecknade serier (85.384) @sv
alternative label: Albanska, tecknade serier (85.384) @sv
broader: Muilla indoeurooppalaisilla kielillä julkaistut sarjakuvat
in scheme: YKL - Yleisten kirjastojen luokitusjärjestelmä
notation: 85.384
preferred label: Comics in Albanian @en
preferred label: Tecknade serier på albanska @sv

Armeniankieliset sarjakuvat
type: Concept
type: YKL-luokka
alternative label: Armenian kieli, sarjakuvat (85.385)
alternative label: Armeniska, tecknade serier (85.385) @sv
broader: Muilla indoeurooppalaisilla kielillä julkaistut sarjakuvat
in scheme: YKL - Yleisten kirjastojen luokitusjärjestelmä
notation: 85.385
preferred label: Comics in Armenian language @en
preferred label: Tecknade serier på armeniska @sv

Kelttiläisillä kielillä julkaistut sarjakuvat
type: Concept
type: YKL-luokka
broader: Muilla indoeurooppalaisilla kielillä julkaistut sarjakuvat
in scheme: YKL - Yleisten kirjastojen luokitusjärjestelmä
notation: 85.388
preferred label: Comics in Celtic languages @en
preferred label: Tecknade serier på keltiska språk @sv

Muilla kielillä julkaistut sarjakuvat
type: Concept
type: YKL-luokka
broader: SARJAKUVAT
in scheme: YKL - Yleisten kirjastojen luokitusjärjestelmä
narrower: Turkkilaisilla kielillä julkaistut sarjakuvat
narrower: Afroaasialaisilla kielillä julkaistut sarjakuvat
narrower: Sinotiibetiläisillä ja austroaasialaisilla kielillä julkaistut sarjakuvat
narrower: Japanin- ja koreankieliset sarjakuvat
narrower: Afrikkalaisilla kielillä julkaistut sarjakuvat
narrower: Kaukasialaisilla kielillä julkaistut sarjakuvat
narrower: Eskimo- ja intiaanikielillä julkaistut sarjakuvat
narrower: Muilla ei-indoeurooppalaisilla kielillä julkaistut sarjakuvat
notation: 85.39
preferred label: Comics in other languages @en
preferred label: Tecknade serier på övriga språk @sv

Turkkilaisilla kielillä julkaistut sarjakuvat
type: Concept
type: YKL-luokka
broader: Muilla kielillä julkaistut sarjakuvat
in scheme: YKL - Yleisten kirjastojen luokitusjärjestelmä
narrower: Turkinkieliset sarjakuvat
narrower: Azerinkieliset sarjakuvat
narrower: Turkmeeninkieliset sarjakuvat
narrower: Uiguurinkieliset sarjakuvat
narrower: Uzbekinkieliset sarjakuvat
notation: 85.391
preferred label: Comics in Turkic languages @en
preferred label: Tecknade serier på turkiska spåk @sv

Turkinkieliset sarjakuvat
type: Concept
type: YKL-luokka
alternative label: Turkin kieli, sarjakuvat (85.3911)
alternative label: Turkisk skönlitteratur, tecknade serier (85.3911) @sv
broader: Turkkilaisilla kielillä julkaistut sarjakuvat
in scheme: YKL - Yleisten kirjastojen luokitusjärjestelmä
notation: 85.3911
preferred label: Comics in Turkish @en
preferred label: Tecknade serier på turkiska @sv

Azerinkieliset sarjakuvat
type: Concept
type: YKL-luokka
alternative label: Azerbajdzjanska, tecknade serier (85.3912) @sv
alternative label: Azerin kieli, sarjakuvat (85.3912)
broader: Turkkilaisilla kielillä julkaistut sarjakuvat
in scheme: YKL - Yleisten kirjastojen luokitusjärjestelmä
notation: 85.3912
preferred label: Comics in Azerbaijani language @en
preferred label: Tecknade serier på azerbajdzjanska @sv

Turkmeeninkieliset sarjakuvat
type: Concept
type: YKL-luokka
alternative label: Turkmeenin kieli, sarjakuvat (85.3913)
alternative label: Turkmeniska, tecknade serier (85.3913) @sv
broader: Turkkilaisilla kielillä julkaistut sarjakuvat
in scheme: YKL - Yleisten kirjastojen luokitusjärjestelmä
notation: 85.3913
preferred label: Comics in Turkmen language @en
preferred label: Tecknade serier på turkmeniska @sv

Uiguurinkieliset sarjakuvat
type: Concept
type: YKL-luokka
alternative label: Uiguriska, tecknade serier (85.3914) @sv
alternative label: Uiguurin kieli, sarjakuvat (85.3914)
broader: Turkkilaisilla kielillä julkaistut sarjakuvat
in scheme: YKL - Yleisten kirjastojen luokitusjärjestelmä
notation: 85.3914
preferred label: Comics in Uighur language @en
preferred label: Tecknade serier på uiguriska @sv

Uzbekinkieliset sarjakuvat
type: Concept
type: YKL-luokka
alternative label: Uzbekin kieli, sarjakuvat (85.3915)
alternative label: Uzbekiska, tecknade serier (85.3915) @sv
broader: Turkkilaisilla kielillä julkaistut sarjakuvat
in scheme: YKL - Yleisten kirjastojen luokitusjärjestelmä
notation: 85.3915
preferred label: Comics in Uzbek language @en
preferred label: Tecknade serier på uzbekiska @sv

Afroaasialaisilla kielillä julkaistut sarjakuvat
type: Concept
type: YKL-luokka
broader: Muilla kielillä julkaistut sarjakuvat
in scheme: YKL - Yleisten kirjastojen luokitusjärjestelmä
narrower: Hepreankieliset sarjakuvat
narrower: Arabiankieliset sarjakuvat
narrower: Amharankieliset sarjakuvat
narrower: Tigrinjankieliset sarjakuvat
narrower: Somalinkieliset sarjakuvat
notation: 85.392
preferred label: Comics in Afroasiatic languages @en
preferred label: Tecknade serier på afroasiatiska @sv

Hepreankieliset sarjakuvat
type: Concept
type: YKL-luokka
alternative label: Hebreisk skönlitteratur, tecknade serier (85.3922) @sv
alternative label: Hebreiska, tecknade serier (85.3922) @sv
alternative label: Heprean kieli, sarjakuvat (85.3922)
alternative label: Hepreankielinen kaunokirjallisuus, sarjakuvat (85.3922)
broader: Afroaasialaisilla kielillä julkaistut sarjakuvat
in scheme: YKL - Yleisten kirjastojen luokitusjärjestelmä
notation: 85.3922
preferred label: Comics in Hebrew @en
preferred label: Tecknade serier på hebreiska @sv

Arabiankieliset sarjakuvat
type: Concept
type: YKL-luokka
alternative label: Arabian kieli, sarjakuvat (85.3923)
alternative label: Arabiankielinen kaunokirjallisuus, sarjakuvat (85.3923)
alternative label: Arabisk skönlitteratur, tecknade serier (85.3923) @sv
alternative label: Arabiska, tecknade serier (85.3923) @sv
broader: Afroaasialaisilla kielillä julkaistut sarjakuvat
in scheme: YKL - Yleisten kirjastojen luokitusjärjestelmä
notation: 85.3923
preferred label: Comics in Arabic @en
preferred label: Tecknade serier på arabiska @sv

Amharankieliset sarjakuvat
type: Concept
type: YKL-luokka
alternative label: Amharan kieli, sarjakuvat (85.3924)
alternative label: Amhariska, tecknade serier (85.3924) @sv
broader: Afroaasialaisilla kielillä julkaistut sarjakuvat
in scheme: YKL - Yleisten kirjastojen luokitusjärjestelmä
notation: 85.3924
preferred label: Comics in Amharic language @en
preferred label: Tecknade serier på amhariska @sv

Tigrinjankieliset sarjakuvat
type: Concept
type: YKL-luokka
alternative label: Tigrinja, tecknade serier (85.3925) @sv
alternative label: Tigrinjan kieli, sarjakuvat (85.3925)
broader: Afroaasialaisilla kielillä julkaistut sarjakuvat
in scheme: YKL - Yleisten kirjastojen luokitusjärjestelmä
notation: 85.3925
preferred label: Comics in Tigrinya language @en
preferred label: Tecknade serier på tigrinja @sv

Somalinkieliset sarjakuvat
type: Concept
type: YKL-luokka
alternative label: Somalin kieli, sarjakuvat (85.3926)
alternative label: Somaliska, tecknade serier (85.3926) @sv
broader: Afroaasialaisilla kielillä julkaistut sarjakuvat
in scheme: YKL - Yleisten kirjastojen luokitusjärjestelmä
notation: 85.3926
preferred label: Comics in Somali language @en
preferred label: Tecknade serier på somaliska @sv

Sinotiibetiläisillä ja austroaasialaisilla kielillä julkaistut sarjakuvat
type: Concept
type: YKL-luokka
broader: Muilla kielillä julkaistut sarjakuvat
in scheme: YKL - Yleisten kirjastojen luokitusjärjestelmä
narrower: Kiinankieliset sarjakuvat
narrower: Burmankieliset sarjakuvat
narrower: Kareninkieliset sarjakuvat
narrower: Thainkieliset sarjakuvat
narrower: Vietnaminkieliset sarjakuvat
narrower: Khmerinkieliset sarjakuvat
notation: 85.394
preferred label: Comics in Sino-Tibetan and Austroasiatic languages @en
preferred label: Tecknade serier på sinotibetanska och austroasiatiska språk @sv

Kiinankieliset sarjakuvat
type: Concept
type: YKL-luokka
alternative label: Kiinan kieli, sarjakuvat (85.3943)
alternative label: Kiinankielinen kaunokirjallisuus, sarjakuvat (85.3943)
alternative label: Kinesisk skönlitteratur, tecknade serier (85.3943) @sv
alternative label: Kinesiska, tecknade serier (85.3943) @sv
broader: Sinotiibetiläisillä ja austroaasialaisilla kielillä julkaistut sarjakuvat
in scheme: YKL - Yleisten kirjastojen luokitusjärjestelmä
notation: 85.3943
preferred label: Comics in Chinese @en
preferred label: Tecknade serier på kinesiska @sv

Burmankieliset sarjakuvat
type: Concept
type: YKL-luokka
alternative label: Burman kieli, sarjakuvat (85.3944)
alternative label: Burmesiska, tecknade serier (85.3944) @sv
broader: Sinotiibetiläisillä ja austroaasialaisilla kielillä julkaistut sarjakuvat
in scheme: YKL - Yleisten kirjastojen luokitusjärjestelmä
notation: 85.3944
preferred label: Comics in Burmese language @en
preferred label: Tecknade serier på burmesiska @sv

Kareninkieliset sarjakuvat
type: Concept
type: YKL-luokka
alternative label: Karenin kieli, sarjakuvat (85.3945)
alternative label: Karenska, tecknade serier (85.3945) @sv
broader: Sinotiibetiläisillä ja austroaasialaisilla kielillä julkaistut sarjakuvat
in scheme: YKL - Yleisten kirjastojen luokitusjärjestelmä
notation: 85.3945
preferred label: Comics in Karen languages @en
preferred label: Tecknade serier på karenska @sv

Thainkieliset sarjakuvat
type: Concept
type: YKL-luokka
alternative label: Thai, tecknade serier (85.3946) @sv
alternative label: Thailändsk skönlitteratur, tecknade serier (85.3946) @sv
alternative label: Thain kieli, sarjakuvat (85.3946)
alternative label: Thainkielinen kaunokirjallisuus, sarjakuvat (85.3946)
broader: Sinotiibetiläisillä ja austroaasialaisilla kielillä julkaistut sarjakuvat
in scheme: YKL - Yleisten kirjastojen luokitusjärjestelmä
notation: 85.3946
preferred label: Comics in Thai @en
preferred label: Tecknade serier på thailändska @sv

Vietnaminkieliset sarjakuvat
type: Concept
type: YKL-luokka
alternative label: Vietnamesisk skönlitteratur, tecknade serier (85.3948) @sv
alternative label: Vietnamesiska, tecknade serier (85.3948) @sv
alternative label: Vietnamin kieli, sarjakuvat (85.3948)
alternative label: Vietnaminkielinen kaunokirjallisuus, sarjakuvat (85.3948)
broader: Sinotiibetiläisillä ja austroaasialaisilla kielillä julkaistut sarjakuvat
in scheme: YKL - Yleisten kirjastojen luokitusjärjestelmä
notation: 85.3948
preferred label: Comics in Vietnamese @en
preferred label: Tecknade serier på vietnamesiska @sv

Khmerinkieliset sarjakuvat
type: Concept
type: YKL-luokka
alternative label: Khmer, tecknade serier (85.3949) @sv
alternative label: Khmerin kieli, sarjakuvat (85.3949)
broader: Sinotiibetiläisillä ja austroaasialaisilla kielillä julkaistut sarjakuvat
in scheme: YKL - Yleisten kirjastojen luokitusjärjestelmä
notation: 85.3949
preferred label: Comics in Khmer language @en
preferred label: Tecknade serier på khmer @sv

Japanin- ja koreankieliset sarjakuvat
type: Concept
type: YKL-luokka
broader: Muilla kielillä julkaistut sarjakuvat
in scheme: YKL - Yleisten kirjastojen luokitusjärjestelmä
narrower: Japaninkieliset sarjakuvat
narrower: Koreankieliset sarjakuvat
notation: 85.395
preferred label: Comics in Japanese. Comics in Korean @en
preferred label: Tecknade serier på japanska. Tecknade serier på koreanska @sv

Japaninkieliset sarjakuvat
type: Concept
type: YKL-luokka
alternative label: Japanin kieli, sarjakuvat (85.3951)
alternative label: Japaninkielinen kaunokirjallisuus, sarjakuvat (85.3951)
alternative label: Japansk skönlitteratur, tecknade serier (85.3951) @sv
alternative label: Japanska, tecknade serier (85.3951) @sv
broader: Japanin- ja koreankieliset sarjakuvat
in scheme: YKL - Yleisten kirjastojen luokitusjärjestelmä
notation: 85.3951
preferred label: Comics in Japanese @en
preferred label: Tecknade serier på japanska @sv

Koreankieliset sarjakuvat
type: Concept
type: YKL-luokka
alternative label: Korean kieli, sarjakuvat (85.3955)
alternative label: Koreankielinen kaunokirjallisuus, sarjakuvat (85.3955)
alternative label: Koreansk skönlitteratur, tecknade serier (85.3955) @sv
alternative label: Koreanska, tecknade serier (85.3955) @sv
broader: Japanin- ja koreankieliset sarjakuvat
in scheme: YKL - Yleisten kirjastojen luokitusjärjestelmä
notation: 85.3955
preferred label: Comics in Korean @en
preferred label: Tecknade serier på koreanska @sv

Afrikkalaisilla kielillä julkaistut sarjakuvat
type: Concept
type: YKL-luokka
broader: Muilla kielillä julkaistut sarjakuvat
in scheme: YKL - Yleisten kirjastojen luokitusjärjestelmä
narrower: Swahilinkieliset sarjakuvat
narrower: Lingalankieliset sarjakuvat
notation: 85.396
preferred label: Comics in African languages @en
preferred label: Tecknade serier på afrikanska språk @sv
scope note: Hit tecknade serier på afrikanska språk som talas söder om Sahara, Etiopien och Somalia @sv
scope note: Tähän Saharan, Etiopian ja Somalian eteläpuolella puhutuilla afrikkalaisilla kielillä julkaistut sarjakuvat

Swahilinkieliset sarjakuvat
type: Concept
type: YKL-luokka
alternative label: Swahili, tecknade serier (85.3961) @sv
alternative label: Swahilin kieli, sarjakuvat (85.3961)
broader: Afrikkalaisilla kielillä julkaistut sarjakuvat
in scheme: YKL - Yleisten kirjastojen luokitusjärjestelmä
notation: 85.3961
preferred label: Comics in Swahili language @en
preferred label: Tecknade serier på swahili @sv

Lingalankieliset sarjakuvat
type: Concept
type: YKL-luokka
alternative label: Lingala, tecknade serier (85.3962) @sv
alternative label: Lingalan kieli, sarjakuvat (85.3962)
broader: Afrikkalaisilla kielillä julkaistut sarjakuvat
in scheme: YKL - Yleisten kirjastojen luokitusjärjestelmä
notation: 85.3962
preferred label: Comics in Lingala language @en
preferred label: Tecknade serier på lingala @sv

Kaukasialaisilla kielillä julkaistut sarjakuvat
type: Concept
type: YKL-luokka
broader: Muilla kielillä julkaistut sarjakuvat
in scheme: YKL - Yleisten kirjastojen luokitusjärjestelmä
narrower: Georgiankieliset sarjakuvat
narrower: Abhaasin, kabardin ja adygenkieliset sarjakuvat
narrower: Tšetšeeninkinkieliset sarjakuvat
notation: 85.397
preferred label: Comics in Caucasian languages @en
preferred label: Tecknade serier på kaukasiska spåk @sv

Georgiankieliset sarjakuvat
type: Concept
type: YKL-luokka
alternative label: Georgian kieli, sarjakuvat (85.3971)
alternative label: Georgiska, tecknade serier (85.3971) @sv
broader: Kaukasialaisilla kielillä julkaistut sarjakuvat
in scheme: YKL - Yleisten kirjastojen luokitusjärjestelmä
notation: 85.3971
preferred label: Comics in Georgian language @en
preferred label: Tecknade serier på georgiska @sv

Abhaasin, kabardin ja adygenkieliset sarjakuvat
type: Concept
type: YKL-luokka
alternative label: Abchaziska, tecknade serier (85.3972) @sv
alternative label: Abhaasin kieli, sarjakuvat (85.3972)
alternative label: Adygeiska, tecknade serier (85.3972) @sv
alternative label: Adygen kieli, sarjakuvat (85.3972)
alternative label: Kabardin kieli, sarjakuvat (85.3972)
alternative label: Kabardinska, tecknade serier (85.3972) @sv
broader: Kaukasialaisilla kielillä julkaistut sarjakuvat
in scheme: YKL - Yleisten kirjastojen luokitusjärjestelmä
notation: 85.3972
preferred label: Comics in Abkhaz, Kabardian and Adyghe languages @en
preferred label: Tecknade serier på abchaziska, kabardinska och adygeiska @sv

Tšetšeeninkinkieliset sarjakuvat
type: Concept
type: YKL-luokka
alternative label: Tjetjenska, tecknade serier (85.3973) @sv
alternative label: Tšetšeenin kieli, sarjakuvat (85.3973)
broader: Kaukasialaisilla kielillä julkaistut sarjakuvat
in scheme: YKL - Yleisten kirjastojen luokitusjärjestelmä
notation: 85.3973
preferred label: Comics in Chechen language @en
preferred label: Tecknade serier på tjetjenska @sv

Eskimo- ja intiaanikielillä julkaistut sarjakuvat
type: Concept
type: YKL-luokka
broader: Muilla kielillä julkaistut sarjakuvat
in scheme: YKL - Yleisten kirjastojen luokitusjärjestelmä
narrower: Grönlanninkieliset sarjakuvat
notation: 85.398
preferred label: Comics in Eskimo and Indian languages @en
preferred label: Tecknade serier på eskimå- och indianspråk @sv

Grönlanninkieliset sarjakuvat
type: Concept
type: YKL-luokka
alternative label: Grönlannin kieli, sarjakuvat (85.3981)
alternative label: Grönländska, tecknade serier (85.3981) @sv
broader: Eskimo- ja intiaanikielillä julkaistut sarjakuvat
in scheme: YKL - Yleisten kirjastojen luokitusjärjestelmä
notation: 85.3981
preferred label: Comics in Greenlandic language @en
preferred label: Tecknade serier på grönländska @sv

Muilla ei-indoeurooppalaisilla kielillä julkaistut sarjakuvat
type: Concept
type: YKL-luokka
broader: Muilla kielillä julkaistut sarjakuvat
in scheme: YKL - Yleisten kirjastojen luokitusjärjestelmä
narrower: Keinotekoisilla kielillä julkaistut sarjakuvat
narrower: Baskinkieliset sarjakuvat
narrower: Dravidakieliset sarjakuvat
narrower: Austronesialaisilla kielillä julkaistut sarjakuvat
notation: 85.399
preferred label: Comics in other Non-Indoeuropean languages @en
preferred label: Tecknade serier på övriga icke-indoeuropeiska språk @sv

Keinotekoisilla kielillä julkaistut sarjakuvat
type: Concept
type: YKL-luokka
broader: Muilla ei-indoeurooppalaisilla kielillä julkaistut sarjakuvat
in scheme: YKL - Yleisten kirjastojen luokitusjärjestelmä
notation: 85.3991
preferred label: Comics in artificial languages @en
preferred label: Tecknade serier på artificiella språk @sv

Baskinkieliset sarjakuvat
type: Concept
type: YKL-luokka
alternative label: Baskin kieli, sarjakuvat (85.3992)
alternative label: Baskiska, tecknade serier (85.3992) @sv
broader: Muilla ei-indoeurooppalaisilla kielillä julkaistut sarjakuvat
in scheme: YKL - Yleisten kirjastojen luokitusjärjestelmä
notation: 85.3992
preferred label: Comics in Basque language @en
preferred label: Tecknade serier på baskiska @sv

Dravidakieliset sarjakuvat
type: Concept
type: YKL-luokka
broader: Muilla ei-indoeurooppalaisilla kielillä julkaistut sarjakuvat
in scheme: YKL - Yleisten kirjastojen luokitusjärjestelmä
narrower: Malajalaminkieliset sarjakuvat
narrower: Kannadankieliset sarjakuvat
narrower: Tamilinkieliset sarjakuvat
narrower: Telugunkieliset sarjakuvat
notation: 85.3994
preferred label: Comics in Dravidian languages @en
preferred label: Tecknade serier på dravidiska @sv

Malajalaminkieliset sarjakuvat
type: Concept
type: YKL-luokka
alternative label: Malajalamin kieli, sarjakuvat (85.39941)
alternative label: Malayalam, tecknade serier (85.39941) @sv
broader: Dravidakieliset sarjakuvat
in scheme: YKL - Yleisten kirjastojen luokitusjärjestelmä
notation: 85.39941
preferred label: Comics in Malayalam language @en
preferred label: Tecknade serier på malayalam @sv

Kannadankieliset sarjakuvat
type: Concept
type: YKL-luokka
alternative label: Kannada, tecknade serier (85.39942) @sv
alternative label: Kannadan kieli, sarjakuvat (85.39942)
broader: Dravidakieliset sarjakuvat
in scheme: YKL - Yleisten kirjastojen luokitusjärjestelmä
notation: 85.39942
preferred label: Comics in Kannada language @en
preferred label: Tecknade serier på kannada @sv

Tamilinkieliset sarjakuvat
type: Concept
type: YKL-luokka
alternative label: Tamil, tecknade serier (85.39943) @sv
alternative label: Tamilin kieli, sarjakuvat (85.39943)
broader: Dravidakieliset sarjakuvat
in scheme: YKL - Yleisten kirjastojen luokitusjärjestelmä
notation: 85.39943
preferred label: Comics in Tamil language @en
preferred label: Tecknade serier på tamil @sv

Telugunkieliset sarjakuvat
type: Concept
type: YKL-luokka
alternative label: Telugu, tecknade serier (85.39944) @sv
alternative label: Telugun kieli, sarjakuvat (85.39944)
broader: Dravidakieliset sarjakuvat
in scheme: YKL - Yleisten kirjastojen luokitusjärjestelmä
notation: 85.39944
preferred label: Comics in Telugu language @en
preferred label: Tecknade serier på telugu @sv

Austronesialaisilla kielillä julkaistut sarjakuvat
type: Concept
type: YKL-luokka
broader: Muilla ei-indoeurooppalaisilla kielillä julkaistut sarjakuvat
in scheme: YKL - Yleisten kirjastojen luokitusjärjestelmä
narrower: Tagaloginkieliset sarjakuvat
narrower: Malaijinkieliset sarjakuvat
narrower: Indonesiankieliset sarjakuvat
notation: 85.3995
preferred label: Comics in Austronesian languages @en
preferred label: Tecknade serier på austronesiska @sv

Tagaloginkieliset sarjakuvat
type: Concept
type: YKL-luokka
alternative label: Tagalog, tecknade serier (85.39951) @sv
alternative label: Tagalogin kieli, sarjakuvat (85.39951)
broader: Austronesialaisilla kielillä julkaistut sarjakuvat
in scheme: YKL - Yleisten kirjastojen luokitusjärjestelmä
notation: 85.39951
preferred label: Comics in Tagalog language @en
preferred label: Tecknade serier på tagalog @sv

Malaijinkieliset sarjakuvat
type: Concept
type: YKL-luokka
alternative label: Malaijin kieli, sarjakuvat (85.39952)
alternative label: Malajiska, tecknade serier (85.39952) @sv
broader: Austronesialaisilla kielillä julkaistut sarjakuvat
in scheme: YKL - Yleisten kirjastojen luokitusjärjestelmä
notation: 85.39952
preferred label: Comics in Malay language @en
preferred label: Tecknade serier på malajiska @sv

Indonesiankieliset sarjakuvat
type: Concept
type: YKL-luokka
alternative label: Indonesian kieli, sarjakuvat (85.39953)
alternative label: Indonesiska, tecknade serier (85.39953) @sv
broader: Austronesialaisilla kielillä julkaistut sarjakuvat
in scheme: YKL - Yleisten kirjastojen luokitusjärjestelmä
notation: 85.39953
preferred label: Comics in Indonesian language @en
preferred label: Tecknade serier på indonesiska @sv

KIRJALLISUUSTIEDE
type: Concept
References: KIRJA-ALA
References: Kustannustoiminta. Kirjakauppa
References: BIBLIOGRAFIA
References: YLEINEN KULTTUURIPOLITIIKKA
References: KAUNOKIRJALLISET SEKASISÄLTÖISET TEOKSET
References: KANSANRUNOUS
References: RUNOT
References: NÄYTELMÄT
References: KERTOMAKIRJALLISUUS
References: SADUT. KUVAKIRJAT. SARJAKUVAT
References: KIELITIEDE
References: SUOMALAIS-UGRILAISET JA URALILAISET KIELET
References: INDOEUROOPPALAISET KIELET. MUUT KIELET
References: Elämäkerrat. Muistelmat, kielitieteilijät, kirjallisuudentutkijat
References: Elämäkerralliset hakuteokset, Kielitieteilijät. Kirjallisuudentutkijat
alternative label: Arvostelu, kirjallisuus (86+)
alternative label: Bestsellerit, kirjallisuudentutkimus (86+)
alternative label: Bokcensur (86+) @sv
alternative label: Bästsäljare, litteraturforskning (86+) @sv
alternative label: Censur, litteratur (86+) @sv
alternative label: Dialektlitteratur, litteraturforskning (86+) @sv
alternative label: E-böcker, litteraturforskning (86+) @sv
alternative label: E-kirjat, kirjallisuudentutkimus (86+)
alternative label: Elektroniska böcker, litteraturforskning (86+) @sv
alternative label: Författarskap (86+) @sv
alternative label: Kirja-arvostelut, kirjallisuuskritiikki (86+)
alternative label: Kirjailijuus (86+)
alternative label: Kirjallisuudentutkimus (86+)
alternative label: Kirjallisuus, psykologia (86+)
alternative label: Kirjallisuus, sosiologia (86+)
alternative label: Kirjallisuusarvostelu (86+)
alternative label: Kirjallisuuskritiikki (86+)
alternative label: Kirjallisuussensuuri (86+)
alternative label: Kirjallisuustiede (86+)
alternative label: Kirjasensuuri (86+)
alternative label: Konst, litteratur (80 ... 86+) @sv
alternative label: Konstformer, litteratur (80 ... 86+) @sv
alternative label: Kritik, litteratur (86+) @sv
alternative label: Kvinnolitteratur, forskning (86+) @sv
alternative label: Kåsörer, biografier och memoarer (86+) @sv
alternative label: Litteratur, psykologi (86+) @sv
alternative label: Litteratur, sociologi (86+) @sv
alternative label: Litteraturcensur (86+) @sv
alternative label: Litteraturforskning (86+) @sv
alternative label: Litteraturkritik (86+) @sv
alternative label: Lukeminen, lukuharrastus (86+)
alternative label: Lukemistutkimukset (86+)
alternative label: Lukuharrastus (86+)
alternative label: Murrekirjallisuus, kirjallisuudentutkimus (86+)
alternative label: Naiskirjallisuus, tutkimus (86+)
alternative label: Pakinoitsijat, elämäkerrat ja muistelmat (86+)
alternative label: Plagiaatit, kirjallisuus (86+)
alternative label: Plagiointi, kirjallisuus (86+)
alternative label: Sadutus (86)
alternative label: Sananvapaus, kirjallisuus (86+)
alternative label: Sensuuri, kirjallisuus (86+)
alternative label: Sähkökirjat, kirjallisudentutkimus (86+)
alternative label: Taide, kirjallisuus (80 ... 86+)
alternative label: Taidemuodot, kirjallisuus (80 ... 86+)
alternative label: Taiteet, kirjallisuus (80 ... 86+)
alternative label: Verkkokirjat, kirjallisudentutkimus (86+)
alternative label: Äänikirjat, kirjallisuudentutkimus (86+)
broader: KAUNOKIRJALLISUUS. KIRJALLISUUSTIEDE. KIELITIEDE
in scheme: YKL - Yleisten kirjastojen luokitusjärjestelmä
narrower: Kirjallisuuden estetiikka. Runousoppi
narrower: Kirjallisuustieteen hakuteokset. Kirjailijamatrikkelit
narrower: Kaunokirjallisuuden kirjoittaminen ja kääntäminen
narrower: Yleinen kirjallisuudenhistoria
narrower: Suomen, suomalais-ugrilaisten ja uralilaisten kielten kirjallisuuden historia ja tutkimus
narrower: Pohjoismaisten kielten kirjallisuuden historia ja tutkimus
narrower: Saksankielisen kirjallisuuden historia ja tutkimus
narrower: Englanninkielisen kirjallisuuden historia ja tutkimus
narrower: Romaanisten kielten kirjallisuuden historia ja tutkimus
narrower: Slaavilaisten ja balttilaisten kielten kirjallisuuden historia ja tutkimus
narrower: Muiden indoeurooppalaisten kielten kirjallisuuden historia ja tutkimus
narrower: Muiden kielten kirjallisuuden historia ja tutkimus
notation: 86
scope note: Hit allmänna verk om litteraturvetenskap, litteraturforskning och litteraturkritik Litteraturens psykologi och sociologi Läsning som hobby. Läsundersökningar Litteraturens ställning i samhället Censur av litteratur Om verket behandlar en viss genre, litteraturen på ett visst språk eller under en viss tidsperiod, ges företräde i följande ordning: genre, språk, tidsperiod Enskilda författares personhistoria klassificeras alltid efter det språk som den berörda författaren använder Allmän litteraturhistoria 86.1+ En viss genres historia och forskning i genren 86.11-86.18 Europeisk litteraturhistoria och litteraturforskning under en viss tidsperiod 86.19+ Litteraturhistoria och litteraturforskning som hänför sig till ett visst språk eller land samt enskilda författares personhistoria 86.2-86.9+ Formtillägget 09 används inte i samband med klasserna 86-86.99 @sv
scope note: Tähän kirjallisuustieteen, kirjallisuudentutkimuksen ja kirjallisuusarvostelun yleisteokset Kirjallisuuden psykologia ja sosiologia Lukuharrastus. Lukemistutkimukset Kirjallisuuden asema yhteiskunnassa Kirjallisuuden sensuuri Jos teos koskee tiettyä kirjallisuudenlajia, tietyn kielen kirjallisuutta tai tietyn aikakauden kirjallisuutta, annetaan etusija järjestyksessä: kirjallisuudenlaji, kieli, aikakausi Yksittäisen kirjailijan henkilöhistoria luokitetaan kuitenkin aina ko. kirjailijan käyttämän kielen mukaiseen luokkaan Jos teos koskee sekä kirjallisuutta että muita taidemuotoja, se sijoitetaan luokkaan 70+ Yleinen kirjallisuudenhistoria 86.1+ Tietyn kirjallisuudenlajin historia ja tutkimus 86.11-86.18 Tietyn aikakauden eurooppalaisen kirjallisuuden historia ja tutkimus 86.19+ Tietyn kielen tai maan kirjallisuuden historia ja tutkimus sekä yksittäisten kirjailijoiden henkilöhistoria 86.2-86.9+ Muotoluokkaa 09 ei käytetä luokkien 86-86.99 yhteydessä

Kirjallisuuden estetiikka. Runousoppi
type: Concept
References: Taiteen estetiikka
References: KIELITIEDE
References: SUOMALAIS-UGRILAISET JA URALILAISET KIELET
References: INDOEUROOPPALAISET KIELET. MUUT KIELET
type: YKL-luokka
alternative label: Diktanalys (86.01) @sv
alternative label: Draama, teoria (86.01)
alternative label: Drama, teori (86.01) @sv
alternative label: Dramatik, teori (86.01) @sv
alternative label: Estetiikka, kirjallisuudentutkimus (86.01)
alternative label: Estetik, litteraturforskning (86.01) @sv
alternative label: Genrer, forskning (86.01) @sv
alternative label: Genret, tutkimus (86.01)
alternative label: Kirjallisuudenlaji, tutkimus (86.01)
alternative label: Kirjallisuus, estetiikka (86.01)
alternative label: Kirjallisuus, filosofia (86.01)
alternative label: Litteratur, estetik (86.01) @sv
alternative label: Litteratur, filosofi (86.01) @sv
alternative label: Litterära former, forskning (86.01) @sv
alternative label: Lyriikka, runousoppi (86.01)
alternative label: Lyriikka, tutkimus (86.01)
alternative label: Lyrik, forskning (86.01) @sv
alternative label: Lyrik, poetik (86.01) @sv
alternative label: Metriikka, runousoppi (86.01)
alternative label: Metrik, poetik (86.01) @sv
alternative label: Noveller, litteraturteori (86.01) @sv
alternative label: Novellit, kirjallisuuden teoria (86.01)
alternative label: Näytelmäkirjallisuus, teoria (86.01)
alternative label: Poetik (86.01) @sv
alternative label: Proosa, kirjallisuuden teoria (86.01)
alternative label: Prosa, litteraturens teori, all. (86.01) @sv
alternative label: Romaanit, kirjallisuuden teoria (86.01)
alternative label: Romaner, litteraturteori (86.01) @sv
alternative label: Runoanalyysi (86.01)
alternative label: Runousoppi (86.01)
alternative label: Stilistik, litteraturforskning (86.01) @sv
alternative label: Symboliikka, kirjallisuuden estetiikka (86.01)
alternative label: Symbolik, litteraturens estetik (86.01) @sv
alternative label: Tekstikritiikki, kirjallisuustiede (86.01)
alternative label: Textkritik, litteraturvetenskap (86.01) @sv
alternative label: Tyylioppi, kirjallisuudentutkimus (86.01)
broader: KIRJALLISUUSTIEDE
in scheme: YKL - Yleisten kirjastojen luokitusjärjestelmä
notation: 86.01
preferred label: Aesthetics of literature. Poetics @en
preferred label: Litteraturens estetik. Poetik @sv
scope note: Hit också allmänna verk om litteraturens, litteraturvetenskapens och litteraturforskningens filosofi, teori och forskningsmetoder Stillära i allmänhet ur litteraturvetenskapens synvinkel Om verket behandlar en viss genre, litteraturen på ett visst språk eller under en viss tidsperiod, ges företräde i följande ordning: genre, språk, tidsperiod @sv
scope note: Tähän myös yleisteokset kirjallisuuden, kirjallisuustieteen ja kirjallisuudentutkimuksen filosofiasta, teoriasta ja tutkimusmenetelmistä Tyylioppi kirjallisuustieteen kannalta yleensä Jos teos koskee tiettyä kirjallisuudenlajia, tietyn kielen kirjallisuutta tai tietyn aikakauden kirjallisuutta, annetaan etusija järjestyksessä: kirjallisuudenlaji, kieli, aikakausi

Kirjallisuustieteen hakuteokset. Kirjailijamatrikkelit
type: Concept
References: BIBLIOGRAFIA
type: YKL-luokka
alternative label: Biografiska uppslagsverk, författare (86.03) @sv
alternative label: Elämäkerralliset hakuteokset, kirjailijat (86.03)
alternative label: Författare, uppslagsverk (86.03) @sv
alternative label: Henkilöhakemistot, kirjailijat (86.03)
alternative label: Kirjailijat, hakuteokset (86.03)
alternative label: Matrikkelit, kirjailijat (86.03)
alternative label: Matriklar, författare (86.03) @sv
alternative label: Personregister, författare (86.03) @sv
broader: KIRJALLISUUSTIEDE
in scheme: YKL - Yleisten kirjastojen luokitusjärjestelmä
notation: 86.03
preferred label: Litteraturvetenskapliga uppslagsverk. Författarmatriklar @sv
preferred label: Reference works of literature. Authors' registers @en
scope note: Hit allmänna litteraturvetenskapliga uppslagsverk och författarmatriklar Om verk behandlar en viss genre eller litteraturen på ett visst språk eller under en viss tidsperiod, ges företräde i följande ordning: genre, språk, tidsperiod @sv
scope note: Tähän yleiset kirjallisuustieteen hakuteokset ja kirjailijamatrikkelit Jos teos koskee tiettyä kirjallisuudenlajia, tietyn kielen kirjallisuutta tai tietyn aikakauden kirjallisuutta, annetaan etusija järjestyksessä: kirjallisuudenlaji, kieli, aikakausi

Kaunokirjallisuuden kirjoittaminen ja kääntäminen
type: Concept
References: Kustannustoiminta. Kirjakauppa
References: Kääntäminen. Tulkkaus
type: YKL-luokka
alternative label: Aforismer, skrivande (86.07) @sv
alternative label: Aforismit, kirjoittaminen (86.07)
alternative label: Datorstödd översättning, skönlitteratur (86.07) @sv
alternative label: Esseet, kirjoittaminen (86.07)
alternative label: Essäer, skrivande (86.07) @sv
alternative label: Författarens arbete (86.07) @sv
alternative label: Handböcker för amatörskrivare (86.07) @sv
alternative label: Harrastajakirjoittajaoppaat (86.07)
alternative label: Kielenkääntäminen, kaunokirjallisuus (86.07)
alternative label: Kirjailijan työ (86.07)
alternative label: Kirjoittajakoulutus (86.07)
alternative label: Kirjoittaminen, kirjailijan työ (86.07)
alternative label: Kääntäjän työ, kaunokirjallisuus (86.07)
alternative label: Kääntäminen, kaunokirjallisuus (86.07)
alternative label: Luova kirjoittaminen (86.07)
alternative label: Skapande skrivande (86.07) @sv
alternative label: Skrivande, författarens arbete (86.07) @sv
alternative label: Skrivarutbildning (86.07) @sv
alternative label: Tietokoneavusteinen käntäminen, kaunokirjallisuus (86.07)
alternative label: Översättarens arbete, skönlitteratur (86.07) @sv
alternative label: Översättning, skönlitteratur (86.07) @sv
alternative label: Översättningsarbete, skönlitteratur (86.07) @sv
broader: KIRJALLISUUSTIEDE
in scheme: YKL - Yleisten kirjastojen luokitusjärjestelmä
notation: 86.07
preferred label: Att skriva och översätta skönlitteratur @sv
preferred label: Writing and translating fiction @en
scope note: Hit författarens eller den skönlitterära översättarens arbete samt handböcker för amatörskrivare Hit också allmänna läro- och övningsböcker i litteraturvetenskap och litteraturforskning Om verket behandlar översättning av både skön- och facklitteratur ges företräde åt klass 87.5 @sv
scope note: Tähän kirjailijan tai kaunokirjallisuuden kääntäjän työ sekä harrastajakirjoittajille tarkoitetut oppaat Tähän myös yleiset kirjallisuustieteen ja kirjallisuudentutkimuksen oppi- ja harjoituskirjat Jos teoksessa on sekä kauno- että tietokirjallisuuden kääntämistä, annetaan etusija luokalle 87.5

Yleinen kirjallisuudenhistoria
type: Concept
References: BIBLIOGRAFIA
References: Afrikkalaisten kielten kirjallisuuden historia ja tutkimus
type: YKL-luokka
alternative label: Berättelser, litteraturhistoria (86.1+) @sv
alternative label: Dokumenttikirjallisuus, kirjallisuudentutkimus (86.1+)
alternative label: Dokumentärlitteratur, litteraturforskning (86.1+) @sv
alternative label: Draama, historia (86.1+)
alternative label: Drama, historia (86.1+) @sv
alternative label: Dramatik, litteraturhistoria (86.1+) @sv
alternative label: Epigram, forskning (86.1+) @sv
alternative label: Epigrammit, tutkimus (86.1+)
alternative label: Författarhem, litteraturhistoria (86.1+) @sv
alternative label: Genreforskning, litteraturforskning (86.1+) @sv
alternative label: Genretutkimus, kirjallisuudentutkimus (86.1+)
alternative label: Haikudikter, forskning (86.1+) @sv
alternative label: Haikut, tutkimus (86.1+)
alternative label: Hörspel, litteraturhistoria (86.1+) @sv
alternative label: Indoeurooppalaiset kielet, kirjallisuudenhistoria (86.1+)
alternative label: Indoeuropeiska språk, litteraturhistoria (86.1+) @sv
alternative label: Kertomakirjallisuus, kirjallisuudenhistoria (86.1+)
alternative label: Kertomukset, kirjallisuudenhistoria (86.1+)
alternative label: Kirjailijakodit, kirjallisuudenhistoria (86.1+)
alternative label: Kirjallisuudenhistoria (86.1+)
alternative label: Komediat, näytelmäkirjallisuuden historia (86.1 ... 86.9+)
alternative label: Komedier, dramatikens historia (86.1 ... 86.9+) @sv
alternative label: Konstepos, litteraturhistoria (86.1+) @sv
alternative label: Kuunnelmat, kirjallisuudenhistoria (86.1+)
alternative label: Kåserier, litteraturhistoria (86.1+) @sv
alternative label: Limerickar, forskning (86.1+) @sv
alternative label: Limerikit, tutkimus (86.1+)
alternative label: Litteraturhistoria (86.1+) @sv
alternative label: Lyriikka, kirjallisuudenhistoria (86.1+)
alternative label: Lyrik, litteraturhistoria (86.1+) @sv
alternative label: Noveller, litteraturhistoria (86.1+) @sv
alternative label: Novellit, kirjallisuudenhistoria (86.1+)
alternative label: Näytelmäkirjallisuus, kirjallisuudenhistoria (86.1+)
alternative label: Oden, litteraturforskning (86.1+) @sv
alternative label: Oodit, kirjallisuudentutkimus (86.1+)
alternative label: Pakinat, kirjallisuudenhistoria (86.1+)
alternative label: Poesi, litteraturhistoria (86.1+) @sv
alternative label: Proosa, kirjallisuudenhistoria (86.1+)
alternative label: Prosa, historia (86.1+) @sv
alternative label: Prosa, litteraturhistoria (86.1+) @sv
alternative label: Romaanit, kirjallisuudenhistoria (86.1+)
alternative label: Romaner, litteraturhistoria (86.1+) @sv
alternative label: Runous, kirjallisuudenhistoria (86.1+)
alternative label: Sonetit, kirjallisuudentutkimus (86.1+)
alternative label: Sonetter, litteraturforskning (86.1+) @sv
alternative label: Suorasanainen kertomakirjallisuus, historia (86.1+)
alternative label: Sägner, litteraturhistoria (86.1+) @sv
alternative label: Taide-eepokset, kirjallisuudenhistoria (86.1+)
alternative label: Tankadikter, forskning (86.1+) @sv
alternative label: Tankat, tutkimus (86.1+)
alternative label: Tarinat, kirjallisuudenhistoria (86.1+)
alternative label: Vitsar, litteraturhistoria (86.1+) @sv
alternative label: Vitsit, kirjallisuudenhistoria (86.1+)
broader: KIRJALLISUUSTIEDE
in scheme: YKL - Yleisten kirjastojen luokitusjärjestelmä
narrower: Lasten- ja nuortenkirjallisuuden historia ja tutkimus
narrower: Kaunokirjallisuuden aihepiirien historia ja tutkimus
narrower: Sarjakuvien historia ja tutkimus
narrower: Kansanrunouden historia ja tutkimus
narrower: Tietokirjallisuuden historia ja tutkimus
narrower: Euroopan kirjallisuuden historia ja tutkimus
notation: 86.1
preferred label: Allmän litteraturhistoria @sv
preferred label: General history of literature @en
scope note: Hit allmänna litteraturhistoriska verk Hit också allmänna verk om Asiens och Amerikas litteraturhistoria Hit också poesins samt drama- och prosalitteraturens allmänna historia Om verket behandlar en viss genre, litteraturen på ett visst språk eller under en viss tidsperiod, ges företräde i följande ordning: genre, språk, tidsperiod Enskilda författares personhistoria klassificeras alltid efter det språk den berörda författaren använder En viss genres historia och forskning i genren 86.11-86.18 Europeisk litteraturhistoria och litteraturforskning som rör en viss tidsperiod 86.19+ Litteraturhistoria och litteraturforskning som hänför sig till ett visst språk eller land samt enskilda författares personhistoria 86.2-86.9+ @sv
scope note: Tähän kirjallisuudenhistorian yleisteokset Tähän myös Aasian ja Amerikan kirjallisuudenhistorian yleisteokset Tähän myös runouden sekä näytelmä- ja kertomakirjallisuuden yleinen historia Jos teos koskee tiettyä kirjallisuudenlajia, tietyn kielen kirjallisuutta tai tietyn aikakauden kirjallisuutta, annetaan etusija järjestyksessä: kirjallisuudenlaji, kieli, aikakausi Yksittäisen kirjailijan henkilöhistoria luokitetaan aina ko. kirjailijan käyttämän kielen mukaiseen luokkaan Tietyn kirjallisuudenlajin historia ja tutkimus 86.11-86.18 Tietyn aikakauden eurooppalaisen kirjallisuuden historia ja tutkimus 86.19+ Tietyn kielen tai maan kirjallisuuden historia ja tutkimus sekä yksittäisten kirjailijoiden henkilöhistoria 86.2-86.9+

Lasten- ja nuortenkirjallisuuden historia ja tutkimus
type: Concept
References: Lasten ja nuorten kulttuuritoiminta
References: Elämäntapojen sosiologia. Kulttuurisosiologia
References: Kuvitustaide
References: KERTOMAKIRJALLISUUS
References: SADUT. KUVAKIRJAT. SARJAKUVAT
References: Sarjakuvien historia ja tutkimus
References: Suomen, suomalais-ugrilaisten ja uralilaisten kielten kirjallisuuden historia ja tutkimus
References: Pohjoismaisten kielten kirjallisuuden historia ja tutkimus
References: Saksankielisen kirjallisuuden historia ja tutkimus
References: Englanninkielisen kirjallisuuden historia ja tutkimus
References: Romaanisten kielten kirjallisuuden historia ja tutkimus
References: Slaavilaisten ja balttilaisten kielten kirjallisuuden historia ja tutkimus
References: Muiden indoeurooppalaisten kielten kirjallisuuden historia ja tutkimus
References: Muiden kielten kirjallisuuden historia ja tutkimus
type: YKL-luokka
alternative label: Barnkultur, litteraturforskning (86.11) @sv
alternative label: Barnlitteratur, forskning (86.11) @sv
alternative label: Bilderböcker, litteraturforskning (86.11) @sv
alternative label: Fantasiakirjallisuus, lasten- ja nuortenkirjallisuuden tutkimus (86.11)
alternative label: Fantasylitteratur, forskning i barn- och ungdomslitteratur (86.11) @sv
alternative label: Kuvakirjat, kirjallisuudentutkimus (86.11)
alternative label: Lastenkirjallisuus, tutkimus (86.11)
alternative label: Lastenkulttuuri, kirjallisuudentutkimus (86.11)
alternative label: Nuorisokulttuuri, kirjallisuudentutkimus (86.11)
alternative label: Nuortenkirjallisuus, tutkimus (86.11)
alternative label: Sadut, lastenkirjallisuudentutkimus (86.11)
alternative label: Sagor, barnlitteraturforskning (86.11) @sv
alternative label: Science fiction, forskning i barn- och ungdomslitteratur (86.11) @sv
alternative label: Scifi, forskning i barn- och ungdomslitteratur (86.11) @sv
alternative label: Scifi, lasten- ja nuortenkirjallisuuden tutkimus (86.11)
alternative label: Tieteiskirjallisuus, lasten- ja nuortenkirjallisuuden tutkimus (86.11)
alternative label: Ungdomskultur, litteraturforskning (86.11) @sv
alternative label: Ungdomslitteratur, forskning (86.11) @sv
broader: Yleinen kirjallisuudenhistoria
in scheme: YKL - Yleisten kirjastojen luokitusjärjestelmä
notation: 86.11
preferred label: Barn- och ungdomslitteraturens historia. Forskning i barn- och ungdomslitteratur @sv
preferred label: History of and research in literature for children and young people @en
scope note: Hit barn- och ungdomslitteraturens historia och forskning i den oavsett språk, land eller tidsperiod Hit också den finskspråkiga barn- och ungdomslitteraturens historia och forskning i finskspråkig barn- och ungdomslitteratur Hit också sagornas och bilderböckernas historia och forskning i sagor och bilderböcker Hit också barn- och ungdomsfacklitteraturens historia samt forskning i facklitteratur för barn och unga Hit också olika motivs historia i barn- och ungdomslitteraturen samt forskning i dem Verk om enskilda barn- eller ungdomsförfattare eller om deras produktion klassificeras alltid efter det språk som den berörda författaren använder @sv
scope note: Tähän lasten- ja nuortenkirjallisuuden historia ja tutkimus kielestä, maasta ja aikakaudesta riippumatta Tähän myös suomenkielisen lasten- ja nuortenkirjallisuuden historia ja tutkimus Tähän myös satujen ja kuvakirjojen historia ja tutkimus Tähän myös lasten ja nuorten tietokirjallisuuden sekä lasten- ja nuortenkirjallisuuden eri aihepiirien historia ja tutkimus Yksittäistä lasten- tai nuortenkirjailijaa tai hänen tuotantoaan koskevat teokset sijoitetaan aina ko. kirjailijan käyttämän kielen mukaiseen luokkaan

Kaunokirjallisuuden aihepiirien historia ja tutkimus
type: Concept
References: Lasten- ja nuortenkirjallisuuden historia ja tutkimus
References: Tietokirjallisuuden historia ja tutkimus
References: Suomen, suomalais-ugrilaisten ja uralilaisten kielten kirjallisuuden historia ja tutkimus
References: Pohjoismaisten kielten kirjallisuuden historia ja tutkimus
References: Saksankielisen kirjallisuuden historia ja tutkimus
References: Englanninkielisen kirjallisuuden historia ja tutkimus
References: Romaanisten kielten kirjallisuuden historia ja tutkimus
References: Slaavilaisten ja balttilaisten kielten kirjallisuuden historia ja tutkimus
References: Muiden indoeurooppalaisten kielten kirjallisuuden historia ja tutkimus
References: Muiden kielten kirjallisuuden historia ja tutkimus
type: YKL-luokka
alternative label: Biografiska romaner, forskning (86.12) @sv
alternative label: Deckare, forskning (86.12) @sv
alternative label: Dekkarit, tutkimus (86.12)
alternative label: Detektivromaner, forskning (86.12) @sv
alternative label: Dystopiat, kirjallisuudentutkimus (86.12)
alternative label: Dystopier, litteraturforskning (86.12) @sv
alternative label: Elämäkertaromaanit, tutkimus (86.12)
alternative label: Eroottiset romaanit, tutkimus (86.12)
alternative label: Erotiska romaner, forskning (86.12) @sv
alternative label: Eräaiheinen kertomakirjallisuus, tutkimus (86.12)
alternative label: Fantasiakirjallisuus, tutkimus (86.12)
alternative label: Fantasylitteratur, forskning (86.12) @sv
alternative label: Historialliset romaanit, tutkimus (86.12)
alternative label: Historiska romaner, forskning (86.12) @sv
alternative label: Kauhuromaanit, tutkimus (86.12)
alternative label: Krigsromaner, forskning (86.12) @sv
alternative label: Kriminalromaner, forskning (86.12) @sv
alternative label: Kärleksromaner, forskning (86.12) @sv
alternative label: Läkarromaner, forskning (86.12) @sv
alternative label: Lääkäriromaanit, tutkimus (86.12)
alternative label: Meriromaanit, tutkimus (86.12)
alternative label: Poliisiromaanit, tutkimus (86.12)
alternative label: Polisromaner, forskning (86.12) @sv
alternative label: Pornografi, litteraturforskning (86.12) @sv
alternative label: Pornografia, kirjallisuudentutkimus (86.12)
alternative label: Rakkausromaanit, tutkimus (86.12)
alternative label: Religiösa romaner, forskning (86.12) @sv
alternative label: Rikosromaanit, tutkimus (86.12)
alternative label: Romaner med konstmotiv, forskning (86.12) @sv
alternative label: Romantisk litteratur, forskning (86.12) @sv
alternative label: Romanttinen kirjallisuus, tutkimus (86.12)
alternative label: Salapoliisiromaanit, tutkimus (86.12)
alternative label: Science fiction, litteraturforskning (86.12) @sv
alternative label: Scifi, kirjallisuudentutkimus (86.12)
alternative label: Scifi, litteraturforskning (86.12) @sv
alternative label: Seikkailuromaanit, tutkimus (86.12)
alternative label: Sjöromaner, forskning (86.12) @sv
alternative label: Skräckromaner, forskning (86.12) @sv
alternative label: Släktromaner, forskning (86.12) @sv
alternative label: Socialt inriktade romaner, forskning (86.12) @sv
alternative label: Sotaromaanit, tutkimus (86.12)
alternative label: Sukuromaanit, tutkimus (86.12)
alternative label: Taideaiheiset romaanit, tutkimus (86.12)
alternative label: Tieteiskirjallisuus, tutkimus (86.12)
alternative label: Underhållningslitteratur, forskning (86.12) @sv
alternative label: Uskonnolliset romaanit, tutkimus (86.12)
alternative label: Utopiat, kirjallisuudentutkimus (86.12)
alternative label: Utopier, litteraturforskning (86.12) @sv
alternative label: Viihdekirjallisuus, tutkimus (86.12)
alternative label: Vilda västern, litteraturforskning (86.12) @sv
alternative label: Vildmarkslitteratur, forskning (86.12) @sv
alternative label: Villi länsi, kirjallisuudentutkimus (86.12)
alternative label: Yhteiskunnalliset romaanit, tutkimus (86.12)
alternative label: Äventyrsromaner, forskning (86.12) @sv
broader: Yleinen kirjallisuudenhistoria
in scheme: YKL - Yleisten kirjastojen luokitusjärjestelmä
notation: 86.12
preferred label: History of and research in fictional themes @en
preferred label: Skönlitterära motivs historia och forskning i dem @sv
scope note: Hit skönlitterära motivs historia och forskning i dem oavsett språk, land och tidsperiod Hit också motivens historia i finländsk skönlitteratur och forskning i dem Hit t.ex. följande motivkretsar: brottet, detektiven, havet, historien, konsten, kriget, kärleken, läkaren, naturen, religionen, romantiken, samhället, science fiction, äventyret och vildmarken som motiv i skönlitteraturen Hit också underhållningslitteraturens historia och forskning i underhållningslitteratur Verk om enskilda författare eller deras produktion klassificeras alltid efter det språk som den berörda författaren använder @sv
scope note: Tähän kaunokirjallisuuden aihepiirien historia ja tutkimus kielestä, maasta ja aikakaudesta riippumatta Tähän myös suomenkielisen kaunokirjallisuuden aihepiirien historia ja tutkimus Tähän esim. erä-, historia-, kauhu-, luonto-, lääkäri-, matka-, meri-, rakkaus-, rikos-, romantiikka-, salapoliisi-, scifi-, seikkailu-, sota-, suku-, taide-, tiede-, uskonto- ja yhteiskunta-aiheet kaunokirjallisuudessa Tähän myös viihdekirjallisuuden historia ja tutkimus Yksittäistä kirjailijaa tai hänen tuotantoaan koskevat teokset sijoitetaan aina ko. kirjailijan käyttämän kielen mukaiseen luokkaan

Sarjakuvien historia ja tutkimus
type: Concept
References: Piirustuksen tekniikka
References: Animaatioelokuva
References: SARJAKUVAT
References: Lasten- ja nuortenkirjallisuuden historia ja tutkimus
References: Suomen, suomalais-ugrilaisten ja uralilaisten kielten kirjallisuuden historia ja tutkimus
References: Pohjoismaisten kielten kirjallisuuden historia ja tutkimus
References: Saksankielisen kirjallisuuden historia ja tutkimus
References: Englanninkielisen kirjallisuuden historia ja tutkimus
References: Romaanisten kielten kirjallisuuden historia ja tutkimus
References: Slaavilaisten ja balttilaisten kielten kirjallisuuden historia ja tutkimus
References: Muiden indoeurooppalaisten kielten kirjallisuuden historia ja tutkimus
References: Muiden kielten kirjallisuuden historia ja tutkimus
type: YKL-luokka
alternative label: Fantasiakirjallisuus, sarjakuvien tutkimus (86.13)
alternative label: Fantasylitteratur, forskning i tecknade serier (86.13) @sv
alternative label: Sarjakuvaromaanit, tutkimus (86.13)
alternative label: Sarjakuvat, kirjallisuudentutkimus (86.13)
alternative label: Sarjakuvataiteilijat, kirjallisuudentutkimus (86.13)
alternative label: Science fiction, forskning i tecknade serier (86.13) @sv
alternative label: Scifi, forskning i tecknade serier (86.13) @sv
alternative label: Scifi, sarjakuvien tutkimus (86.13)
alternative label: Seriebilder, litteraturforskning (86.13) @sv
alternative label: Serieromaner, forskning (86.13) @sv
alternative label: Serieskapare, litteraturforskning (86.13) @sv
alternative label: Tieteiskirjallisuus, sarjakuvien tutkimus (86.13)
broader: Yleinen kirjallisuudenhistoria
in scheme: YKL - Yleisten kirjastojen luokitusjärjestelmä
notation: 86.13
preferred label: De tecknade seriernas historia. Forskning i tecknade serier @sv
preferred label: History of and research in comics @en
scope note: Hit barn- och vuxenseriernas historia och forskning i dem oavsett språk, land och tidsperiod Hit också forskning i finska och finlandssvenska tecknade serier Verk om enskilda serietecknare eller deras produktion klassificeras alltid efter det språk som den berörda serietecknaren använder @sv
scope note: Tähän aikuisten ja lasten sarjakuvien historia ja tutkimus kielestä, maasta ja aikakaudesta riippumatta Tähän myös suomenkielisten sarjakuvien tutkimus Yksittäistä sarjakuvantekijää tai hänen tuotantoaan koskevat teokset sijoitetaan aina ko. sarjakuvantekijän käyttämän kielen mukaiseen luokkaan

Kansanrunouden historia ja tutkimus
type: Concept
References: YLEINEN USKONTOTIEDE
References: MUUT USKONNOT JA MYTOLOGIAT
References: KANSATIEDE. KULTTUURIANTROPOLOGIA
References: Musiikin tutkimus
References: Etnomusiikki. Kansanmusiikki
References: KANSANRUNOUS
References: Suomen, suomalais-ugrilaisten ja uralilaisten kielten kirjallisuuden historia ja tutkimus
References: Ruotsinkielisen kirjallisuuden historia ja tutkimus
alternative label: Anekdoter, folkloristik (86.14) @sv
alternative label: Arkkiveisut, kansanrunoudentutkimus (86.14)
alternative label: Arvoitukset, kansanrunoudentutkimus (86.14)
alternative label: Ballader, folkloristik (86.14) @sv
alternative label: Balladit, kansanrunoudentutkimus (86.14)
alternative label: Berättelser, folkloristik (86.14) @sv
alternative label: Besvärjelser, folkloristik (86.14) @sv
alternative label: Didaktiska berättelser, folkloristik (86.14) @sv
alternative label: Dikter, folkloristik (86.14) @sv
alternative label: Eepokset, kansanrunoudentutkimus (86.14)
alternative label: Epos, folkloristik (86.14) @sv
alternative label: Folkdiktsforskning (86.14) @sv
alternative label: Folkliga trosföreställningar (86.14) @sv
alternative label: Folklore, folkloristik (86.14) @sv
alternative label: Folklore, kansanrunoudentutkimus (86.14)
alternative label: Folkloristiikka, kansanrunoudentutkimus (86.14)
alternative label: Folkloristik, folkdiktsforskning (86.14) @sv
alternative label: Folksagor, folkloristik (86.14) @sv
alternative label: Folksägner, folkloristik (86.14) @sv
alternative label: Forndikter, folkloristik (86.14) @sv
alternative label: Gråtkväden, folkloristik (86.14) @sv
alternative label: Gåtor, folkloristik (86.14) @sv
alternative label: Helgonlegender, folkloristik (86.14) @sv
alternative label: Itkut, kansanrunoudentutkimus (86.14)
alternative label: Kansaneepokset, kansanrunoudentutkimus (86.14)
alternative label: Kansanperinne, kansanrunoudentutkimus (86.14)
alternative label: Kansanrunoudentutkimus (86.14)
alternative label: Kansansadut, kansanrunoudentutkimus (86.14)
alternative label: Kansantarinat, kansanrunoudentutkimus (86.14)
alternative label: Kansanuskomukset, kansanrunoudentutkimus (86.14)
alternative label: Kaskut, kansanrunoudentutkimus (86.14)
alternative label: Kaupunkilegendat, kansanrunoudentutkimus (86.14)
alternative label: Kertomukset, kansanrunoudentutkimus (86.14)
alternative label: Legendat, kansanrunoudentutkimus (86.14)
alternative label: Legender, folkloristik (86.14) @sv
alternative label: Liknelser, folkloristik (86.14) @sv
alternative label: Loitsut, kansanrunoudentutkimus (86.14)
alternative label: Lorut, kansanrunoudentutkimus (86.14)
alternative label: Moderna sägner, folkloristik (86.14) @sv
alternative label: Muinaisrunot, kansanrunoudentutkimus (86.14)
alternative label: Muntlig tradition, folkloristik (86.14) @sv
alternative label: Nationalepos, folkloristik (86.14) @sv
alternative label: Nykytarinat, kansanrunoudentutkimus (86.14)
alternative label: Opetustarinat, kansanrunoudentutkimus (86.14)
alternative label: Ordspråk, folkloristik (86.14) @sv
alternative label: Ordstäv, folkloristik (86.14) @sv
alternative label: Perinteet, kansanrunoudentutkimus (86.14)
alternative label: Pyhimystarut, kansanrunoudentutkimus (86.14)
alternative label: Ramsor, folkloristik (86.14) @sv
alternative label: Runonlaulajat, kansanrunoudentutkimus (86.14)
alternative label: Runosångare, folkloristik (86.14) @sv
alternative label: Runot, kansanrunoudentutkimus (86.14)
alternative label: Sadut, kansanrunoudentutkimus (86.14)
alternative label: Sananlaskut, kansanrunoudentutkimus (86.14)
alternative label: Sananparret, kansanrunoudentutkimus (86.14)
alternative label: Suullinen perinne, kansanrunoudentutkimus (86.14)
alternative label: Syntytarinat, kansanrunoudentutkimus (86.14)
alternative label: Taiat, kansanrunoudentutkimus (86.14)
alternative label: Taikausko, kansanrunoudentutkimus (86.14)
alternative label: Tarinat, kansanrunoudentutkimus (86.14)
alternative label: Taruolennot, folkloristiikka (86.14)
alternative label: Urbaanilegendat, kansanrunoudentutkimus (86.14)
alternative label: Uskomustarinat, kansanrunoudentutkimus (86.14)
alternative label: Varoitustarinat, kansanrunoudentutkimus (86.14)
alternative label: Vertaukset, kansanrunoudentutkimus (86.14)
alternative label: Vitsit, kansanrunoudentutkimus (86.14)
broader: Yleinen kirjallisuudenhistoria
in scheme: YKL - Yleisten kirjastojen luokitusjärjestelmä
notation: 86.14
scope note: Hit allmänna verk om folkdiktsforskning och folkloristik. Andlig folkkultur och muntlig tradition ur den allmänna folkdiktsforskningens synvinkel. Hit även folkdiktsforskning som rör t.ex. moderna sägner eller urbanlegender i allmänhet. Forskning som rör folkdiktning på ett visst språk eller i ett visst land klassificeras efter språkets eller landets litteraturhistoria 86.2-86.9+ Om det i verket finns både folksagor och forskning om folksagor klassificeras verket i klass 86.14 om de folksagor som förekommer i verket fungerar som exempelmaterial för forskningen. @sv
scope note: Tähän kansanrunoudentutkimuksen ja folkloristiikan yleisteokset. Henkinen kansankulttuuri ja suullinen perinne yleisen kansanrunoudentutkimuksen kannalta. Tähän myös esim. nykytarinoita tai urbaanilegendoja koskeva kansanrunoudentutkimus yleensä. Tietyn kielen tai maan kansanrunoudentutkimus luokitetaan ko. kielen tai maan kirjallisuudenhistoriaan 86.2-86.9+. Jos teoksessa on sekä kansantarinoita että kansantarinoiden tutkimusta, teos luokitetaan luokkaan 86.14, mikäli teoksessa olevat kansantarinat esiintyvät tutkimuksen esimerkkiaineistona.

Tietokirjallisuuden historia ja tutkimus
type: Concept
References: Tiedepolitiikka
References: Lasten- ja nuortenkirjallisuuden historia ja tutkimus
References: Elämäkerrat. Muistelmat
type: YKL-luokka
alternative label: Fackboksförfattare, biografier och memoarer (86.18) @sv
alternative label: Facklitteratur, litteraturforskning (86.18) @sv
alternative label: Kirja-arvostelut, tietokirjallisuus (86.18)
alternative label: Litteraturrecensioner, facklitteratur (86.18) @sv
alternative label: Tietokirjailijat, elämäkerrat ja muistelmat (86.18)
alternative label: Tietokirjallisuus, kirjallisuudentutkimus (86.18)
broader: Yleinen kirjallisuudenhistoria
in scheme: YKL - Yleisten kirjastojen luokitusjärjestelmä
notation: 86.18
preferred label: Facklitteraturens historia. Forskning i facklitteratur @sv
preferred label: History of and research in non-fiction @en
scope note: Hit oavsett språk, land och tidsperiod allmänna verk om facklitteraturens historia och forskning i facklitteratur Facklitteratur inom ett visst område samt dess historia och forskning i den klassificeras enligt område Forskning av memoarer och dagböcker förs till klass 99.1+ dock inte forskning av författares, konstnärers och idrottares memoarer eller dagböcker, som förs till klasserna för litteraturhistoria, konsternas historia eller klasserna för olika idrottsgrenar @sv
scope note: Tähän kielestä, maasta ja aikakaudesta riippumatta tietokirjallisuuden historian ja tutkimuksen yleisteokset Tietyn alan tietokirjallisuus sekä sen historia ja tutkimus luokitetaan alan mukaan Muistelmien ja päiväkirjojen tutkimus sijoitetaan luokkaan 99.1+, paitsi kirjailijoiden, taiteilijoiden ja urheilijoiden muistelmien ja päiväkirjojen tutkimus, mikä sijoitetaan kirjallisuudenhistoriaan, eri taidemuotojen historiaan tai eri urheilulajien luokkiin

Euroopan kirjallisuuden historia ja tutkimus
type: Concept
References: Lasten- ja nuortenkirjallisuuden historia ja tutkimus
References: Kaunokirjallisuuden aihepiirien historia ja tutkimus
References: Sarjakuvien historia ja tutkimus
References: Kansanrunouden historia ja tutkimus
References: Tietokirjallisuuden historia ja tutkimus
References: Suomen, suomalais-ugrilaisten ja uralilaisten kielten kirjallisuuden historia ja tutkimus
References: Pohjoismaisten kielten kirjallisuuden historia ja tutkimus
References: Saksankielisen kirjallisuuden historia ja tutkimus
References: Englanninkielisen kirjallisuuden historia ja tutkimus
References: Romaanisten kielten kirjallisuuden historia ja tutkimus
References: Slaavilaisten ja balttilaisten kielten kirjallisuuden historia ja tutkimus
References: Muiden indoeurooppalaisten kielten kirjallisuuden historia ja tutkimus
References: Muiden kielten kirjallisuuden historia ja tutkimus
type: YKL-luokka
alternative label: Länsimainen kirjallisuus, historia (86.19+)
alternative label: Västerländsk litteratur, historia (86.19+) @sv
broader: Yleinen kirjallisuudenhistoria
in scheme: YKL - Yleisten kirjastojen luokitusjärjestelmä
narrower: Vanhan ja keskiajan kirjallisuus, Eurooppa
narrower: Uuden ajan kirjallisuus, Eurooppa
notation: 86.19
preferred label: Europeisk litteraturhistoria och litteraturforskning @sv
preferred label: History of and research in European literature @en
scope note: Hit och till underklasserna allmänna verk om europeisk litteraturhistoria och litteraturforskning Hit och till underklasserna också allmänna verk om västerlandets litteraturhistoria och forskning i västerlandets litteratur Allmänna verk om litteraturhistoria 86.1 @sv
scope note: Tähän ja alaluokkiin Euroopan kirjallisuuden historian ja tutkimuksen yleisteokset Tähän ja alaluokkiin myös länsimaiden kirjallisuuden historian ja tutkimuksen yleisteokset Kirjallisuudenhistorian yleisteokset 86.1

Vanhan ja keskiajan kirjallisuus, Eurooppa
type: Concept
References: Lasten- ja nuortenkirjallisuuden historia ja tutkimus
References: Kaunokirjallisuuden aihepiirien historia ja tutkimus
References: Sarjakuvien historia ja tutkimus
References: Kansanrunouden historia ja tutkimus
References: Tietokirjallisuuden historia ja tutkimus
References: Nykykreikankielisen kirjallisuuden historia ja tutkimus
type: YKL-luokka
alternative label: Antiikki, kirjallisuudenhistoria (86.192)
alternative label: Antiken, litteraturhistoria (86.192) @sv
alternative label: Gamla tiden, litteraturhistoria (86.192) @sv
alternative label: Grekiska, forngrekiska, folkdiktsforskning (86.192) @sv
alternative label: Grekiska, forngrekiska, folkloristik (86.192) @sv
alternative label: Grekiska, forngrekiska, litteraturhistoria, (86.192) @sv
alternative label: Iliaden, forskning (86.192) @sv
alternative label: Ilias, tutkimus (86.192)
alternative label: Keskiaika, kirjallisuudenhistoria (86.192)
alternative label: Kreikan kieli, muinaiskreikka, folkloristiikka (86.192)
alternative label: Kreikan kieli, muinaiskreikka, kansanrunoudentutkimus (86.192)
alternative label: Kreikan kieli, muinaiskreikka, kirjallisuudenhistoria (86.192)
alternative label: Latin, folkdiktsforskning (86.192) @sv
alternative label: Latin, folkloristik (86.192) @sv
alternative label: Latin, litteraturhistoria (86.192) @sv
alternative label: Latinan kieli, folkloristiikka (86.192)
alternative label: Latinan kieli, kansanrunoudentutkimus (86.192)
alternative label: Latinan kieli, kirjallisuudenhistoria (86.192)
alternative label: Medeltiden, litteraturhistoria (86.192) @sv
alternative label: Odysseia, tutkimus (86.192)
alternative label: Odyssén, forskning (86.192) @sv
alternative label: Romerska riket, litteraturhistoria (86.192) @sv
alternative label: Rooman valtakunta, kirjallisuudenhistoria (86.192)
alternative label: Vanha aika, kirjallisuudenhistoria (86.192)
broader: Euroopan kirjallisuuden historia ja tutkimus
in scheme: YKL - Yleisten kirjastojen luokitusjärjestelmä
notation: 86.192
preferred label: Ancient and medieval literature, Europe @en
preferred label: Gamla tidens och medeltidens litteratur, Europa @sv
scope note: Hit allmänna verk om gamla tidens och medeltidens europeiska litteraturhistoria och forskning i gamla tidens och medeltidens europeiska litteratur Antikens litteraturhistoria och forskning i antikens litteratur Den forngrekiska och latinska litteraturens och folkdiktningens historia och forskning i forngrekisk och latinsk litteratur och folkdiktning @sv
scope note: Tähän Euroopan vanhan ja keskiajan kirjallisuuden historian ja tutkimuksen yleisteokset Antiikin kirjallisuuden historia ja tutkimus Muinaiskreikan- ja latinankielisen kirjallisuuden ja kansanrunouden historia ja tutkimus

Uuden ajan kirjallisuus, Eurooppa
type: Concept
References: Lasten- ja nuortenkirjallisuuden historia ja tutkimus
References: Kaunokirjallisuuden aihepiirien historia ja tutkimus
References: Sarjakuvien historia ja tutkimus
References: Kansanrunouden historia ja tutkimus
References: Tietokirjallisuuden historia ja tutkimus
References: Suomen, suomalais-ugrilaisten ja uralilaisten kielten kirjallisuuden historia ja tutkimus
References: Pohjoismaisten kielten kirjallisuuden historia ja tutkimus
References: Saksankielisen kirjallisuuden historia ja tutkimus
References: Englanninkielisen kirjallisuuden historia ja tutkimus
References: Romaanisten kielten kirjallisuuden historia ja tutkimus
References: Slaavilaisten ja balttilaisten kielten kirjallisuuden historia ja tutkimus
References: Muiden indoeurooppalaisten kielten kirjallisuuden historia ja tutkimus
References: Muiden kielten kirjallisuuden historia ja tutkimus
type: YKL-luokka
alternative label: Imitationsstilar, litteraturhistoria (86.193) @sv
alternative label: Impressionism, litteraturhistoria (86.193) @sv
alternative label: Impressionismi, kirjallisuudenhistoria (86.193)
alternative label: Kansallisromantiikka, kirjallisuudenhistoria (86.193)
alternative label: Kertaustyylit, kirjallisuudenhistoria (86.193)
alternative label: Nationalromantik, litteraturhistoria (86.193) @sv
alternative label: Naturalism, litteraturhistoria (86.193) @sv
alternative label: Naturalismi, kirjallisuudenhistoria (86.193)
alternative label: Nya tiden, litteraturhistoria (86.193+) @sv
alternative label: Nyklassicism, litteraturhistoria (86.193) @sv
alternative label: Realism, litteraturhistoria (86.193+) @sv
alternative label: Realismi, kirjallisuudenhistoria (86.193+)
alternative label: Renessanssi, kirjallisuudenhistoria (86.193)
alternative label: Renässans, litteraturhistoria (86.193) @sv
alternative label: Romantiikka, kirjallisuudenhistoria (86.193)
alternative label: Romantik, litteraturhistoria (86.193) @sv
alternative label: Symbolism, litteraturhistoria (86.193) @sv
alternative label: Symbolismi, kirjallisuudenhistoria (86.193)
alternative label: Uusi aika, kirjallisuudenhistoria (86.193+)
alternative label: Uusklassismi, kirjallisuudenhistoria (86.193)
broader: Euroopan kirjallisuuden historia ja tutkimus
in scheme: YKL - Yleisten kirjastojen luokitusjärjestelmä
narrower: Nykyajan kirjallisuus, Eurooppa
notation: 86.193
preferred label: Literature of the modern era, Europe @en
preferred label: Nya tidens litteratur, Europa @sv
scope note: Hit allmänna verk om nya tidens litteraturhistoria i Europa och forskning i nya tidens europeiska litteratur Hit också allmänna verk om nya tidens litteraturhistoria i västerlandet och forskning i västerlandets litteratur under nya tiden Hit också allmänna verk om renässansens litteraturhistoria och forskning i renässansens litteratur @sv
scope note: Tähän Euroopan uuden ajan kirjallisuuden historian ja tutkimuksen yleisteokset Tähän myös länsimaiden uuden ajan kirjallisuuden historian ja tutkimuksen yleisteokset Tähän myös renessanssin kirjallisuuden historian ja tutkimuksen yleisteokset

Nykyajan kirjallisuus, Eurooppa
type: Concept
References: Lasten- ja nuortenkirjallisuuden historia ja tutkimus
References: Kaunokirjallisuuden aihepiirien historia ja tutkimus
References: Sarjakuvien historia ja tutkimus
References: Kansanrunouden historia ja tutkimus
References: Tietokirjallisuuden historia ja tutkimus
References: Suomen, suomalais-ugrilaisten ja uralilaisten kielten kirjallisuuden historia ja tutkimus
References: Pohjoismaisten kielten kirjallisuuden historia ja tutkimus
References: Saksankielisen kirjallisuuden historia ja tutkimus
References: Englanninkielisen kirjallisuuden historia ja tutkimus
References: Romaanisten kielten kirjallisuuden historia ja tutkimus
References: Slaavilaisten ja balttilaisten kielten kirjallisuuden historia ja tutkimus
References: Muiden indoeurooppalaisten kielten kirjallisuuden historia ja tutkimus
References: Muiden kielten kirjallisuuden historia ja tutkimus
type: YKL-luokka
alternative label: Dadaism, litteraturhistoria (86.1934) @sv
alternative label: Dadaismi, kirjallisuudenhistoria (86.1934)
alternative label: Eksistentialismi, kirjallisuudenhistoria (86.1934)
alternative label: Ekspressionismi, kirjallisuudenhistoria (86.1934)
alternative label: Existentialism, litteraturhistoria (86.1934) @sv
alternative label: Expressionism, litteraturhistoria (86.1934) @sv
alternative label: Futurism, litteraturhistoria (86.1934) @sv
alternative label: Futurismi, kirjallisuudenhistoria (86.1934)
alternative label: Hyperrealism, litteraturhistoria (86.1934) @sv
alternative label: Hyperrealismi, kirjallisuudenhistoria (86.1934)
alternative label: Modernism, litteraturhistoria (86.1934) @sv
alternative label: Modernismi, kirjallisuudenhistoria (86.1934)
alternative label: Nutiden, litteraturhistoria (86.1934) @sv
alternative label: Nykyaika, kirjallisuudenhistoria (86.1934)
alternative label: Postmodernism, litteraturhistoria (86.1934) @sv
alternative label: Postmodernismi, kirjallisuudenhistoria (86.1934)
alternative label: Socialistisk realism, litteraturhistoria (86.1934) @sv
alternative label: Sosialistinen realismi, kirjallisuudenhistoria (86.1934)
alternative label: Surrealism, litteraturhistoria (86.1934) @sv
alternative label: Surrealismi, kirjallisuudenhistoria (86.1934)
broader: Uuden ajan kirjallisuus, Eurooppa
in scheme: YKL - Yleisten kirjastojen luokitusjärjestelmä
notation: 86.1934
preferred label: Contemporary literature, Europe @en
preferred label: Modern litteratur, Europa @sv
scope note: Hit allmänna verk om europeisk litteraturhistoria och litteraturforskning som gäller tiden från ca år 1900 framåt Hit också allmänna verk om västerländsk litteraturhistoria och litteraturforskning som gäller tiden från ca år 1900 @sv
scope note: Tähän n. vuodesta 1900 alkaen Euroopan kirjallisuuden historian ja tutkimuksen yleisteokset Tähän n. vuodesta 1900 alkaen myös länsimaiden kirjallisuuden historian ja tutkimuksen yleisteokset

Suomen, suomalais-ugrilaisten ja uralilaisten kielten kirjallisuuden historia ja tutkimus
type: Concept
References: BIBLIOGRAFIA
References: Suomen ja suomalais-ugrilaisten kansojen kansatiede
References: Lasten- ja nuortenkirjallisuuden historia ja tutkimus
References: Kaunokirjallisuuden aihepiirien historia ja tutkimus
References: Sarjakuvien historia ja tutkimus
References: Kansanrunouden historia ja tutkimus
References: Tietokirjallisuuden historia ja tutkimus
References: Suomenruotsalaisen kirjallisuuden historia ja tutkimus
type: YKL-luokka
alternative label: Biografier, författare (86.2 ... 86.9+) @sv
alternative label: Biografier, författare, forskning (86.2 ... 86.9+) @sv
alternative label: Bloggar, författare (86.2 ... 86.9+) @sv
alternative label: Blogit, kirjailijat (86.2 ... 86.9+)
alternative label: Brev, författare (86.2 ... 86.9+) @sv
alternative label: Brevsamlingar, författare (86.2 ... 86.9+) @sv
alternative label: Brevväxling, författare (86.2 ... 86.9+) @sv
alternative label: Dagböcker, författare (86.2 ... 86.9+) @sv
alternative label: Dagböcker, författare, forskning (86.2 ... 86.9+) @sv
alternative label: Elämäkerrat, kirjailijat (86.2 ... 86.9+)
alternative label: Elämäkerrat, kirjailijat, tutkimus (86.2 ... 86.9+)
alternative label: Elämäkertatutkimus, kirjailijat (86.2 ... 86.9+)
alternative label: Finsk-ugrisk folkloristik (86.2+) @sv
alternative label: Finsk-ugriska språk, litteraturhistoria (86.2+) @sv
alternative label: Finska, litteraturhistoria (86.2+) @sv
alternative label: Författare, biografier och memoarer (86.2 ... 86.9+) @sv
alternative label: Henkilöhistoria, kirjailijat (86.2 ... 86.9+)
alternative label: Itämerensuomalaiset kielet, kirjallisuudenhistoria (86.2 ... 86.24)
alternative label: Kirjailijat, elämäkerrat ja muistelmat (86.2 ... 86.9+)
alternative label: Kirjallisuudenhistoria, kielittäin ja maittain (86.2 ... 86.9+)
alternative label: Kirjallisuudentutkimus, kielittäin ja maittain (86.2 ... 86.9+)
alternative label: Kirjallisuustiede, kielittäin ja maittain (86.2 ... 86.9+)
alternative label: Kirjeenvaihto, kirjailijat (86.2 ... 86.9+)
alternative label: Kirjeet, kirjailijat (86.2 ... 86.9+)
alternative label: Kirjekokoelmat, kirjailijat (86.2 ... 86.9+)
alternative label: Komediat, näytelmäkirjallisuuden historia (86.1 ... 86.9+)
alternative label: Komedier, dramatikens historia (86.1 ... 86.9+) @sv
alternative label: Litteraturforskning, språkvis och landsvis (86.2 ... 86.9+) @sv
alternative label: Litteraturhistoria, språkvis och landsvis (86.2 ... 86.9+) @sv
alternative label: Litteraturvetenskap, språkvis och landsvis (86.2 ... 86.9+) @sv
alternative label: Livshistorieforskning, författare (86.2 ... 86.9+) @sv
alternative label: Memoarer, författare (86.2 ... 86.9+) @sv
alternative label: Memoarer, författare, forskning (86.2 ... 86.9+) @sv
alternative label: Meänkieli, kirjallisuudenhistoria (86.2)
alternative label: Muistelmat, kirjailijat (86.2 ... 86.9+)
alternative label: Muistelmat, kirjailijat, tutkimus (86.2 ... 86.9+)
alternative label: Nettipäiväkirjat, kirjailijat (86.2 ... 86.9+)
alternative label: Nätdagböcker, författare (86.2 ... 86.9+) @sv
alternative label: Omaelämäkerrat, kirjailijat (86.2 ... 86.9+)
alternative label: Personhistoria, författare (86.2 ... 86.9+) @sv
alternative label: Päiväkirjat, kirjailijat (86.2 ... 86.9+)
alternative label: Päiväkirjat, kirjailijat, tutkimus (86.2 ... 86.9+)
alternative label: Självbiografier, författare (86.2 ... 86.9+) @sv
alternative label: Suomalais-ugrilainen kansanrunoudentutkimus (86.2+)
alternative label: Suomalais-ugrilaiset kielet, kirjallisuudenhistoria (86.2+)
alternative label: Suomen kieli, kirjallisuudenhistoria (86.2+)
alternative label: Tornedalsfinska, litteraturhistoria (86.2) @sv
alternative label: Verkkopäiväkirjat, kirjailijat (86.2 ... 86.9+)
alternative label: Web-log, kirjailijat (86.2 ... 86.9+)
alternative label: Webbjournaler, författare (86.2 ... 86.9+) @sv
alternative label: Webbloggar, författare (86.2 ... 86.9+) @sv
alternative label: Östersjöfinska språk, litteraturhistoria (86.2 ... 86.24) @sv
broader: KIRJALLISUUSTIEDE
in scheme: YKL - Yleisten kirjastojen luokitusjärjestelmä
narrower: Suomenkielisen kansanrunouden historia ja tutkimus
narrower: Suomenruotsalaisen kirjallisuuden historia ja tutkimus
narrower: Vironkielisen kirjallisuuden historia ja tutkimus
narrower: Muiden itämerensuomalaisten kielten kirjallisuuden historia ja tutkimus
narrower: Muiden suomalais-ugrilaisten ja uralilaisten kielten kirjallisuuden historia ja tutkimus
notation: 86.2
preferred label: Finländsk, finsk-ugrisk och uraliska språk litteraturhistoria samt forskning i den finländska, finsk-ugriska och uraliska språk litteraturen @sv
preferred label: History of and research in Finnish, Finno-Ugric and Uralic literature @en
scope note: Hit allmänna verk om finländsk och finsk litteraturhistoria samt allmänna verk om forskning i finländsk och finsk litteratur. Hit och till underklasserna också litteraturhistoria och -forskning som rör litteratur eller folkdiktning på finsk-ugriska och uraliska språk. Hit även litteraturhistoria och litteraturforskning som rör litteratur på meänkieli och kvänska. @sv
scope note: Tähän Suomen ja suomenkielisen kirjallisuuden historian ja tutkimuksen yleisteokset Tähän ja alaluokkiin myös suomalais-ugrilaisten ja uralilaisten kielten kirjallisuuden ja kansanrunouden historia ja tutkimus. Tähän myös meänkielisen ja kveeninkielisen kirjallisuuden historia ja tutkimus.

Suomenkielisen kansanrunouden historia ja tutkimus
type: Concept
References: Suomen ja suomalais-ugrilaisten kansojen kansatiede, Kansantavat
References: Musiikin tutkimus
References: Suomalainen etnomusiikki
References: KANSANRUNOUS
References: Kansanrunouden historia ja tutkimus
References: Suomenruotsalaisen kirjallisuuden historia ja tutkimus
References: Vironkielisen kirjallisuuden historia ja tutkimus
References: Muiden itämerensuomalaisten kielten kirjallisuuden historia ja tutkimus
References: Muiden suomalais-ugrilaisten ja uralilaisten kielten kirjallisuuden historia ja tutkimus
type: YKL-luokka
alternative label: Finska, folkdiktsforskning (86.21) @sv
alternative label: Finska, folkloristik (86.21) @sv
alternative label: Folksägner, forskning om finskspråkig folkdiktning (86.21)
alternative label: Kalevala, forskning (86.21) @sv
alternative label: Kalevala, tutkimus (86.21)
alternative label: Kansantarinat, suomenkielisen kansanrunouden tutkimus (86.21)
alternative label: Kanteletar, forskning (86.21) @sv
alternative label: Kanteletar, tutkimus (86.21)
alternative label: Sagoväsen, folkloristik, Finland (86.21) @sv
alternative label: Suomen kieli, folkloristiikka (86.21)
alternative label: Suomen kieli, kansanrunoudentutkimus (86.21)
alternative label: Taruolennot, folkloristiikka, suomi (86.21)
broader: Suomen, suomalais-ugrilaisten ja uralilaisten kielten kirjallisuuden historia ja tutkimus
in scheme: YKL - Yleisten kirjastojen luokitusjärjestelmä
notation: 86.21
preferred label: Den finskspråkiga folkdiktningens historia och forskning i finsk folkdiktning @sv
preferred label: History of and research in Finnish folklore @en
scope note: Hit forskning och folkloristik som rör finskspråkig folkdiktning Andlig folkkultur och muntlig tradition ur den finskspråkiga folkdiktsforskningens synvinkel Hit även moderna sägner och urbanlegender ur den finskspråkiga folkdiktsforskningens synvinkel Finsk-ugrisk folkdiktsforskning i allmänhet 86.2 @sv
scope note: Tähän suomenkielisen kansanrunouden tutkimus ja folkloristiikka Henkinen kansankulttuuri ja suullinen perinne suomenkielisen kansanrunouden tutkimuksen kannalta Tähän myös esim. nykytarinat ja urbaanilegendat suomenkielisen kansanrunouden tutkimuksen kannalta Suomalais-ugrilaisen kansanrunouden tutkimus yleensä 86.2

Suomenruotsalaisen kirjallisuuden historia ja tutkimus
type: Concept
References: Ruotsinkielisen kirjallisuuden historia ja tutkimus
type: YKL-luokka
alternative label: Finlandssvensk folkdiktning, forskning (86.22) @sv
alternative label: Finlandssvensk litteraturhistoria (86.22) @sv
alternative label: Ruotsin kieli, folkloristiikka, Suomi (86.22)
alternative label: Ruotsin kieli, kansanrunoudentutkimus, Suomi (86.22)
alternative label: Ruotsin kieli, kirjallisuudenhistoria, Suomi (86.22)
alternative label: Suomenruotsalaisen kansanrunouden tutkimus (86.22)
alternative label: Suomenruotsalaisen kirjallisuuden historia (86.22)
alternative label: Svenska, folkdiktsforskning, Finland (86.22) @sv
alternative label: Svenska, folkloristik, Finland (86.22) @sv
alternative label: Svenska, litteraturhistoria, Finland (86.22) @sv
broader: Suomen, suomalais-ugrilaisten ja uralilaisten kielten kirjallisuuden historia ja tutkimus
in scheme: YKL - Yleisten kirjastojen luokitusjärjestelmä
notation: 86.22
preferred label: Finlandssvensk litteraturhistoria och forskning i finlandssvensk litteratur @sv
preferred label: History of and research in the Swedish literature of Finland @en
scope note: Hit också den finlandssvenska folkdiktningens historia och forskning i finlandssvensk folkdiktning @sv
scope note: Tähän myös suomenruotsalaisen kansanrunouden historia ja tutkimus

Vironkielisen kirjallisuuden historia ja tutkimus
type: Concept
type: YKL-luokka
alternative label: Eestin kieli, kirjallisuudenhistoria (86.23)
alternative label: Estniska, folkdiktsforskning (86.23) @sv
alternative label: Estniska, folkloristik (86.23) @sv
alternative label: Estniska, litteraturhistoria (86.23) @sv
alternative label: Kalevipoeg, forskning (86.23) @sv
alternative label: Kalevipoeg, tutkimus (86.23)
alternative label: Viron kieli, folkloristiikka (86.23)
alternative label: Viron kieli, kansanrunoudentutkimus (86.23)
alternative label: Viron kieli, kirjallisuudenhistoria (86.23)
broader: Suomen, suomalais-ugrilaisten ja uralilaisten kielten kirjallisuuden historia ja tutkimus
in scheme: YKL - Yleisten kirjastojen luokitusjärjestelmä
notation: 86.23
preferred label: History of and research in Estonian literature @en
preferred label: Litteraturhistoria och -forskning som rör litteratur på estniska @sv

Muiden itämerensuomalaisten kielten kirjallisuuden historia ja tutkimus
type: Concept
type: YKL-luokka
alternative label: Ingermanländska dialekter, ingriska, litteraturhistoria (86.24) @sv
alternative label: Ingriska dialekter, litteraturhistoria (86.24) @sv
alternative label: Ingriska, litteraturhistoria (86.24) @sv
alternative label: Inkerin kieli, kirjallisuudenhistoria (86.24)
alternative label: Inkeroinen, kirjallisuudenhistoria (86.24)
alternative label: Inkeroismurteet, kirjallisuudenhistoria (86.24)
alternative label: Karelska, litteraturhistoria (86.24) @sv
alternative label: Karjalan kieli, kirjallisuudenhistoria (86.24)
alternative label: Liivin kieli, kirjallisuudenhistoria (86.24)
alternative label: Liviska, litteraturhistoria (86.24) @sv
alternative label: Lydiska, litteraturhistoria (86.24) @sv
alternative label: Lyydin kieli, kirjallisuudenhistoria (86.24)
alternative label: Vatjan kieli, kirjallisuudenhistoria (86.24)
alternative label: Vepsiska, litteraturhistoria (86.24) @sv
alternative label: Vepsän kieli, kirjallisuudenhistoria (86.24)
alternative label: Votiska, litteraturhistoria (86.24) @sv
broader: Suomen, suomalais-ugrilaisten ja uralilaisten kielten kirjallisuuden historia ja tutkimus
in scheme: YKL - Yleisten kirjastojen luokitusjärjestelmä
notation: 86.24
preferred label: History of and research in literature in other Finno-Baltic languages @en
preferred label: Litteraturhistoria och -forskning som rör litteratur på de övriga östersjöfinska språken @sv

Muiden suomalais-ugrilaisten ja uralilaisten kielten kirjallisuuden historia ja tutkimus
type: Concept
type: YKL-luokka
alternative label: Ersän kieli, kirjallisuudenhistoria (86.25)
alternative label: Erzamordvinska, litteraturhistoria (86.25) @sv
alternative label: Komi, litteraturhistoria (86.25) @sv
alternative label: Komin kieli, kirjallisuudenhistoria (86.25)
alternative label: Mari, litteraturhistoria (86.25) @sv
alternative label: Marin kieli, kirjallisuudenhistoria (86.25)
alternative label: Moksan kieli, kirjallisuudenhistoria (86.25)
alternative label: Moksha, litteraturhistoria (86.25) @sv
alternative label: Mordvan kieli, kirjallisuudenhistoria (86.25)
alternative label: Mordvinska, litteraturhistoria (86.25) @sv
alternative label: Ostjakin kieli, kirjallisuudenhistoria (86.25)
alternative label: Ostjakiska, litteraturhistoria (86.25) @sv
alternative label: Permiläiset kielet, kirjallisuudenhistoria (86.25)
alternative label: Permiska språk, litteraturhistoria (86.25) @sv
alternative label: Samojedikielet, kirjallisuudenhistoria (86.25) @sv
alternative label: Samojedspråk, litteraturhistoria (86.25) @sv
alternative label: Syrjänska, litteraturhistoria (86.25) @sv
alternative label: Syrjäänin kieli, kirjallisuudenhistoria (86.25)
alternative label: Tjeremissiska, litteraturhistoria (86.25) @sv
alternative label: Tseremissin kieli, kirjallisuudenhistoria (86.25)
alternative label: Ugrilaiset kielet, kirjallisuudenhistoria (86.25+)
alternative label: Ugriska språk, litteraturhistoria (86.25+) @sv
alternative label: Uralilaiset kielet, kirjallisuudenhistoria (86.25)
alternative label: Uraliska språk, litteraturhistoria (86.25) @sv
alternative label: Vogulin kieli, kirjallisuudenhistoria (86.25)
alternative label: Voguliska, litteraturhistoria (86.25) @sv
alternative label: Volgafinska språk, litteraturhistoria (86.25) @sv
alternative label: Volgansuomalaiset kielet, kirjallisuudenhistoria (86.25)
alternative label: Votjakin kieli, kirjallisuudenhistoria (86.25)
alternative label: Votjakiska, litteraturhistoria (86.25) @sv
broader: Suomen, suomalais-ugrilaisten ja uralilaisten kielten kirjallisuuden historia ja tutkimus
in scheme: YKL - Yleisten kirjastojen luokitusjärjestelmä
narrower: Unkarinkielisen kirjallisuuden historia ja tutkimus
narrower: Saamenkielisen kirjallisuuden historia ja tutkimus
notation: 86.25
preferred label: History of and research in literature in other Finno-Ugric and Uralic languages @en
preferred label: Litteraturhistoria och -forskning som rör litteratur på de övriga finsk-ugriska och uraliska språken @sv

Unkarinkielisen kirjallisuuden historia ja tutkimus
type: Concept
type: YKL-luokka
alternative label: Ungerska, folkdiktsforskning (86.251) @sv
alternative label: Ungerska, folkloristik (86.251) @sv
alternative label: Ungerska, litteraturhistoria (86.251) @sv
alternative label: Unkarin kieli, folkloristiikka (86.251)
alternative label: Unkarin kieli, kansanrunoudentutkimus (86.251)
alternative label: Unkarin kieli, kirjallisuudenhistoria (86.251)
broader: Muiden suomalais-ugrilaisten ja uralilaisten kielten kirjallisuuden historia ja tutkimus
in scheme: YKL - Yleisten kirjastojen luokitusjärjestelmä
notation: 86.251
preferred label: History of and research in Hungarian literature @en
preferred label: Litteraturhistoria och -forskning som rör litteratur på ungerska @sv

Saamenkielisen kirjallisuuden historia ja tutkimus
type: Concept
type: YKL-luokka
alternative label: Koltan kieli, kirjallisuudenhistoria (86.252)
alternative label: Saamen kieli, folkloristiikka (86.252)
alternative label: Saamen kieli, kansanrunoudentutkimus (86.252)
alternative label: Saamen kieli, kirjallisuudenhistoria (86.252)
alternative label: Samiska, folkdiktsforskning (86.252) @sv
alternative label: Samiska, folkloristik (86.252) @sv
alternative label: Samiska, litteraturhistoria (86.252) @sv
alternative label: Skoltsamiska, litteraturhistoria (86.252) @sv
broader: Muiden suomalais-ugrilaisten ja uralilaisten kielten kirjallisuuden historia ja tutkimus
in scheme: YKL - Yleisten kirjastojen luokitusjärjestelmä
notation: 86.252
preferred label: History of and research in Sami literature @en
preferred label: Litteraturhistoria och -forskning som rör litteratur på samiska @sv

Pohjoismaisten kielten kirjallisuuden historia ja tutkimus
type: Concept
type: YKL-luokka
alternative label: Biografier, författare (86.2 ... 86.9+) @sv
alternative label: Biografier, författare, forskning (86.2 ... 86.9+) @sv
alternative label: Bloggar, författare (86.2 ... 86.9+) @sv
alternative label: Blogit, kirjailijat (86.2 ... 86.9+)
alternative label: Brev, författare (86.2 ... 86.9+) @sv
alternative label: Brevsamlingar, författare (86.2 ... 86.9+) @sv
alternative label: Brevväxling, författare (86.2 ... 86.9+) @sv
alternative label: Dagböcker, författare (86.2 ... 86.9+) @sv
alternative label: Dagböcker, författare, forskning (86.2 ... 86.9+) @sv
alternative label: Elämäkerrat, kirjailijat (86.2 ... 86.9+)
alternative label: Elämäkerrat, kirjailijat, tutkimus (86.2 ... 86.9+)
alternative label: Elämäkertatutkimus, kirjailijat (86.2 ... 86.9+)
alternative label: Författare, biografier och memoarer (86.2 ... 86.9+) @sv
alternative label: Henkilöhistoria, kirjailijat (86.2 ... 86.9+)
alternative label: Kirjailijat, elämäkerrat ja muistelmat (86.2 ... 86.9+)
alternative label: Kirjallisuudenhistoria, kielittäin ja maittain (86.2 ... 86.9+)
alternative label: Kirjallisuudentutkimus, kielittäin ja maittain (86.2 ... 86.9+)
alternative label: Kirjallisuustiede, kielittäin ja maittain (86.2 ... 86.9+)
alternative label: Kirjeenvaihto, kirjailijat (86.2 ... 86.9+)
alternative label: Kirjeet, kirjailijat (86.2 ... 86.9+)
alternative label: Kirjekokoelmat, kirjailijat (86.2 ... 86.9+)
alternative label: Komediat, näytelmäkirjallisuuden historia (86.1 ... 86.9+)
alternative label: Komedier, dramatikens historia (86.1 ... 86.9+) @sv
alternative label: Litteraturforskning, språkvis och landsvis (86.2 ... 86.9+) @sv
alternative label: Litteraturhistoria, språkvis och landsvis (86.2 ... 86.9+) @sv
alternative label: Litteraturvetenskap, språkvis och landsvis (86.2 ... 86.9+) @sv
alternative label: Livshistorieforskning, författare (86.2 ... 86.9+) @sv
alternative label: Memoarer, författare (86.2 ... 86.9+) @sv
alternative label: Memoarer, författare, forskning (86.2 ... 86.9+) @sv
alternative label: Muistelmat, kirjailijat (86.2 ... 86.9+)
alternative label: Muistelmat, kirjailijat, tutkimus (86.2 ... 86.9+)
alternative label: Nettipäiväkirjat, kirjailijat (86.2 ... 86.9+)
alternative label: Nordgermanska språk, litteraturhistoria (86.3+) @sv
alternative label: Nordiska språk, litteraturhistoria (86.3+) @sv
alternative label: Nätdagböcker, författare (86.2 ... 86.9+) @sv
alternative label: Omaelämäkerrat, kirjailijat (86.2 ... 86.9+)
alternative label: Personhistoria, författare (86.2 ... 86.9+) @sv
alternative label: Pohjoisgermaaniset kielet, kirjallisuudenhistoria (86.3+)
alternative label: Pohjoismaiset kielet, kirjallisuudenhistoria (86.3+)
alternative label: Päiväkirjat, kirjailijat (86.2 ... 86.9+)
alternative label: Päiväkirjat, kirjailijat, tutkimus (86.2 ... 86.9+)
alternative label: Självbiografier, författare (86.2 ... 86.9+) @sv
alternative label: Skandinaaviset kielet, kirjallisuudenhistoria (86.3+)
alternative label: Skandinaviska språk, litteraturhistoria (86.3+) @sv
alternative label: Verkkopäiväkirjat, kirjailijat (86.2 ... 86.9+)
alternative label: Web-log, kirjailijat (86.2 ... 86.9+)
alternative label: Webbjournaler, författare (86.2 ... 86.9+) @sv
alternative label: Webbloggar, författare (86.2 ... 86.9+) @sv
broader: KIRJALLISUUSTIEDE
in scheme: YKL - Yleisten kirjastojen luokitusjärjestelmä
narrower: Ruotsinkielisen kirjallisuuden historia ja tutkimus
narrower: Norjankielisen kirjallisuuden historia ja tutkimus
narrower: Tanskankielisen kirjallisuuden historia ja tutkimus
narrower: Islanninkielisen kirjallisuuden historia ja tutkimus
narrower: Fäärinkielisen kirjallisuuden historia ja tutkimus
notation: 86.3
preferred label: History of and research in literature in Nordic languages @en
preferred label: Litteraturhistoria och -forskning som rör litteratur på de nordiska språken @sv

Ruotsinkielisen kirjallisuuden historia ja tutkimus
type: Concept
References: Suomenruotsalaisen kirjallisuuden historia ja tutkimus
type: YKL-luokka
alternative label: Ruotsin kieli, folkloristiikka (86.31)
alternative label: Ruotsin kieli, kansanrunoudentutkimus (86.31)
alternative label: Ruotsin kieli, kirjallisuudenhistoria (86.31)
alternative label: Svenska, folkdiktsforskning (86.31) @sv
alternative label: Svenska, folkloristik (86.31) @sv
alternative label: Svenska, litteraturhistoria (86.31) @sv
broader: Pohjoismaisten kielten kirjallisuuden historia ja tutkimus
in scheme: YKL - Yleisten kirjastojen luokitusjärjestelmä
notation: 86.31
preferred label: History of and research in Swedish literature @en
preferred label: Litteraturhistoria och -forskning som rör litteratur på svenska @sv
scope note: Hit allmänna verk i litteraturhistoria och -forskning som rör litteratur och folkdiktning på svenska @sv
scope note: Tähän ruotsinkielisen kirjallisuuden ja kansanrunouden historian ja tutkimuksen yleisteokset

Norjankielisen kirjallisuuden historia ja tutkimus
type: Concept
type: YKL-luokka
alternative label: Norjan kieli, folkloristiikka (86.32)
alternative label: Norjan kieli, kansanrunoudentutkimus (86.32)
alternative label: Norjan kieli, kirjallisuudenhistoria (86.32)
alternative label: Norska, folkdiktsforskning (86.32) @sv
alternative label: Norska, folkloristik (86.32) @sv
alternative label: Norska, litteraturhistoria (86.32) @sv
broader: Pohjoismaisten kielten kirjallisuuden historia ja tutkimus
in scheme: YKL - Yleisten kirjastojen luokitusjärjestelmä
notation: 86.32
preferred label: History of and research in Norwegian literature @en
preferred label: Litteraturhistoria och -forskning som rör litteratur på norska @sv

Tanskankielisen kirjallisuuden historia ja tutkimus
type: Concept
type: YKL-luokka
alternative label: Danska, folkdiktsforskning (86.33) @sv
alternative label: Danska, folkloristik (86.33) @sv
alternative label: Danska, litteraturhistoria (86.33) @sv
alternative label: Tanskan kieli, folkloristiikka (86.33)
alternative label: Tanskan kieli, kansanrunoudentutkimus (86.33)
alternative label: Tanskan kieli, kirjallisuudenhistoria (86.33)
broader: Pohjoismaisten kielten kirjallisuuden historia ja tutkimus
in scheme: YKL - Yleisten kirjastojen luokitusjärjestelmä
notation: 86.33
preferred label: History of and research in Danish literature @en
preferred label: Litteraturhistoria och -forskning som rör litteratur på danska @sv

Islanninkielisen kirjallisuuden historia ja tutkimus
type: Concept
type: YKL-luokka
alternative label: Edda, forskning (86.34) @sv
alternative label: Edda, tutkimus (86.34)
alternative label: Islannin kieli, folkloristiikka (86.34)
alternative label: Islannin kieli, kansanrunoudentutkimus (86.34)
alternative label: Islannin kieli, kirjallisuudenhistoria (86.34)
alternative label: Isländska, folkdiktsforskning (86.34) @sv
alternative label: Isländska, folkloristik (86.34) @sv
alternative label: Isländska, litteraturhistoria (86.34) @sv
alternative label: Saagat, tutkimus (86.34)
alternative label: Sagor (86.34) @sv
broader: Pohjoismaisten kielten kirjallisuuden historia ja tutkimus
in scheme: YKL - Yleisten kirjastojen luokitusjärjestelmä
notation: 86.34
preferred label: History of and research in Icelandic literature @en
preferred label: Litteraturhistoria och -forskning som rör litteratur på isländska @sv

Fäärinkielisen kirjallisuuden historia ja tutkimus
type: Concept
type: YKL-luokka
alternative label: Färöiska, folkdiktsforskning (86.35) @sv
alternative label: Färöiska, folkloristik (86.35) @sv
alternative label: Färöiska, litteraturhistoria (86.35) @sv
alternative label: Fäärin kieli, folkloristiikka (86.35)
alternative label: Fäärin kieli, kansanrunoudentutkimus (86.35)
alternative label: Fäärin kieli, kirjallisuudenhistoria (86.35)
broader: Pohjoismaisten kielten kirjallisuuden historia ja tutkimus
in scheme: YKL - Yleisten kirjastojen luokitusjärjestelmä
notation: 86.35
preferred label: History of and research in Faeroese literature @en
preferred label: Litteraturhistoria och -forskning som rör litteratur på färöiska @sv

Saksankielisen kirjallisuuden historia ja tutkimus
type: Concept
References: Pohjoismaisten kielten kirjallisuuden historia ja tutkimus
References: Ruotsinkielisen kirjallisuuden historia ja tutkimus
References: Norjankielisen kirjallisuuden historia ja tutkimus
References: Tanskankielisen kirjallisuuden historia ja tutkimus
References: Islanninkielisen kirjallisuuden historia ja tutkimus
References: Fäärinkielisen kirjallisuuden historia ja tutkimus
References: Englanninkielisen kirjallisuuden historia ja tutkimus
References: Romaanisten kielten kirjallisuuden historia ja tutkimus
alternative label: Biografier, författare (86.2 ... 86.9+) @sv
alternative label: Biografier, författare, forskning (86.2 ... 86.9+) @sv
alternative label: Bloggar, författare (86.2 ... 86.9+) @sv
alternative label: Blogit, kirjailijat (86.2 ... 86.9+)
alternative label: Brev, författare (86.2 ... 86.9+) @sv
alternative label: Brevsamlingar, författare (86.2 ... 86.9+) @sv
alternative label: Brevväxling, författare (86.2 ... 86.9+) @sv
alternative label: Dagböcker, författare (86.2 ... 86.9+) @sv
alternative label: Dagböcker, författare, forskning (86.2 ... 86.9+) @sv
alternative label: Elämäkerrat, kirjailijat (86.2 ... 86.9+)
alternative label: Elämäkerrat, kirjailijat, tutkimus (86.2 ... 86.9+)
alternative label: Elämäkertatutkimus, kirjailijat (86.2 ... 86.9+)
alternative label: Författare, biografier och memoarer (86.2 ... 86.9+) @sv
alternative label: Germaaniset kielet, kirjallisuudenhistoria (86.4+)
alternative label: Germanska språk, litteraturhistoria (86.4+) @sv
alternative label: Gootin kieli, kirjallisuudenhistoria (86.4)
alternative label: Gotiska språket, litteraturhistoria (86.4) @sv
alternative label: Henkilöhistoria, kirjailijat (86.2 ... 86.9+)
alternative label: Itägermaaniset kielet, kirjallisudenhistoria (86.4)
alternative label: Jiddisch, litteraturhistoria (86.4) @sv
alternative label: Jiddišin kieli, kirjallisuudenhistoria (86.4)
alternative label: Kirjailijat, elämäkerrat ja muistelmat (86.2 ... 86.9+)
alternative label: Kirjallisuudenhistoria, kielittäin ja maittain (86.2 ... 86.9+)
alternative label: Kirjallisuudentutkimus, kielittäin ja maittain (86.2 ... 86.9+)
alternative label: Kirjallisuustiede, kielittäin ja maittain (86.2 ... 86.9+)
alternative label: Kirjeenvaihto, kirjailijat (86.2 ... 86.9+)
alternative label: Kirjeet, kirjailijat (86.2 ... 86.9+)
alternative label: Kirjekokoelmat, kirjailijat (86.2 ... 86.9+)
alternative label: Komediat, näytelmäkirjallisuuden historia (86.1 ... 86.9+)
alternative label: Komedier, dramatikens historia (86.1 ... 86.9+) @sv
alternative label: Litteraturforskning, språkvis och landsvis (86.2 ... 86.9+) @sv
alternative label: Litteraturhistoria, språkvis och landsvis (86.2 ... 86.9+) @sv
alternative label: Litteraturvetenskap, språkvis och landsvis (86.2 ... 86.9+) @sv
alternative label: Livshistorieforskning, författare (86.2 ... 86.9+) @sv
alternative label: Länsigermaaniset kielet, kirjallisuudenhistoria (86.4+)
alternative label: Memoarer, författare (86.2 ... 86.9+) @sv
alternative label: Memoarer, författare, forskning (86.2 ... 86.9+) @sv
alternative label: Muistelmat, kirjailijat (86.2 ... 86.9+)
alternative label: Muistelmat, kirjailijat, tutkimus (86.2 ... 86.9+)
alternative label: Nettipäiväkirjat, kirjailijat (86.2 ... 86.9+)
alternative label: Nibelungenlied, forskning (86.4) @sv
alternative label: Nibelungenlied, tutkimus (86.4)
alternative label: Nätdagböcker, författare (86.2 ... 86.9+) @sv
alternative label: Omaelämäkerrat, kirjailijat (86.2 ... 86.9+)
alternative label: Personhistoria, författare (86.2 ... 86.9+) @sv
alternative label: Päiväkirjat, kirjailijat (86.2 ... 86.9+)
alternative label: Päiväkirjat, kirjailijat, tutkimus (86.2 ... 86.9+)
alternative label: Saksan kieli, folkloristiikka (86.4)
alternative label: Saksan kieli, kansanrunoudentutkimus (86.4)
alternative label: Saksan kieli, kirjallisuudenhistoria (86.4)
alternative label: Schweiz, litteraturhistoria (86.4) @sv
alternative label: Självbiografier, författare (86.2 ... 86.9+) @sv
alternative label: Sveitsi, kirjallisuudenhistoria (86.4)
alternative label: Tyska, folkdiktsforskning (86.4) @sv
alternative label: Tyska, folkloristik (86.4) @sv
alternative label: Tyska, litteraturhistoria (86.4) @sv
alternative label: Verkkopäiväkirjat, kirjailijat (86.2 ... 86.9+)
alternative label: Västgermanska språk, litteraturhistoria (86.4+) @sv
alternative label: Web-log, kirjailijat (86.2 ... 86.9+)
alternative label: Webbjournaler, författare (86.2 ... 86.9+) @sv
alternative label: Webbloggar, författare (86.2 ... 86.9+) @sv
alternative label: Östgermanska språk, litteraturhistoria (86.4) @sv
broader: KIRJALLISUUSTIEDE
in scheme: YKL - Yleisten kirjastojen luokitusjärjestelmä
narrower: Friisinkielisen kirjallisuuden historia ja tutkimus
narrower: Hollanninkielisen kirjallisuuden historia ja tutkimus
notation: 86.4
preferred label: History of and research in German literature @en
preferred label: Litteraturhistoria och -forskning som rör litteratur på tyska @sv
scope note: Hit också t.ex. tysk litteraturhistoria och forskning i tysk litteratur i Schweiz och Österrike Hit och till underklasserna också litteraturhistoria och -forskning som rör övriga germanska språk Hit litteraturhistoria och -forskning som rör jiddisch Hit också allmänna verk i litteraturhistoria och -forskning som rör schweizisk litteratur @sv
scope note: Tähän myös esim. Itävallan ja Sveitsin saksankielisen kirjallisuuden historia ja tutkimus Tähän ja alaluokkiin myös muiden germaanisten kielten kirjallisuuden historia ja tutkimus Tähän jiddišinkielisen kirjallisuuden historia ja tutkimus Tähän myös Sveitsin kirjallisuuden historian ja tutkimuksen yleisteokset

Friisinkielisen kirjallisuuden historia ja tutkimus
type: Concept
type: YKL-luokka
alternative label: Friisin kieli, kirjallisuudenhistoria (86.43)
alternative label: Frisiska , litteraturhistoria (86.43) @sv
broader: Saksankielisen kirjallisuuden historia ja tutkimus
in scheme: YKL - Yleisten kirjastojen luokitusjärjestelmä
notation: 86.43
preferred label: History of and research in Frisian literature @en
preferred label: Litteraturhistoria och -forskning som rör litteratur på frisiska @sv

Hollanninkielisen kirjallisuuden historia ja tutkimus
type: Concept
References: Etelä-Afrikan englanninkielisen kirjallisuuden historia ja tutkimus
References: Ranskankielisen kirjallisuuden historia ja tutkimus
type: YKL-luokka
alternative label: Afrikaans, litteraturhistoria (86.48) @sv
alternative label: Afrikaansin kieli, kirjallisuudenhistoria (86.48)
alternative label: Etelä-Afrikka, afrikaansin kieli, kirjallisuudenhistoria (86.48)
alternative label: Flaamin kieli, kirjallisuudenhistoria (86.48)
alternative label: Flamländska, litteraturhistoria (86.48) @sv
alternative label: Hollannin kieli, folkloristiikka (86.48)
alternative label: Hollannin kieli, kansanrunoudentutkimus (86.48)
alternative label: Hollannin kieli, kirjallisuudenhistoria (86.48)
alternative label: Holländska, litteraturhistoria (86.48) @sv
alternative label: Nederländska, folkdiktsforskning (86.48) @sv
alternative label: Nederländska, folkloristik (86.48) @sv
alternative label: Nederländska, litteraturhistoria (86.48) @sv
alternative label: Sydafrika, afrikaans, litteraturhistoria (86.48) @sv
broader: Saksankielisen kirjallisuuden historia ja tutkimus
in scheme: YKL - Yleisten kirjastojen luokitusjärjestelmä
notation: 86.48
preferred label: History of and research in Dutch literature @en
preferred label: Litteraturhistoria och -forskning som rör litteratur på nederländska @sv
scope note: Hit också litteraturhistoria och -forskning som rör afrikaans och flamländska @sv
scope note: Tähän myös afrikaansin- ja flaaminkielisen kirjallisuuden historia ja tutkimus

Englanninkielisen kirjallisuuden historia ja tutkimus
type: Concept
References: Indoiraanisten kielten kirjallisuuden historia ja tutkimus
type: YKL-luokka
alternative label: Beowulf, forskning (86.5) @sv
alternative label: Beowulf, tutkimus (86.5)
alternative label: Biografier, författare (86.2 ... 86.9+) @sv
alternative label: Biografier, författare, forskning (86.2 ... 86.9+) @sv
alternative label: Bloggar, författare (86.2 ... 86.9+) @sv
alternative label: Blogit, kirjailijat (86.2 ... 86.9+)
alternative label: Brev, författare (86.2 ... 86.9+) @sv
alternative label: Brevsamlingar, författare (86.2 ... 86.9+) @sv
alternative label: Brevväxling, författare (86.2 ... 86.9+) @sv
alternative label: Dagböcker, författare (86.2 ... 86.9+) @sv
alternative label: Dagböcker, författare, forskning (86.2 ... 86.9+) @sv
alternative label: Elämäkerrat, kirjailijat (86.2 ... 86.9+)
alternative label: Elämäkerrat, kirjailijat, tutkimus (86.2 ... 86.9+)
alternative label: Elämäkertatutkimus, kirjailijat (86.2 ... 86.9+)
alternative label: Engelska, folkdiktsforskning (86.5+) @sv
alternative label: Engelska, folkloristik (86.5+) @sv
alternative label: Engelska, litteraturhistoria (86.5+) @sv
alternative label: Englannin kieli, folkloristiikka (86.5+)
alternative label: Englannin kieli, kansanrunoudentutkimus (86.5+)
alternative label: Englannin kieli, kirjallisuudenhistoria (86.5+)
alternative label: Författare, biografier och memoarer (86.2 ... 86.9+) @sv
alternative label: Henkilöhistoria, kirjailijat (86.2 ... 86.9+)
alternative label: Indien, engelska språket, litteraturhistoria (86.5) @sv
alternative label: Intia, englannin kieli, kirjallisuudenhistoria (86.5)
alternative label: Irland, engelska språket, litteraturhistoria (86.5) @sv
alternative label: Irlanti, englannin kieli, kirjallisuudenhistoria (86.5)
alternative label: Kirjailijat, elämäkerrat ja muistelmat (86.2 ... 86.9+)
alternative label: Kirjallisuudenhistoria, kielittäin ja maittain (86.2 ... 86.9+)
alternative label: Kirjallisuudentutkimus, kielittäin ja maittain (86.2 ... 86.9+)
alternative label: Kirjallisuustiede, kielittäin ja maittain (86.2 ... 86.9+)
alternative label: Kirjeenvaihto, kirjailijat (86.2 ... 86.9+)
alternative label: Kirjeet, kirjailijat (86.2 ... 86.9+)
alternative label: Kirjekokoelmat, kirjailijat (86.2 ... 86.9+)
alternative label: Komediat, näytelmäkirjallisuuden historia (86.1 ... 86.9+)
alternative label: Komedier, dramatikens historia (86.1 ... 86.9+) @sv
alternative label: Litteraturforskning, språkvis och landsvis (86.2 ... 86.9+) @sv
alternative label: Litteraturhistoria, språkvis och landsvis (86.2 ... 86.9+) @sv
alternative label: Litteraturvetenskap, språkvis och landsvis (86.2 ... 86.9+) @sv
alternative label: Livshistorieforskning, författare (86.2 ... 86.9+) @sv
alternative label: Memoarer, författare (86.2 ... 86.9+) @sv
alternative label: Memoarer, författare, forskning (86.2 ... 86.9+) @sv
alternative label: Muistelmat, kirjailijat (86.2 ... 86.9+)
alternative label: Muistelmat, kirjailijat, tutkimus (86.2 ... 86.9+)
alternative label: Nettipäiväkirjat, kirjailijat (86.2 ... 86.9+)
alternative label: Nätdagböcker, författare (86.2 ... 86.9+) @sv
alternative label: Omaelämäkerrat, kirjailijat (86.2 ... 86.9+)
alternative label: Personhistoria, författare (86.2 ... 86.9+) @sv
alternative label: Päiväkirjat, kirjailijat (86.2 ... 86.9+)
alternative label: Päiväkirjat, kirjailijat, tutkimus (86.2 ... 86.9+)
alternative label: Självbiografier, författare (86.2 ... 86.9+) @sv
alternative label: Verkkopäiväkirjat, kirjailijat (86.2 ... 86.9+)
alternative label: Web-log, kirjailijat (86.2 ... 86.9+)
alternative label: Webbjournaler, författare (86.2 ... 86.9+) @sv
alternative label: Webbloggar, författare (86.2 ... 86.9+) @sv
broader: KIRJALLISUUSTIEDE
in scheme: YKL - Yleisten kirjastojen luokitusjärjestelmä
narrower: Amerikan englanninkielisen kirjallisuuden historia ja tutkimus
narrower: Australian ja Uuden-Seelannin englanninkielisen kirjallisuuden historia ja tutkimus
narrower: Etelä-Afrikan englanninkielisen kirjallisuuden historia ja tutkimus
notation: 86.5
preferred label: History of and research in English literature @en
preferred label: Litteraturhistoria och -forskning som rör litteratur på engelska @sv
scope note: Hit allmänna verk i litteraturhistoria och -forskning som rör litteratur på engelska Hit också litteraturhistoria och -forskning som rör engelskspråkig litteratur i Indien och på Irland @sv
scope note: Tähän englanninkielisen kirjallisuuden historian ja tutkimuksen yleisteokset Tähän myös esim. Intian ja Irlannin englanninkielisen kirjallisuuden historia ja tutkimus

Amerikan englanninkielisen kirjallisuuden historia ja tutkimus
type: Concept
References: Ranskankielisen kirjallisuuden historia ja tutkimus
type: YKL-luokka
alternative label: Amerika, engelska språket, litteraturhistoria (86.53) @sv
alternative label: Amerikka, englannin kieli, kirjallisuudenhistoria (86.53)
broader: Englanninkielisen kirjallisuuden historia ja tutkimus
in scheme: YKL - Yleisten kirjastojen luokitusjärjestelmä
notation: 86.53
preferred label: History of and research in the English literature of America @en
preferred label: Litteraturhistoria och -forskning som rör litteratur på engelska i Amerika @sv
scope note: Hit också allmänna verk om Nordamerikas, Kanadas och Förenta Staternas litteraturhistoria och forskning i dessa länders litteratur @sv
scope note: Tähän myös Pohjois-Amerikan sekä Kanadan ja Yhdysvaltojen kirjallisuuden historian ja tutkimuksen yleisteokset

Australian ja Uuden-Seelannin englanninkielisen kirjallisuuden historia ja tutkimus
type: Concept
type: YKL-luokka
alternative label: Australia, englannin kieli, kirjallisuudenhistoria (86.54)
alternative label: Australien, engelska språket, litteraturhistoria (86.54) @sv
alternative label: Nya Zeeland, engelska språket, litteraturhistoria (86.54) @sv
alternative label: Uusi-Seelanti, englannin kieli, kirallisuudenhistoria (86.54)
broader: Englanninkielisen kirjallisuuden historia ja tutkimus
in scheme: YKL - Yleisten kirjastojen luokitusjärjestelmä
notation: 86.54
preferred label: History of and research in the English literature of Australia and New Zealand @en
preferred label: Litteraturhistoria och -forskning som rör litteratur på engelska i Australien och Nya Zeeland @sv
scope note: Hit också allmänna verk i litteraturhistoria och -forskning som rör Australiens och Nya Zeelands litteratur @sv
scope note: Tähän myös Australian ja Uuden-Seelannin kirjallisuuden historian ja tutkimuksen yleisteokset

Etelä-Afrikan englanninkielisen kirjallisuuden historia ja tutkimus
type: Concept
References: Hollanninkielisen kirjallisuuden historia ja tutkimus
type: YKL-luokka
alternative label: Afrika, engelska, litteraturhistoria (86.56) @sv
alternative label: Afrikansk litteratur, engelska, historia och forskning (86.56) @sv
alternative label: Afrikka, englannin kieli, kirjallisuudenhistoria (86.56)
alternative label: Afrikkalainen kirjallisuus, englannin kieli, historia ja tutkimus (86.56)
alternative label: Etelä-Afrikka, englannin kieli, kirjallisuudenhistoria (86.56)
alternative label: Etelä-Afrikka, kirjallisuudenhistoria (86.56)
alternative label: Sydafrika, engelska språket, litteraturhistoria (86.56) @sv
alternative label: Sydafrika, litteraturhistoria (86.56) @sv
broader: Englanninkielisen kirjallisuuden historia ja tutkimus
in scheme: YKL - Yleisten kirjastojen luokitusjärjestelmä
notation: 86.56
preferred label: History of and research in the English literature of South Africa @en
preferred label: Litteraturhistoria och -forskning som rör litteratur på engelska i Sydafrika @sv
scope note: Hit också allmänna verk i litteraturhistoria och -forskning som rör Sydafrikas litteratur @sv
scope note: Tähän myös Etelä-Afrikan kirjallisuuden historian ja tutkimuksen yleisteokset

Romaanisten kielten kirjallisuuden historia ja tutkimus
type: Concept
References: Saksankielisen kirjallisuuden historia ja tutkimus
type: YKL-luokka
alternative label: Biografier, författare (86.2 ... 86.9+) @sv
alternative label: Biografier, författare, forskning (86.2 ... 86.9+) @sv
alternative label: Bloggar, författare (86.2 ... 86.9+) @sv
alternative label: Blogit, kirjailijat (86.2 ... 86.9+)
alternative label: Brev, författare (86.2 ... 86.9+) @sv
alternative label: Brevsamlingar, författare (86.2 ... 86.9+) @sv
alternative label: Brevväxling, författare (86.2 ... 86.9+) @sv
alternative label: Dagböcker, författare (86.2 ... 86.9+) @sv
alternative label: Dagböcker, författare, forskning (86.2 ... 86.9+) @sv
alternative label: Elämäkerrat, kirjailijat (86.2 ... 86.9+)
alternative label: Elämäkerrat, kirjailijat, tutkimus (86.2 ... 86.9+)
alternative label: Elämäkertatutkimus, kirjailijat (86.2 ... 86.9+)
alternative label: Författare, biografier och memoarer (86.2 ... 86.9+) @sv
alternative label: Henkilöhistoria, kirjailijat (86.2 ... 86.9+)
alternative label: Kirjailijat, elämäkerrat ja muistelmat (86.2 ... 86.9+)
alternative label: Kirjallisuudenhistoria, kielittäin ja maittain (86.2 ... 86.9+)
alternative label: Kirjallisuudentutkimus, kielittäin ja maittain (86.2 ... 86.9+)
alternative label: Kirjallisuustiede, kielittäin ja maittain (86.2 ... 86.9+)
alternative label: Kirjeenvaihto, kirjailijat (86.2 ... 86.9+)
alternative label: Kirjeet, kirjailijat (86.2 ... 86.9+)
alternative label: Kirjekokoelmat, kirjailijat (86.2 ... 86.9+)
alternative label: Komediat, näytelmäkirjallisuuden historia (86.1 ... 86.9+)
alternative label: Komedier, dramatikens historia (86.1 ... 86.9+) @sv
alternative label: Litteraturforskning, språkvis och landsvis (86.2 ... 86.9+) @sv
alternative label: Litteraturhistoria, språkvis och landsvis (86.2 ... 86.9+) @sv
alternative label: Litteraturvetenskap, språkvis och landsvis (86.2 ... 86.9+) @sv
alternative label: Livshistorieforskning, författare (86.2 ... 86.9+) @sv
alternative label: Memoarer, författare (86.2 ... 86.9+) @sv
alternative label: Memoarer, författare, forskning (86.2 ... 86.9+) @sv
alternative label: Muistelmat, kirjailijat (86.2 ... 86.9+)
alternative label: Muistelmat, kirjailijat, tutkimus (86.2 ... 86.9+)
alternative label: Nettipäiväkirjat, kirjailijat (86.2 ... 86.9+)
alternative label: Nätdagböcker, författare (86.2 ... 86.9+) @sv
alternative label: Omaelämäkerrat, kirjailijat (86.2 ... 86.9+)
alternative label: Personhistoria, författare (86.2 ... 86.9+) @sv
alternative label: Päiväkirjat, kirjailijat (86.2 ... 86.9+)
alternative label: Päiväkirjat, kirjailijat, tutkimus (86.2 ... 86.9+)
alternative label: Retoromaanin kieli, kirjallisuudenhistoria (86.6)
alternative label: Romaaniset kielet, kirjallisuudenhistoria (86.6+)
alternative label: Romansk språk, litteraturhistoria (86.6+) @sv
alternative label: Rätoromanska, litteraturhistoria (86.6) @sv
alternative label: Självbiografier, författare (86.2 ... 86.9+) @sv
alternative label: Verkkopäiväkirjat, kirjailijat (86.2 ... 86.9+)
alternative label: Web-log, kirjailijat (86.2 ... 86.9+)
alternative label: Webbjournaler, författare (86.2 ... 86.9+) @sv
alternative label: Webbloggar, författare (86.2 ... 86.9+) @sv
broader: KIRJALLISUUSTIEDE
in scheme: YKL - Yleisten kirjastojen luokitusjärjestelmä
narrower: Ranskankielisen kirjallisuuden historia ja tutkimus
narrower: Italiankielisen kirjallisuuden historia ja tutkimus
narrower: Espanjankielisen kirjallisuuden historia ja tutkimus
narrower: Portugalinkielisen kirjallisuuden historia ja tutkimus
narrower: Romaniankielisen kirjallisuuden historia ja tutkimus
narrower: Muiden romaanisten kielten kirjallisuuden historia ja tutkimus
notation: 86.6
preferred label: History of and research in literature in Romanic languages @en
preferred label: Litteraturhistoria och -forskning som rör litteratur på romanska språk @sv
scope note: Hit också litteraturhistoria och -forskning som rör litteratur på retoromanska @sv
scope note: Tähän myös retoromaniankielisen kirjallisuuden historia ja tutkimus

Ranskankielisen kirjallisuuden historia ja tutkimus
type: Concept
References: Saksankielisen kirjallisuuden historia ja tutkimus
References: Amerikan englanninkielisen kirjallisuuden historia ja tutkimus
type: YKL-luokka
alternative label: Franska, folkdiktsforskning (86.61) @sv
alternative label: Franska, folkloristik (86.61) @sv
alternative label: Franska, litteraturhistoria (86.61) @sv
alternative label: Ranskan kieli, folkloristiikka (86.61)
alternative label: Ranskan kieli, kansanrunoudentutkimus (86.61)
alternative label: Ranskan kieli, kirjallisuudenhistoria (86.61)
alternative label: Rolandin laulu, tutkimus (86.61)
alternative label: Rolandssången, forskning (86.61) @sv
broader: Romaanisten kielten kirjallisuuden historia ja tutkimus
in scheme: YKL - Yleisten kirjastojen luokitusjärjestelmä
notation: 86.61
preferred label: History of and research in French literature @en
preferred label: Litteraturhistoria och -forskning som rör litteratur på franska @sv
scope note: Hit också litteraturhistoria och -forskning som rör litteratur på franska i t.ex. Belgien, Kanada, Luxemburg och Schweiz Hit också allmänna verk i litteraturhistoria och -forskning som rör litteraturen i Belgien @sv
scope note: Tähän myös esim. Belgian, Kanadan, Luxemburgin ja Sveitsin ranskankielisen kirjallisuuden historia ja tutkimus Tähän myös Belgian kirjallisuuden historian ja tutkimuksen yleisteokset

Italiankielisen kirjallisuuden historia ja tutkimus
type: Concept
References: Saksankielisen kirjallisuuden historia ja tutkimus
type: YKL-luokka
alternative label: Italian kieli, folkloristiikka (86.62)
alternative label: Italian kieli, kansanrunoudentutkimus (86.62)
alternative label: Italian kieli, kirjallisuudenhistoria (86.62)
alternative label: Italienska, folkdiktsforskning (86.62) @sv
alternative label: Italienska, folkloristik (86.62) @sv
alternative label: Italienska, litteraturhistoria (86.62) @sv
broader: Romaanisten kielten kirjallisuuden historia ja tutkimus
in scheme: YKL - Yleisten kirjastojen luokitusjärjestelmä
notation: 86.62
preferred label: History of and research in Italian literature @en
preferred label: Litteraturhistoria och -forskning som rör litteratur på Italienska @sv
scope note: Hit också litteraturhistoria och -forskning som rör litteratur på italienska i t.ex. Schweiz @sv
scope note: Tähän myös esim. Sveitsin italiankielisen kirjallisuuden historia ja tutkimus

Espanjankielisen kirjallisuuden historia ja tutkimus
type: Concept
type: YKL-luokka
alternative label: Cid, Sången om El Cid, forskning (86.63) @sv
alternative label: Cidin laulu, tutkimus (86.63)
alternative label: Espanjan kieli, folkloristiikka (86.63)
alternative label: Espanjan kieli, kansanrunoudentutkimus (86.63)
alternative label: Espanjan kieli, kirjallisuudenhistoria (86.63+)
alternative label: Spanska, folkdiktsforskning (86.63) @sv
alternative label: Spanska, folkloristik (86.63) @sv
alternative label: Spanska, litteraturhistoria (86.63+) @sv
broader: Romaanisten kielten kirjallisuuden historia ja tutkimus
in scheme: YKL - Yleisten kirjastojen luokitusjärjestelmä
narrower: Amerikan espanjankielisen kirjallisuuden historia ja tutkimus
notation: 86.63
preferred label: History of and research in Spanish literature @en
preferred label: Litteraturhistoria och -forskning som rör litteratur på spanska @sv

Amerikan espanjankielisen kirjallisuuden historia ja tutkimus
type: Concept
References: Portugalinkielisen kirjallisuuden historia ja tutkimus
type: YKL-luokka
alternative label: Amerika, spanska språket, litteraturhistoria (86.633) @sv
alternative label: Amerikka, espanjan kieli, kirjallisuudenhistoria (86.633)
alternative label: Latinalainen Amerikka, kirjallisuudenhistoria (86.633)
alternative label: Latinamerika, litteraturhistoria (86.633) @sv
broader: Espanjankielisen kirjallisuuden historia ja tutkimus
in scheme: YKL - Yleisten kirjastojen luokitusjärjestelmä
notation: 86.633
preferred label: History of and research in the Spanish literature of America @en
preferred label: Litteraturhistoria och forskning som rör litteratur på spanska i Amerika @sv
scope note: Hit också allmänna verk i litteraturhistoria och -forskning som rör latinamerikansk samt mellan- och sydamerikansk litteratur @sv
scope note: Tähän myös latinalaisen Amerikan sekä Väli- ja Etelä-Amerikan kirjallisuuden historian ja tutkimuksen yleisteokset

Portugalinkielisen kirjallisuuden historia ja tutkimus
type: Concept
type: YKL-luokka
alternative label: Portugalin kieli, folkloristiikka (86.64)
alternative label: Portugalin kieli, kansanrunoudentutkimus (86.64)
alternative label: Portugalin kieli, kirjallisuudenhistoria (86.64)
alternative label: Portugisiska, folkdiktsforskning (86.64) @sv
alternative label: Portugisiska, folkloristik (86.64) @sv
alternative label: Portugisiska, litteraturhistoria (86.64) @sv
broader: Romaanisten kielten kirjallisuuden historia ja tutkimus
in scheme: YKL - Yleisten kirjastojen luokitusjärjestelmä
notation: 86.64
preferred label: History of and research in Portuguese literature @en
preferred label: Litteraturhistoria och -forskning som rör litteratur på portugisiska @sv
scope note: Hit också litteraturhistoria och -forskning som rör litteratur på portugisiska i Brasilien @sv
scope note: Tähän myös Brasilian portugalinkielisen kirjallisuuden historia ja tutkimus

Romaniankielisen kirjallisuuden historia ja tutkimus
type: Concept
type: YKL-luokka
alternative label: Romanian kieli, folkloristiikka (86.65)
alternative label: Romanian kieli, kansanrunoudentutkimus (86.65)
alternative label: Romanian kieli, kirjallisuudenhistoria (86.65)
alternative label: Rumänska, folkdiktsforskning (86.65) @sv
alternative label: Rumänska, folkloristik (86.65) @sv
alternative label: Rumänska, litteraturhistoria (86.65) @sv
broader: Romaanisten kielten kirjallisuuden historia ja tutkimus
in scheme: YKL - Yleisten kirjastojen luokitusjärjestelmä
notation: 86.65
preferred label: History of and research in Romanian literature @en
preferred label: Litteraturhistoria och -forskning som rör litteratur på rumänska @sv

Muiden romaanisten kielten kirjallisuuden historia ja tutkimus
type: Concept
type: YKL-luokka
alternative label: Dalmatian kieli, kirjallisuudenhistoria (86.67)
alternative label: Dalmatiska, litteraturhistoria (86.67) @sv
alternative label: Galego, litteraturhistoria (86.67) @sv
alternative label: Galegon kieli, kirjallisuudenhistoria (86.67)
alternative label: Galician kieli, kirjallisuudenhistoria (86.67)
alternative label: Galiciska, litteraturhistoria (86.67) @sv
alternative label: Katalaanin kieli, kirjallisuudenhistoria (86.67)
alternative label: Katalanska, litteraturhistoria (86.67) @sv
alternative label: Ladiniska, litteraturhistoria (86.67) @sv
alternative label: Ladinon kieli, kirjallisuudenhistoria (86.67)
alternative label: Moldavian kieli, kirjallisuudenhistoria (86.67)
alternative label: Moldaviska, litteraturhistoria (86.67) @sv
alternative label: Occitanska, litteraturhistoria (86.67) @sv
alternative label: Oksitaanin kieli, kirjallisuudenhistoria (86.67)
alternative label: Provensaalin kieli, kirjallisuudenhistoria (86.67)
alternative label: Provensalska, litteraturhistoria (86.67) @sv
alternative label: Sardin kieli, kirjallisuudenhistoria (86.67)
alternative label: Sardiska, litteraturhistoria (86.67) @sv
broader: Romaanisten kielten kirjallisuuden historia ja tutkimus
in scheme: YKL - Yleisten kirjastojen luokitusjärjestelmä
notation: 86.67
preferred label: History of and research in literature in other Romanic languages @en
preferred label: Litteraturhistoria och -forskning som rör litteratur på övriga romanska språk @sv

Slaavilaisten ja balttilaisten kielten kirjallisuuden historia ja tutkimus
type: Concept
type: YKL-luokka
alternative label: Biografier, författare (86.2 ... 86.9+) @sv
alternative label: Biografier, författare, forskning (86.2 ... 86.9+) @sv
alternative label: Bloggar, författare (86.2 ... 86.9+) @sv
alternative label: Blogit, kirjailijat (86.2 ... 86.9+)
alternative label: Brev, författare (86.2 ... 86.9+) @sv
alternative label: Brevsamlingar, författare (86.2 ... 86.9+) @sv
alternative label: Brevväxling, författare (86.2 ... 86.9+) @sv
alternative label: Dagböcker, författare (86.2 ... 86.9+) @sv
alternative label: Dagböcker, författare, forskning (86.2 ... 86.9+) @sv
alternative label: Elämäkerrat, kirjailijat (86.2 ... 86.9+)
alternative label: Elämäkerrat, kirjailijat, tutkimus (86.2 ... 86.9+)
alternative label: Elämäkertatutkimus, kirjailijat (86.2 ... 86.9+)
alternative label: Författare, biografier och memoarer (86.2 ... 86.9+) @sv
alternative label: Henkilöhistoria, kirjailijat (86.2 ... 86.9+)
alternative label: Kirjailijat, elämäkerrat ja muistelmat (86.2 ... 86.9+)
alternative label: Kirjallisuudenhistoria, kielittäin ja maittain (86.2 ... 86.9+)
alternative label: Kirjallisuudentutkimus, kielittäin ja maittain (86.2 ... 86.9+)
alternative label: Kirjallisuustiede, kielittäin ja maittain (86.2 ... 86.9+)
alternative label: Kirjeenvaihto, kirjailijat (86.2 ... 86.9+)
alternative label: Kirjeet, kirjailijat (86.2 ... 86.9+)
alternative label: Kirjekokoelmat, kirjailijat (86.2 ... 86.9+)
alternative label: Komediat, näytelmäkirjallisuuden historia (86.1 ... 86.9+)
alternative label: Komedier, dramatikens historia (86.1 ... 86.9+) @sv
alternative label: Litteraturforskning, språkvis och landsvis (86.2 ... 86.9+) @sv
alternative label: Litteraturhistoria, språkvis och landsvis (86.2 ... 86.9+) @sv
alternative label: Litteraturvetenskap, språkvis och landsvis (86.2 ... 86.9+) @sv
alternative label: Livshistorieforskning, författare (86.2 ... 86.9+) @sv
alternative label: Memoarer, författare (86.2 ... 86.9+) @sv
alternative label: Memoarer, författare, forskning (86.2 ... 86.9+) @sv
alternative label: Muistelmat, kirjailijat (86.2 ... 86.9+)
alternative label: Muistelmat, kirjailijat, tutkimus (86.2 ... 86.9+)
alternative label: Nettipäiväkirjat, kirjailijat (86.2 ... 86.9+)
alternative label: Nätdagböcker, författare (86.2 ... 86.9+) @sv
alternative label: Omaelämäkerrat, kirjailijat (86.2 ... 86.9+)
alternative label: Personhistoria, författare (86.2 ... 86.9+) @sv
alternative label: Päiväkirjat, kirjailijat (86.2 ... 86.9+)
alternative label: Päiväkirjat, kirjailijat, tutkimus (86.2 ... 86.9+)
alternative label: Självbiografier, författare (86.2 ... 86.9+) @sv
alternative label: Slaavilaiset kielet, kirjallisuudenhistoria (86.7+)
alternative label: Slaviska språk, litteraturhistoria (86.7+) @sv
alternative label: Sorbin kieli, kirjallisuudenhistoria (86.7)
alternative label: Sorbiska, litteraturhistoria (86.7) @sv
alternative label: Verkkopäiväkirjat, kirjailijat (86.2 ... 86.9+)
alternative label: Web-log, kirjailijat (86.2 ... 86.9+)
alternative label: Webbjournaler, författare (86.2 ... 86.9+) @sv
alternative label: Webbloggar, författare (86.2 ... 86.9+) @sv
broader: KIRJALLISUUSTIEDE
in scheme: YKL - Yleisten kirjastojen luokitusjärjestelmä
narrower: Venäjänkielisen kirjallisuuden historia ja tutkimus
narrower: Ukrainankielisen kirjallisuuden historia ja tutkimus. Valkovenäjänkielisen kirjallisuuden historia ja tutkimus
narrower: Puolankielisen kirjallisuuden historia ja tutkimus
narrower: Tšekinkielisen kirjallisuuden historia ja tutkimus
narrower: Slovakinkielisen kirjallisuuden historia ja tutkimus
narrower: Eteläslaavilaisten kielten kirjallisuuden historia ja tutkimus
narrower: Balttilaisten kielten kirjallisuuden historia ja tutkimus
notation: 86.7
preferred label: History of and research in literature in Slavonic and Baltic languages @en
preferred label: Litteraturhistoria och -forskning som rör litteratur på slaviska och baltiska språk @sv

Venäjänkielisen kirjallisuuden historia ja tutkimus
type: Concept
References: Vironkielisen kirjallisuuden historia ja tutkimus
References: Latviankielisen kirjallisuuden historia ja tutkimus
References: Liettuankielisen kirjallisuuden historia ja tutkimus
type: YKL-luokka
alternative label: Bylinat, tutkimus (86.71)
alternative label: Bylinor, forskning (86.71) @sv
alternative label: Neuvostokirjallisuus, historia (86.71)
alternative label: Ryska, folkdiktsforskning (86.71) @sv
alternative label: Ryska, folkloristik (86.71) @sv
alternative label: Ryska, litteraturhistoria (86.71) @sv
alternative label: Sovjetlitteratur, historia (86.71) @sv
alternative label: Venäjän kieli, folkloristiikka (86.71)
alternative label: Venäjän kieli, kansanrunoudentutkimus (86.71)
alternative label: Venäjän kieli, kirjallisuudenhistoria (86.71)
broader: Slaavilaisten ja balttilaisten kielten kirjallisuuden historia ja tutkimus
in scheme: YKL - Yleisten kirjastojen luokitusjärjestelmä
notation: 86.71
preferred label: History of and research in Russian literature @en
preferred label: Litteraturhistoria och -forskning som rör litteratur på ryska @sv
scope note: Hit också allmänna verk i litteraturhistoria och -forskning som rör Rysslands och Sovjetunionens litteratur @sv
scope note: Tähän myös Venäjän ja Neuvostoliiton kirjallisuuden historian ja tutkimuksen yleisteokset

Ukrainankielisen kirjallisuuden historia ja tutkimus. Valkovenäjänkielisen kirjallisuuden historia ja tutkimus
type: Concept
type: YKL-luokka
broader: Slaavilaisten ja balttilaisten kielten kirjallisuuden historia ja tutkimus
in scheme: YKL - Yleisten kirjastojen luokitusjärjestelmä
narrower: Ukrainankielisen kirjallisuuden historia ja tutkimus.
narrower: Valkovenäjänkielisen kirjallisuuden historia ja tutkimus
notation: 86.72
preferred label: History of and research in Ukrainian literature. History of and research in Byelorussian literature @en
preferred label: Litteraturhistoria och -forskning som rör litteratur på ukrainska eller vitryska @sv

Ukrainankielisen kirjallisuuden historia ja tutkimus.
type: Concept
type: YKL-luokka
alternative label: Ukrainan kieli, kirjallisuudenhistoria (86.721)
alternative label: Ukrainska, litteraturhistoria (86.721) @sv
broader: Ukrainankielisen kirjallisuuden historia ja tutkimus. Valkovenäjänkielisen kirjallisuuden historia ja tutkimus
in scheme: YKL - Yleisten kirjastojen luokitusjärjestelmä
notation: 86.721
preferred label: History of and research in Ukrainian literature @en
preferred label: Litteraturhistoria och -forskning som rör litteratur på ukrainska @sv

Valkovenäjänkielisen kirjallisuuden historia ja tutkimus
type: Concept
type: YKL-luokka
alternative label: Valkovenäjän kieli, kirjallisuudenhistoria (86.722)
alternative label: Vitryska, litteraturhistoria (86.722) @sv
broader: Ukrainankielisen kirjallisuuden historia ja tutkimus. Valkovenäjänkielisen kirjallisuuden historia ja tutkimus
in scheme: YKL - Yleisten kirjastojen luokitusjärjestelmä
notation: 86.722
preferred label: History of and research in Vitryska literature @en
preferred label: Litteraturhistoria och -forskning som rör litteratur på vitryska @sv

Puolankielisen kirjallisuuden historia ja tutkimus
type: Concept
type: YKL-luokka
alternative label: Polska, folkdiktsforskning (86.73) @sv
alternative label: Polska, folkloristik (86.73) @sv
alternative label: Polska, litteraturhistoria (86.73) @sv
alternative label: Puolan kieli, folkloristiikka (86.73)
alternative label: Puolan kieli, kansanrunoudentutkimus (86.73)
alternative label: Puolan kieli, kirjallisuudenhistoria (86.73)
broader: Slaavilaisten ja balttilaisten kielten kirjallisuuden historia ja tutkimus
in scheme: YKL - Yleisten kirjastojen luokitusjärjestelmä
notation: 86.73
preferred label: History of and research in Polish literature @en
preferred label: Litteraturhistoria och -forskning som rör litteratur på polska @sv

Tšekinkielisen kirjallisuuden historia ja tutkimus
type: Concept
type: YKL-luokka
alternative label: Tjeckiska, folkdiktsforskning (86.74) @sv
alternative label: Tjeckiska, folkloristik (86.74) @sv
alternative label: Tjeckiska, litteraturhistoria (86.74) @sv
alternative label: Tšekin kieli, folkloristiikka (86.74)
alternative label: Tšekin kieli, kansanrunoudentutkimus (86.74)
alternative label: Tšekin kieli, kirjallisuudenhistoria (86.74)
broader: Slaavilaisten ja balttilaisten kielten kirjallisuuden historia ja tutkimus
in scheme: YKL - Yleisten kirjastojen luokitusjärjestelmä
notation: 86.74
preferred label: History of and research in Czech literature @en
preferred label: Litteraturhistoria och -forskning som rör litteratur på tjeckiska @sv
scope note: Hit också allmänna verk i litteraturhistoria och -forskning som rör Tjeckoslovakiens litteratur @sv
scope note: Tähän myös Tsekkoslovakian kirjallisuuden historian ja tutkimuksen yleisteokset

Slovakinkielisen kirjallisuuden historia ja tutkimus
type: Concept
type: YKL-luokka
alternative label: Slovakin kieli, folkloristiikka (86.75)
alternative label: Slovakin kieli, kansanrunoudentutkimus (86.75)
alternative label: Slovakin kieli, kirjallisuudenhistoria (86.75)
alternative label: Slovakiska, folkdiktsforskning (86.75) @sv
alternative label: Slovakiska, folkloristik (86.75) @sv
alternative label: Slovakiska, litteraturhistoria (86.75) @sv
broader: Slaavilaisten ja balttilaisten kielten kirjallisuuden historia ja tutkimus
in scheme: YKL - Yleisten kirjastojen luokitusjärjestelmä
notation: 86.75
preferred label: History of and research in Slovak literature @en
preferred label: Litteraturhistoria och -forskning som rör litteratur på slovakiska @sv

Eteläslaavilaisten kielten kirjallisuuden historia ja tutkimus
type: Concept
type: YKL-luokka
alternative label: Serbokroaatin kieli, kirjallisuudenhistoria (86.76+)
alternative label: Serbokroatiska, litteraturhistoria (86.76+) @sv
broader: Slaavilaisten ja balttilaisten kielten kirjallisuuden historia ja tutkimus
in scheme: YKL - Yleisten kirjastojen luokitusjärjestelmä
narrower: Bulgariankielisen kirjallisuuden historia ja tutkimus
narrower: Makedoniankielisen kirjallisuuden historia ja tutkimus
narrower: Sloveeninkielisen kirjallisuuden historia ja tutkimus
narrower: Serbiankielisen kirjallisuuden historia ja tutkimus
narrower: Kroatiankielisen kirjallisuuden historia ja tutkimus
narrower: Bosniankielisen kirjallisuden historia ja tutkimus
notation: 86.76
preferred label: History of and research in literature in South-Slavonic languages @en
preferred label: Litteraturhistoria och -forskning som rör litteratur på sydslaviska språk @sv
scope note: Hit också allmänna verk i litteraturhistoria och -forskning som rör Jugoslaviens litteratur @sv
scope note: Tähän myös Jugoslavian kirjallisuuden historian ja tutkimuksen yleisteokset

Bulgariankielisen kirjallisuuden historia ja tutkimus
type: Concept
type: YKL-luokka
alternative label: Bulgarian kieli, folkloristiikka (86.761)
alternative label: Bulgarian kieli, kansanrunoudentutkimus (86.761)
alternative label: Bulgarian kieli, kirjallisuudenhistoria (86.761)
alternative label: Bulgariska, folkdiktsforskning (86.761) @sv
alternative label: Bulgariska, folkloristik (86.761) @sv
alternative label: Bulgariska, litteraturhistoria (86.761) @sv
broader: Eteläslaavilaisten kielten kirjallisuuden historia ja tutkimus
in scheme: YKL - Yleisten kirjastojen luokitusjärjestelmä
notation: 86.761
preferred label: History of and research in Bulgarian literature @en
preferred label: Litteraturhistoria och -forskning som rör litteratur på bulgariska @sv

Makedoniankielisen kirjallisuuden historia ja tutkimus
type: Concept
type: YKL-luokka
alternative label: Makedonian kieli, folkloristiikka (86.762)
alternative label: Makedonian kieli, kansanrunoudentutkimus (86.762)
alternative label: Makedonian kieli, kirjallisuudenhistoria (86.762)
alternative label: Makedoniska, litteraturhistoria (86.762) @sv
alternative label: Makedonska, folkdiktsforskning (86.762) @sv
alternative label: Makedonska, folkloristik (86.762) @sv
broader: Eteläslaavilaisten kielten kirjallisuuden historia ja tutkimus
in scheme: YKL - Yleisten kirjastojen luokitusjärjestelmä
notation: 86.762
preferred label: History of and research in Macedonian literature @en
preferred label: Litteraturhistoria och -forskning som rör litteratur på makedonska @sv

Sloveeninkielisen kirjallisuuden historia ja tutkimus
type: Concept
type: YKL-luokka
alternative label: Sloveenin kieli, folkloristiikka (86.763)
alternative label: Sloveenin kieli, kansanrunoudentutkimus (86.763)
alternative label: Sloveenin kieli, kirjallisuudenhistoria (86.763)
alternative label: Slovenska, folkdiktsforskning (86.763) @sv
alternative label: Slovenska, folkloristik (86.763) @sv
alternative label: Slovenska, litteraturhistoria (86.763) @sv
broader: Eteläslaavilaisten kielten kirjallisuuden historia ja tutkimus
in scheme: YKL - Yleisten kirjastojen luokitusjärjestelmä
notation: 86.763
preferred label: History of and research in Slovenian literature @en
preferred label: Litteraturhistoria och -forskning som rör litteratur på slovenska @sv

Serbiankielisen kirjallisuuden historia ja tutkimus
type: Concept
type: YKL-luokka
alternative label: Serbian kieli, folkloristiikka (86.764)
alternative label: Serbian kieli, kansanrunoudentutkimus (86.764)
alternative label: Serbian kieli, kirjallisuudenhistoria (86.764)
alternative label: Serbiska, folkdiktsforskning (86.764) @sv
alternative label: Serbiska, folkloristik (86.764) @sv
alternative label: Serbiska, litteraturhistoria (86.764) @sv
broader: Eteläslaavilaisten kielten kirjallisuuden historia ja tutkimus
in scheme: YKL - Yleisten kirjastojen luokitusjärjestelmä
notation: 86.764
preferred label: History of and research in Serbian literature @en
preferred label: Litteraturhistoria och -forskning som rör litteratur på serbiska @sv

Kroatiankielisen kirjallisuuden historia ja tutkimus
type: Concept
type: YKL-luokka
alternative label: Kroaatin kieli, folkloristiikka (86.765)
alternative label: Kroaatin kieli, kansanrunoudentutkimus (86.765)
alternative label: Kroaatin kieli, kirjallisuudenhistoria (86.765)
alternative label: Kroatian kieli, folkloristiikka (86.765)
alternative label: Kroatian kieli, kansanrunoudentutkimus (86.765)
alternative label: Kroatian kieli, kirjallisuudenhistoria (86.765)
alternative label: Kroatiska, folkdiktsforskning (86.765) @sv
alternative label: Kroatiska, folkloristik (86.765) @sv
alternative label: Kroatiska, litteraturhistoria (86.765) @sv
broader: Eteläslaavilaisten kielten kirjallisuuden historia ja tutkimus
in scheme: YKL - Yleisten kirjastojen luokitusjärjestelmä
notation: 86.765
preferred label: History of and research in Croatian literature @en
preferred label: Litteraturhistoria och -forskning som rör litteratur på kroatiska @sv

Bosniankielisen kirjallisuden historia ja tutkimus
type: Concept
type: YKL-luokka
alternative label: Bosnian kieli, folkloristiikka (86.766)
alternative label: Bosnian kieli, kansanrunoudentutkimus (86.766)
alternative label: Bosnian kieli, kirjallisuudenhistoria (86.766)
alternative label: Bosniska, folkdiktsforskning (86.766) @sv
alternative label: Bosniska, folkloristik (86.766) @sv
alternative label: Bosniska, litteraturhistoria (86.766) @sv
broader: Eteläslaavilaisten kielten kirjallisuuden historia ja tutkimus
in scheme: YKL - Yleisten kirjastojen luokitusjärjestelmä
notation: 86.766
preferred label: History of and research in Bosnian literature @en
preferred label: Litteraturhistoria och -forskning som rör litteratur på bosniska @sv

Balttilaisten kielten kirjallisuuden historia ja tutkimus
type: Concept
type: YKL-luokka
alternative label: Baltiska språk, litteraturhistoria (86.78+) @sv
alternative label: Balttilaiset kielet, kirjallisuudenhistoria (86.78+)
broader: Slaavilaisten ja balttilaisten kielten kirjallisuuden historia ja tutkimus
in scheme: YKL - Yleisten kirjastojen luokitusjärjestelmä
narrower: Latviankielisen kirjallisuuden historia ja tutkimus
narrower: Liettuankielisen kirjallisuuden historia ja tutkimus
notation: 86.78
preferred label: History of and research in literature in the Baltic languages @en
preferred label: Litteraturhistoria och -forskning som rör litteratur på baltiska språk @sv

Latviankielisen kirjallisuuden historia ja tutkimus
type: Concept
type: YKL-luokka
alternative label: Latvian kieli, folkloristiikka (86.781)
alternative label: Latvian kieli, kansanrunoudentutkimus (86.781)
alternative label: Latvian kieli, kirjallisuudenhistoria (86.781)
alternative label: Lettiska, folkdiktsforskning (86.781) @sv
alternative label: Lettiska, folkloristik (86.781) @sv
alternative label: Lettiska, litteraturhistoria (86.781) @sv
alternative label: Lätin kieli, kirjallisuudenhistoria (86.781)
broader: Balttilaisten kielten kirjallisuuden historia ja tutkimus
in scheme: YKL - Yleisten kirjastojen luokitusjärjestelmä
notation: 86.781
preferred label: History of and research in Latvian literature @en
preferred label: Litteraturhistoria och -forskning som rör litteratur på lettiska @sv

Liettuankielisen kirjallisuuden historia ja tutkimus
type: Concept
type: YKL-luokka
alternative label: Liettuan kieli, folkloristiikka (86.782)
alternative label: Liettuan kieli, kansanrunoudentutkimus (86.782)
alternative label: Liettuan kieli, kirjallisuudenhistoria (86.782)
alternative label: Litauiska, folkdiktsforskning (86.782) @sv
alternative label: Litauiska, folkloristik (86.782) @sv
alternative label: Litauiska, litteraturhistoria (86.782) @sv
broader: Balttilaisten kielten kirjallisuuden historia ja tutkimus
in scheme: YKL - Yleisten kirjastojen luokitusjärjestelmä
notation: 86.782
preferred label: History of and research in Lithuanian literature @en
preferred label: Litteraturhistoria och -forskning som rör litteratur på litauiska @sv

Muiden indoeurooppalaisten kielten kirjallisuuden historia ja tutkimus
type: Concept
type: YKL-luokka
alternative label: Armenian kieli, kirjallisuudenhistoria (86.8)
alternative label: Armeniska, litteraturhistoria (86.8) @sv
alternative label: Biografier, författare (86.2 ... 86.9+) @sv
alternative label: Biografier, författare, forskning (86.2 ... 86.9+) @sv
alternative label: Bloggar, författare (86.2 ... 86.9+) @sv
alternative label: Blogit, kirjailijat (86.2 ... 86.9+)
alternative label: Brev, författare (86.2 ... 86.9+) @sv
alternative label: Brevsamlingar, författare (86.2 ... 86.9+) @sv
alternative label: Brevväxling, författare (86.2 ... 86.9+) @sv
alternative label: Dagböcker, författare (86.2 ... 86.9+) @sv
alternative label: Dagböcker, författare, forskning (86.2 ... 86.9+) @sv
alternative label: Elämäkerrat, kirjailijat (86.2 ... 86.9+)
alternative label: Elämäkerrat, kirjailijat, tutkimus (86.2 ... 86.9+)
alternative label: Elämäkertatutkimus, kirjailijat (86.2 ... 86.9+)
alternative label: Författare, biografier och memoarer (86.2 ... 86.9+) @sv
alternative label: Henkilöhistoria, kirjailijat (86.2 ... 86.9+)
alternative label: Kirjailijat, elämäkerrat ja muistelmat (86.2 ... 86.9+)
alternative label: Kirjallisuudenhistoria, kielittäin ja maittain (86.2 ... 86.9+)
alternative label: Kirjallisuudentutkimus, kielittäin ja maittain (86.2 ... 86.9+)
alternative label: Kirjallisuustiede, kielittäin ja maittain (86.2 ... 86.9+)
alternative label: Kirjeenvaihto, kirjailijat (86.2 ... 86.9+)
alternative label: Kirjeet, kirjailijat (86.2 ... 86.9+)
alternative label: Kirjekokoelmat, kirjailijat (86.2 ... 86.9+)
alternative label: Komediat, näytelmäkirjallisuuden historia (86.1 ... 86.9+)
alternative label: Komedier, dramatikens historia (86.1 ... 86.9+) @sv
alternative label: Litteraturforskning, språkvis och landsvis (86.2 ... 86.9+) @sv
alternative label: Litteraturhistoria, språkvis och landsvis (86.2 ... 86.9+) @sv
alternative label: Litteraturvetenskap, språkvis och landsvis (86.2 ... 86.9+) @sv
alternative label: Livshistorieforskning, författare (86.2 ... 86.9+) @sv
alternative label: Memoarer, författare (86.2 ... 86.9+) @sv
alternative label: Memoarer, författare, forskning (86.2 ... 86.9+) @sv
alternative label: Muistelmat, kirjailijat (86.2 ... 86.9+)
alternative label: Muistelmat, kirjailijat, tutkimus (86.2 ... 86.9+)
alternative label: Nettipäiväkirjat, kirjailijat (86.2 ... 86.9+)
alternative label: Nätdagböcker, författare (86.2 ... 86.9+) @sv
alternative label: Omaelämäkerrat, kirjailijat (86.2 ... 86.9+)
alternative label: Personhistoria, författare (86.2 ... 86.9+) @sv
alternative label: Päiväkirjat, kirjailijat (86.2 ... 86.9+)
alternative label: Päiväkirjat, kirjailijat, tutkimus (86.2 ... 86.9+)
alternative label: Självbiografier, författare (86.2 ... 86.9+) @sv
alternative label: Verkkopäiväkirjat, kirjailijat (86.2 ... 86.9+)
alternative label: Web-log, kirjailijat (86.2 ... 86.9+)
alternative label: Webbjournaler, författare (86.2 ... 86.9+) @sv
alternative label: Webbloggar, författare (86.2 ... 86.9+) @sv
broader: KIRJALLISUUSTIEDE
in scheme: YKL - Yleisten kirjastojen luokitusjärjestelmä
narrower: Nykykreikankielisen kirjallisuuden historia ja tutkimus
narrower: Indoiraanisten kielten kirjallisuuden historia ja tutkimus
narrower: Albaniankielisen kirjallisuuden historia ja tutkimus
narrower: Kelttiläisten kielten kirjallisuuden historia ja tutkimus
notation: 86.8
preferred label: History of and research in literature in other Indo-European languages @en
preferred label: Litteraturhistoria och -forskning som rör litteratur på övriga indoeuropeiska språk @sv

Nykykreikankielisen kirjallisuuden historia ja tutkimus
type: Concept
References: Vanhan ja keskiajan kirjallisuus, Eurooppa
type: YKL-luokka
alternative label: Grekiska, nygrekiska, folkdiktsforskning (86.82) @sv
alternative label: Grekiska, nygrekiska, folkloristik (86.82) @sv
alternative label: Grekiska, nygrekiska, litteraturhistoria (86.82) @sv
alternative label: Kreikan kieli, nykykreikka, folkloristiikka (86.82)
alternative label: Kreikan kieli, nykykreikka, kansanrunoudentutkimus (86.82)
alternative label: Kreikan kieli, nykykreikka, kirjallisuudenhistoria (86.82)
alternative label: Nygrekiska, litteraturhistoria (86.82) @sv
alternative label: Nykykreikan kieli, kirjallisuudenhistoria (86.82)
broader: Muiden indoeurooppalaisten kielten kirjallisuuden historia ja tutkimus
in scheme: YKL - Yleisten kirjastojen luokitusjärjestelmä
notation: 86.82
preferred label: History of and research in literature in Modern Greek @en
preferred label: Litteraturhistoria och -forskning som rör litteratur på nygrekiska @sv
scope note: Hit också verk i litteraturhistoria och -forskning som rör både ny- och forngrekisk litteratur @sv
scope note: Tähän myös teokset, jotka koskevat sekä nyky- että muinaiskreikankielisen kirjallisuuden historiaa tai tutkimusta

Indoiraanisten kielten kirjallisuuden historia ja tutkimus
type: Concept
References: Englanninkielisen kirjallisuuden historia ja tutkimus
type: YKL-luokka
alternative label: Afgaanin kieli, kirjallisuudenhistoria (86.83)
alternative label: Afghanska, litteraturhistoria (86.83) @sv
alternative label: Beluchi, litteraturhistoria (86.83) @sv
alternative label: Belutsin kieli, kirjallisuudenhistoria (86.83)
alternative label: Bengalin kieli, kirjallisuudenhistoria (86.83)
alternative label: Bengaliska, litteraturhistoria (86.83) @sv
alternative label: Bihari, litteraturhistoria (86.83) @sv
alternative label: Biharin kieli, kirjallisuudenhistoria (86.83)
alternative label: Gudzaratin kieli, kirjallisuudenhistoria (86.83)
alternative label: Gujarati, litteraturhistoria (86.83) @sv
alternative label: Gujaratin kieli, kirjallisuudenhistoria (86.83)
alternative label: Gurage, språket, litteraturhistoria (86.83) @sv
alternative label: Guragen kieli, kirjallisuudenhistoria (86.83)
alternative label: Hindi, litteraturhistoria (86.83) @sv
alternative label: Hindin kieli, kirjallisuudenhistoria (86.83)
alternative label: Indiska språk, litteraturhistoria (86.83) @sv
alternative label: Indoiraaniset kielet, kirjallisuudenhistoria (86.83+)
alternative label: Indoiranska språk, litteraturhistoria (86.83+) @sv
alternative label: Intialaiset kielet, kirjallisuudenhistoria (86.83)
alternative label: Iranilaiset kielet, kirjallisuudenhistoria (86.83+)
alternative label: Iranska språk, litteraturhistoria (86.83+) @sv
alternative label: Jaghnob, språket, litteraturhistoria (86.83) @sv
alternative label: Jagnobin kieli, kirjallisuudenhistoria (86.83)
alternative label: Kashmiriska, litteraturhistoria (86.83) @sv
alternative label: Kasmirin kieli, kirjallisuudenhistoria (86.83)
alternative label: Kurmandžin kieli, kirjallisuudenhistoria (86.83)
alternative label: Kurmanji, litteraturhistoria (86.83) @sv
alternative label: Marathi, språket, litteraturhistoria (86.83) @sv
alternative label: Marathin kieli, kirjallisuudenhistoria (86.83)
alternative label: Nepali, litteraturhistoria (86.83) @sv
alternative label: Nepalin kieli, kirjallisuudenhistoria (86.83)
alternative label: Orijan kieli, kirjallisuudenhistoria (86.83)
alternative label: Oriya, språket, litteraturhistoria (86.83) @sv
alternative label: Osseetin kieli, kirjallisuudenhistoria (86.83)
alternative label: Ossetiska, litteraturhistoria (86.83) @sv
alternative label: Pali, språket, litteraturhistoria (86.83) @sv
alternative label: Palin kieli, kirjallisuudenhistoria (86.83)
alternative label: Pandzabin kieli, kirjallisuudenhistoria (86.83)
alternative label: Panjabi, litteraturhistoria (86.83) @sv
alternative label: Pashto, litteraturhistoria (86.83) @sv
alternative label: Pashtun kieli, kirjallisuudenhistoria (86.83)
alternative label: Pashtunska, litteraturhistoria (86.83) @sv
alternative label: Paštun kieli, kirjallisuudenhistoria (86.83)
alternative label: Prakrit, litteraturhistoria (86.83) @sv
alternative label: Prakritin kieli, kirjallisuudenhistoria (86.83)
alternative label: Punjabi, litteraturhistoria (86.83) @sv
alternative label: Punjabin kieli, kirjallisuudenhistoria (86.83)
alternative label: Radzastanin kieli, kirjallisuudenhistoria (86.83)
alternative label: Rajasthani, litteraturhistoria (86.83) @sv
alternative label: Rajasthanin kieli, kirjallisuudenhistoria (86.83)
alternative label: Romani, litteraturhistoria (86.83) @sv
alternative label: Romanikieli, kirjallisuudenhistoria (86.83)
alternative label: Romanin kieli, kirjallisuudenhistoria (86.83)
alternative label: Romanispråk, litteraturhistoria (86.83) @sv
alternative label: Sanskrit, litteraturhistoria (86.83) @sv
alternative label: Sanskritin kieli, kirjallisuudenhistoria (86.83)
alternative label: Singalesiska, litteraturhistoria (86.83) @sv
alternative label: Singalin kieli, kirjallisuudenhistoria (86.83)
alternative label: Sorani, kirjallisuudenhistoria (86.83)
alternative label: Soranin kieli, kirjallisuudenhistoria (86.83)
alternative label: Tadzikin kieli, kirjallisuudenhistoria (86.83)
alternative label: Tadzjikiska, litteraturhistoria (86.83) @sv
alternative label: Urdu, språket, litteraturhistoria (86.83) @sv
alternative label: Urdun kieli, kirjallisuudenhistoria (86.83)
broader: Muiden indoeurooppalaisten kielten kirjallisuuden historia ja tutkimus
in scheme: YKL - Yleisten kirjastojen luokitusjärjestelmä
narrower: Persiankielisen kirjallisuuden historia ja tutkimus
narrower: Kurdinkielisen kirjallisuuden historia ja tutkimus
notation: 86.83
preferred label: History of and research in literature in Indo-Iranian languages @en
preferred label: Litteraturhistoria och -forskning som rör litteratur på indoiranska språk @sv
scope note: Intialaisten ja iranilaisten kielten kirjallisuuden historia ja tutkimus. Tähän myös Intian kirjallisuuden historian ja tutkimuksen yleisteokset
scope note: Litteraturhistoria och -forskning som rör litteratur på indiska och iranska språk. Hit också allmänna verk i litteraturhistoria och -forskning som rör Indiens litteratur @sv

Persiankielisen kirjallisuuden historia ja tutkimus
type: Concept
type: YKL-luokka
alternative label: Farsi, litteraturhistoria (86.831) @sv
alternative label: Farsin kieli, kirjallisuudenhistoria (86.831)
alternative label: Pehlevi, språket, litteraturhistoria (86.831) @sv
alternative label: Pehlevin kieli, kirjallisuudenhistoria (86.831)
alternative label: Persian kieli, folkloristiikka (86.831)
alternative label: Persian kieli, kansanrunoudentutkimus (86.831)
alternative label: Persian kieli, kirjallisuudenhistoria (86.831)
alternative label: Persiska, folkdiktsforskning (86.831) @sv
alternative label: Persiska, folkloristik (86.831) @sv
alternative label: Persiska, litteraturhistoria (86.831) @sv
broader: Indoiraanisten kielten kirjallisuuden historia ja tutkimus
in scheme: YKL - Yleisten kirjastojen luokitusjärjestelmä
narrower: Darinkielisen kirjallisuuden historia ja tutkimus
notation: 86.831
preferred label: History of and research in Persian literature @en
preferred label: Litteraturhistoria och -forskning som rör litteratur på persiska @sv

Darinkielisen kirjallisuuden historia ja tutkimus
type: Concept
type: YKL-luokka
alternative label: Dari, folkdiktsforskning (86.8311) @sv
alternative label: Dari, folkloristik (86.8311) @sv
alternative label: Dari, litteraturhistoria (86.8311) @sv
alternative label: Darin kieli, folkloristiikka (86.8311)
alternative label: Darin kieli, kansanrunoudentutkimus (86.8311)
alternative label: Darin kieli, kirjallisuudenhistoria (86.8311)
broader: Persiankielisen kirjallisuuden historia ja tutkimus
in scheme: YKL - Yleisten kirjastojen luokitusjärjestelmä
notation: 86.8311
preferred label: History of and research in Dari language literature @en
preferred label: Litteraturhistoria och -forskning som rör litteratur på dari @sv

Kurdinkielisen kirjallisuuden historia ja tutkimus
type: Concept
type: YKL-luokka
alternative label: Kurdin kieli, folkloristiikka (86.832)
alternative label: Kurdin kieli, kansanrunoudentutkimus (86.832)
alternative label: Kurdin kieli, kirjallisuudenhistoria (86.832)
alternative label: Kurdiska, folkdiktsforskning (86.832) @sv
alternative label: Kurdiska, folkloristik (86.832) @sv
alternative label: Kurdiska, litteraturhistoria (86.832) @sv
broader: Indoiraanisten kielten kirjallisuuden historia ja tutkimus
in scheme: YKL - Yleisten kirjastojen luokitusjärjestelmä
notation: 86.832
preferred label: History of and research in Kurdish literature @en
preferred label: Litteraturhistoria och -forskning som rör litteratur på kurdiska @sv

Albaniankielisen kirjallisuuden historia ja tutkimus
type: Concept
type: YKL-luokka
alternative label: Albanian kieli, folkloristiikka (86.84)
alternative label: Albanian kieli, kansanrunoudentutkimus (86.84)
alternative label: Albanian kieli, kirjallisuudenhistoria (86.84)
alternative label: Albanska, folkdiktsforskning (86.84) @sv
alternative label: Albanska, folkloristik (86.84) @sv
alternative label: Albanska, litteraturhistoria (86.84) @sv
broader: Muiden indoeurooppalaisten kielten kirjallisuuden historia ja tutkimus
in scheme: YKL - Yleisten kirjastojen luokitusjärjestelmä
notation: 86.84
preferred label: History of and research in Albanian literature @en
preferred label: Litteraturhistoria och -forskning som rör litteratur på albanska @sv

Kelttiläisten kielten kirjallisuuden historia ja tutkimus
type: Concept
type: YKL-luokka
alternative label: Bretonin kieli, kirjallisuudenhistoria (86.88)
alternative label: Bretonska, litteraturhistoria (86.88) @sv
alternative label: Gaelin kieli, kirjallisuudenhistoria (86.88)
alternative label: Gaeliska, litteraturhistoria (86.88) @sv
alternative label: Iirin kieli, kirjallisuudenhistoria (86.88)
alternative label: Iriska, litteraturhistoria (86.88) @sv
alternative label: Keltiska språk, litteraturhistoria (86.88) @sv
alternative label: Kelttiläiset kielet, kirjallisuudenhistoria (86.88)
alternative label: Kymrin kieli, kirjallisuudenhistoria (86.88)
alternative label: Kymriska, litteraturhistoria (86.88) @sv
alternative label: Manx, litteraturhistoria (86.88) @sv
alternative label: Manxin kieli, kirjallisuudenhistoria (86.88)
alternative label: Walesin kieli, kirjallisuudenhistoria (86.88)
alternative label: Walesiska, litteraturhistoria (86.88) @sv
broader: Muiden indoeurooppalaisten kielten kirjallisuuden historia ja tutkimus
in scheme: YKL - Yleisten kirjastojen luokitusjärjestelmä
notation: 86.88
preferred label: History of and research in literature in Celtic languages @en
preferred label: Litteraturhistoria och -forskning som rör litteratur på keltiska språk @sv

Muiden kielten kirjallisuuden historia ja tutkimus
type: Concept
type: YKL-luokka
alternative label: Altailaiset kielet, kirjallisuudenhistoria (86.9 ... 86.91)
alternative label: Altaiska språk, litteraturhistoria (86.9 ... 86.91) @sv
alternative label: Biografier, författare (86.2 ... 86.9+) @sv
alternative label: Biografier, författare, forskning (86.2 ... 86.9+) @sv
alternative label: Bloggar, författare (86.2 ... 86.9+) @sv
alternative label: Blogit, kirjailijat (86.2 ... 86.9+)
alternative label: Brev, författare (86.2 ... 86.9+) @sv
alternative label: Brevsamlingar, författare (86.2 ... 86.9+) @sv
alternative label: Brevväxling, författare (86.2 ... 86.9+) @sv
alternative label: Burjaatin kieli, kirjallisuudenhistoria (86.9)
alternative label: Burjatiska, litteraturhistoria (86.9) @sv
alternative label: Dagböcker, författare (86.2 ... 86.9+) @sv
alternative label: Dagböcker, författare, forskning (86.2 ... 86.9+) @sv
alternative label: Daguriska, litteraturhistoria (86.9) @sv
alternative label: Dahurin kieli, kirjallisuudenhistoria (86.9)
alternative label: Elämäkerrat, kirjailijat (86.2 ... 86.9+)
alternative label: Elämäkerrat, kirjailijat, tutkimus (86.2 ... 86.9+)
alternative label: Elämäkertatutkimus, kirjailijat (86.2 ... 86.9+)
alternative label: Författare, biografier och memoarer (86.2 ... 86.9+) @sv
alternative label: Henkilöhistoria, kirjailijat (86.2 ... 86.9+)
alternative label: Kalmuckiska, litteraturhistoria (86.9) @sv
alternative label: Kalmukin kieli, kirjallisuudenhistoria (86.9)
alternative label: Kirjailijat, elämäkerrat ja muistelmat (86.2 ... 86.9+)
alternative label: Kirjallisuudenhistoria, kielittäin ja maittain (86.2 ... 86.9+)
alternative label: Kirjallisuudentutkimus, kielittäin ja maittain (86.2 ... 86.9+)
alternative label: Kirjallisuustiede, kielittäin ja maittain (86.2 ... 86.9+)
alternative label: Kirjeenvaihto, kirjailijat (86.2 ... 86.9+)
alternative label: Kirjeet, kirjailijat (86.2 ... 86.9+)
alternative label: Kirjekokoelmat, kirjailijat (86.2 ... 86.9+)
alternative label: Komediat, näytelmäkirjallisuuden historia (86.1 ... 86.9+)
alternative label: Komedier, dramatikens historia (86.1 ... 86.9+) @sv
alternative label: Litteraturforskning, språkvis och landsvis (86.2 ... 86.9+) @sv
alternative label: Litteraturhistoria, språkvis och landsvis (86.2 ... 86.9+) @sv
alternative label: Litteraturvetenskap, språkvis och landsvis (86.2 ... 86.9+) @sv
alternative label: Livshistorieforskning, författare (86.2 ... 86.9+) @sv
alternative label: Memoarer, författare (86.2 ... 86.9+) @sv
alternative label: Memoarer, författare, forskning (86.2 ... 86.9+) @sv
alternative label: Muistelmat, kirjailijat (86.2 ... 86.9+)
alternative label: Muistelmat, kirjailijat, tutkimus (86.2 ... 86.9+)
alternative label: Nettipäiväkirjat, kirjailijat (86.2 ... 86.9+)
alternative label: Nätdagböcker, författare (86.2 ... 86.9+) @sv
alternative label: Oiraattin kieli, kirjallisuudenhistoria (86.9)
alternative label: Oiratiska, litteraturhistoria (86.9) @sv
alternative label: Omaelämäkerrat, kirjailijat (86.2 ... 86.9+)
alternative label: Personhistoria, författare (86.2 ... 86.9+) @sv
alternative label: Päiväkirjat, kirjailijat (86.2 ... 86.9+)
alternative label: Päiväkirjat, kirjailijat, tutkimus (86.2 ... 86.9+)
alternative label: Självbiografier, författare (86.2 ... 86.9+) @sv
alternative label: Tagalog, kirjallisuudenhistoria (86.9)
alternative label: Tagalog, litteraturhistoria (86.9) @sv
alternative label: Verkkopäiväkirjat, kirjailijat (86.2 ... 86.9+)
alternative label: Web-log, kirjailijat (86.2 ... 86.9+)
alternative label: Webbjournaler, författare (86.2 ... 86.9+) @sv
alternative label: Webbloggar, författare (86.2 ... 86.9+) @sv
broader: KIRJALLISUUSTIEDE
in scheme: YKL - Yleisten kirjastojen luokitusjärjestelmä
narrower: Turkkilaisten kielten kirjallisuuden historia ja tutkimus
narrower: Seemiläisten kielten kirjallisuuden historia ja tutkimus
narrower: Afroaasialaisten kielten kirjallisuuden historia ja tutkimus. Somalinkielisen kirjallisuuden historia ja tutkimus
narrower: Tiibetiläis-burmalaisten kielten kirjallisuuden historia ja tutkimus
narrower: Japanin- ja koreankielisen kirjallisuuden historia ja tutkimus
narrower: Afrikkalaisten kielten kirjallisuuden historia ja tutkimus
narrower: Eskimo- ja intiaanikielten kirjallisuuden historia ja tutkimus
narrower: Muiden ei-indoeurooppalaisten kielten kirjallisuuden historia ja tutkimus
notation: 86.9
preferred label: History of and research in literature in other languages @en
preferred label: Litteraturhistoria och -forskning som rör litteratur på övriga språk @sv

Turkkilaisten kielten kirjallisuuden historia ja tutkimus
type: Concept
type: YKL-luokka
alternative label: Azerbajdzjanska, litteraturhistoria (86.91) @sv
alternative label: Azerin kieli, kirjallisuudenhistoria (86.91)
alternative label: Basjkiriska, litteraturhistoria (86.91) @sv
alternative label: Baskiirin kieli, kirjallisuudenhistoria (86.91)
alternative label: Gagauzin kieli, kirjallisuudenhistoria (86.91)
alternative label: Gagauziska, litteraturhistoria (86.91) @sv
alternative label: Jakutiska, litteraturhistoria (86.91) @sv
alternative label: Jakuutin kieli, kirjallisuudenhistoria (86.91)
alternative label: Kasakin kieli, kirjallisuudenhistoria (86.91)
alternative label: Kazakin kieli, kirjallisuudenhistoria (86.91)
alternative label: Kazakiska, litteraturhistoria (86.91) @sv
alternative label: Kirgiisin kieli, kirjallisuudenhistoria (86.91)
alternative label: Kirgisiska, litteraturhistoria (86.91) @sv
alternative label: Tataarikielet, kirjallisuudenhistoria (86.91)
alternative label: Tatarspråk, litteraturhistoria (86.91) @sv
alternative label: Tjuvasjiska, litteraturhistoria (86.91) @sv
alternative label: Tsuvassin kieli, kirjallisuudenhistoria (86.91)
alternative label: Turkin kieli, folkloristiikka (86.91)
alternative label: Turkin kieli, kansanrunoudentutkimus (86.91)
alternative label: Turkin kieli, kirjallisuudenhistoria (86.91)
alternative label: Turkiska språk, litteraturhistoria (86.91) @sv
alternative label: Turkiska, folkdiktsforskning (86.91) @sv
alternative label: Turkiska, folkloristik (86.91) @sv
alternative label: Turkiska, litteraturhistoria (86.91) @sv
alternative label: Turkkilaiset kielet, kirjallisuudenhistoria (86.91)
alternative label: Turkmeenin kieli, kirjallisuudenhistoria (86.91)
alternative label: Turkmeniska, litteraturhistoria (86.91) @sv
alternative label: Uiguriska, litteraturhistoria (86.91) @sv
alternative label: Uiguurin kieli, kirjallisuudenhistoria (86.91)
alternative label: Uzbekin kieli, kirjallisuudenhistoria (86.91)
alternative label: Uzbekiska, litteraturhistoria (86.91) @sv
broader: Muiden kielten kirjallisuuden historia ja tutkimus
in scheme: YKL - Yleisten kirjastojen luokitusjärjestelmä
notation: 86.91
preferred label: History of and research in literature inTurkic languages @en
preferred label: Litteraturhistoria och -forskning som rör litteratur på turkiska spåk @sv
scope note: Litteraturhistoria och -forskning som rör litteratur på turkiska språk @sv
scope note: Turkkilaisten kielten kirjallisuuden historia ja tutkimus

Seemiläisten kielten kirjallisuuden historia ja tutkimus
type: Concept
type: YKL-luokka
alternative label: Akkadin kieli, kirjallisuudenhistoria (86.92)
alternative label: Akkadiska, litteraturhistoria (86.92) @sv
alternative label: Amharan kieli, kirjallisuudenhistoria (86.92)
alternative label: Amhariska, litteraturhistoria (86.92) @sv
alternative label: Aramean kieli, kirjallisuudenhistoria (86.92)
alternative label: Arameiska, litteraturhistoria (86.92) @sv
alternative label: Assyrialais-babylonialaiset kielet, kirjallisuudenhistoria (86.92)
alternative label: Assyrisk-babyloniska språk, litteraturhistoria (86.92) @sv
alternative label: Feniciska, litteraturhistoria (86.92) @sv
alternative label: Foinikian kieli, kirjallisuudenhistoria (86.92)
alternative label: Gilgames, tutkimus (86.92)
alternative label: Gilgamesh, forskning (86.92) @sv
alternative label: Harari, litteraturhistoria (86.92) @sv
alternative label: Hararin kieli, kirjallisuudenhistoria (86.92)
alternative label: Maltan kieli, kirjallisuudenhistoria (86.92)
alternative label: Maltesiska, litteraturhistoria (86.92) @sv
alternative label: Seemiläiset kielet, kirjallisuudenhistoria (86.92+)
alternative label: Semitiska språk, litteraturhistoria (86.92+) @sv
alternative label: Syriska, litteraturhistoria (86.92) @sv
alternative label: Syyrian kieli, kirjallisuudenhistoria (86.92)
alternative label: Tigre, språket, litteraturhistoria (86.92) @sv
alternative label: Tigren kieli, kirjallisuudenhistoria (86.92)
alternative label: Tigrinja, språket, litteraturhistoria (86.92) @sv
alternative label: Tigrinjan kieli, kirjallisuudenhistoria (86.92)
broader: Muiden kielten kirjallisuuden historia ja tutkimus
in scheme: YKL - Yleisten kirjastojen luokitusjärjestelmä
narrower: Hepreankielisen kirjallisuuden historia ja tutkimus
narrower: Arabiankielisen kirjallisuuden historia ja tutkimus
notation: 86.92
preferred label: History of and research in literature in Semitic languages @en
preferred label: Litteraturhistoria och -forskning som rör litteratur på semitiska språk @sv

Hepreankielisen kirjallisuuden historia ja tutkimus
type: Concept
type: YKL-luokka
alternative label: Hebreiska, folkdiktsforskning (86.922) @sv
alternative label: Hebreiska, folkloristik (86.922) @sv
alternative label: Hebreiska, litteraturhistoria (86.922) @sv
alternative label: Heprean kieli, folkloristiikka (86.922)
alternative label: Heprean kieli, kansanrunoudentutkimus (86.922)
alternative label: Heprean kieli, kirjallisuudenhistoria (86.922)
broader: Seemiläisten kielten kirjallisuuden historia ja tutkimus
in scheme: YKL - Yleisten kirjastojen luokitusjärjestelmä
notation: 86.922
preferred label: History of and research in Hebrew literature @en
preferred label: Litteraturhistoria och -forskning som rör litteratur på hebreiska @sv

Arabiankielisen kirjallisuuden historia ja tutkimus
type: Concept
type: YKL-luokka
alternative label: Arabian kieli, folkloristiikka (86.923)
alternative label: Arabian kieli, kansanrunoudentutkimus (86.923)
alternative label: Arabian kieli, kirjallisuudenhistoria (86.923)
alternative label: Arabiska, folkdiktsforskning (86.923) @sv
alternative label: Arabiska, folkloristik (86.923) @sv
alternative label: Arabiska, litteraturhistoria (86.923) @sv
alternative label: Tuhat ja yksi yötä, tutkimus (86.923)
alternative label: Tusen och en natt, forskning (86.923) @sv
broader: Seemiläisten kielten kirjallisuuden historia ja tutkimus
in scheme: YKL - Yleisten kirjastojen luokitusjärjestelmä
notation: 86.923
preferred label: History of and research in Arabic literature @en
preferred label: Litteraturhistoria och -forskning som rör litteratur på arabiska @sv

Afroaasialaisten kielten kirjallisuuden historia ja tutkimus. Somalinkielisen kirjallisuuden historia ja tutkimus
type: Concept
type: YKL-luokka
alternative label: Afroaasialaiset kielet, kirjallisuudenhistoria (86.93)
alternative label: Afroasiatiska språk, litteraturhistoria (86.93) @sv
alternative label: Avestan kieli, kirjallisudenhistoria (86.93)
alternative label: Avestas språk, litteraturhistoria (86.93) @sv
alternative label: Berberikielet, kirjallisuudenhistoria (86.93)
alternative label: Berberspråk, litteraturhistoria (86.93) @sv
alternative label: Egyptin kieli, muinainen, kirjallisuudenhistoria (86.93)
alternative label: Egyptiska, fornegyptiska, litteraturhistoria (86.93) @sv
alternative label: Hausa, litteraturhistoria (86.93) @sv
alternative label: Hausan kieli, kirjallisuudenhistori (86.93)
alternative label: Koptin kieli, kirjallisuudenhistoria (86.93)
alternative label: Koptiska, litteraturhistoria (86.93) @sv
alternative label: Kushitiska språk, litteraturhistoria (86.93) @sv
alternative label: Kusiittikielet, kirjallisuudenhistoria (86.93)
alternative label: Kuusilaiset kielet, kirjallisuudenhistoria (86.93)
alternative label: Somalin kieli, folkloristiikka (86.93)
alternative label: Somalin kieli, kansanrunoudentutkimus (86.93)
alternative label: Somalin kieli, kirjallisuudenhistoria (86.93)
alternative label: Somaliska, folkdiktsforskning (86.93) @sv
alternative label: Somaliska, folkloristik (86.93) @sv
alternative label: Somaliska, litteraturhistoria (86.93) @sv
broader: Muiden kielten kirjallisuuden historia ja tutkimus
in scheme: YKL - Yleisten kirjastojen luokitusjärjestelmä
notation: 86.93
preferred label: History of and research in literature in Afroasiatic languages. History of and research in Somali literature @en
preferred label: Litteraturhistoria och -forskning som rör litteratur på afroasiatiska språk. Litteraturhistoria och -forskning som rör litteratur på somaliska @sv

Tiibetiläis-burmalaisten kielten kirjallisuuden historia ja tutkimus
type: Concept
type: YKL-luokka
alternative label: Burman kieli, kirjallisuudenhistoria (86.94)
alternative label: Burmesiska, litteraturhistoria (86.94) @sv
alternative label: Indokiinalaiset kielet, kirjallisuudenhistoria (86.94+)
alternative label: Indokinesiska språk, litteraturhistoria (86.94+) @sv
alternative label: Karenin kieli, kirjallisuudenhistoria (86.94+)
alternative label: Karenska, litteraturhistoria (86.94+) @sv
alternative label: Laon kieli, kirjallisuudenhistoria (86.94)
alternative label: Laotiska, litteraturhistoria (86.94) @sv
alternative label: Sinotibetanska språk, litteraturhistoria (86.94+) @sv
alternative label: Sinotiibetiläiset kielet, kirjallisuudenhistoria (86.94+)
alternative label: Tibetanska, litteraturhistoria (86.94) @sv
alternative label: Tibeto-burmanska språk, litteraturhistoria (86.94+) @sv
alternative label: Tiibetiläis-burmalaiset kielet, kirjallisuudenhistoria (86.94+)
alternative label: Tiibetin kieli, kirjallisuudenhistoria (86.94)
broader: Muiden kielten kirjallisuuden historia ja tutkimus
in scheme: YKL - Yleisten kirjastojen luokitusjärjestelmä
narrower: Kiinankielisen kirjallisuuden historia ja tutkimus
narrower: Thainkielisen kirjallisuuden historia ja tutkimus
narrower: Vietnaminkielisen kirjallisuuden historia ja tutkimus
notation: 86.94
preferred label: History of and research in literature in Tibeto-Burman languages @en
preferred label: Litteraturhistoria och -forskning som rör litteratur på tibeto-burmanska språk @sv

Kiinankielisen kirjallisuuden historia ja tutkimus
type: Concept
type: YKL-luokka
alternative label: Kiinan kieli, folkloristiikka (86.943)
alternative label: Kiinan kieli, kansanrunoudentutkimus (86.943)
alternative label: Kiinan kieli, kirjallisuudenhistoria (86.943)
alternative label: Kinesiska , litteraturhistoria (86.943) @sv
alternative label: Kinesiska, folkdiktsforskning (86.943) @sv
alternative label: Kinesiska, folkloristik (86.943) @sv
broader: Tiibetiläis-burmalaisten kielten kirjallisuuden historia ja tutkimus
in scheme: YKL - Yleisten kirjastojen luokitusjärjestelmä
notation: 86.943
preferred label: History of and research in Chinese literature @en
preferred label: Litteraturhistoria och -forskning som rör litteratur på kinesiska @sv

Thainkielisen kirjallisuuden historia ja tutkimus
type: Concept
type: YKL-luokka
alternative label: Thai, folkdiktsforskning (86.946) @sv
alternative label: Thai, folkloristik (86.946) @sv
alternative label: Thai, litteraturhistoria (86.946) @sv
alternative label: Thain kieli, folkloristiikka (86.946)
alternative label: Thain kieli, kansanrunoudentutkimus (86.946)
alternative label: Thain kieli, kirjallisuudenhistoria (86.946)
broader: Tiibetiläis-burmalaisten kielten kirjallisuuden historia ja tutkimus
in scheme: YKL - Yleisten kirjastojen luokitusjärjestelmä
notation: 86.946
preferred label: History of and research in Thai literature @en
preferred label: Litteraturhistoria och -forskning som rör litteratur på thailändska @sv

Vietnaminkielisen kirjallisuuden historia ja tutkimus
type: Concept
type: YKL-luokka
alternative label: Annamin kieli, kirjallisuudenhistoria (86.948)
alternative label: Annamitiska, litteraturhistoria (86.948) @sv
alternative label: Vietnamesiska, folkdiktsforskning (86.948) @sv
alternative label: Vietnamesiska, folkloristik (86.948) @sv
alternative label: Vietnamesiska, litteraturhistoria (86.948) @sv
alternative label: Vietnamin kieli, folkloristiikka (86.948)
alternative label: Vietnamin kieli, kansanrunoudentutkimus (86.948)
alternative label: Vietnamin kieli, kirjallisuudenhistoria (86.948)
broader: Tiibetiläis-burmalaisten kielten kirjallisuuden historia ja tutkimus
in scheme: YKL - Yleisten kirjastojen luokitusjärjestelmä
notation: 86.948
preferred label: History of and research in Vietnamese literature @en
preferred label: Litteraturhistoria och -forskning som rör litteratur på vietnamesiska @sv

Japanin- ja koreankielisen kirjallisuuden historia ja tutkimus
type: Concept
type: YKL-luokka
broader: Muiden kielten kirjallisuuden historia ja tutkimus
in scheme: YKL - Yleisten kirjastojen luokitusjärjestelmä
narrower: Japaninkielisen kirjallisuuden historia ja tutkimus
narrower: Koreankielisen kirjallisuuden historia ja tutkimus
notation: 86.95
preferred label: History of and research in Japanese and Korean literature @en
preferred label: Litteraturhistoria och -forskning som rör litteratur på japanska och koreanska @sv

Japaninkielisen kirjallisuuden historia ja tutkimus
type: Concept
type: YKL-luokka
alternative label: Japanin kieli, folkloristiikka (86.951)
alternative label: Japanin kieli, kansanrunoudentutkimus (86.951)
alternative label: Japanin kieli, kirjallisuudenhistoria (86.951)
alternative label: Japanska, folkdiktsforskning (86.951) @sv
alternative label: Japanska, folkloristik (86.951) @sv
alternative label: Japanska, litteraturhistoria (86.951) @sv
broader: Japanin- ja koreankielisen kirjallisuuden historia ja tutkimus
in scheme: YKL - Yleisten kirjastojen luokitusjärjestelmä
notation: 86.951
preferred label: History of and research in Japanese literature @en
preferred label: Litteraturhistoria och -forskning som rör litteratur på japanska @sv

Koreankielisen kirjallisuuden historia ja tutkimus
type: Concept
type: YKL-luokka
alternative label: Korean kieli, folkloristiikka (86.955)
alternative label: Korean kieli, kansanrunoudentutkimus (86.955)
alternative label: Korean kieli, kirjallisuudenhistoria (86.955)
alternative label: Koreanska, folkdiktsforskning (86.955) @sv
alternative label: Koreanska, folkloristik (86.955) @sv
alternative label: Koreanska, litteraturhistoria (86.955) @sv
broader: Japanin- ja koreankielisen kirjallisuuden historia ja tutkimus
in scheme: YKL - Yleisten kirjastojen luokitusjärjestelmä
notation: 86.955
preferred label: History of and research in Korean literature @en
preferred label: Litteraturhistoria och -forskning som rör litteratur på koreanska @sv

Afrikkalaisten kielten kirjallisuuden historia ja tutkimus
type: Concept
References: Hollanninkielisen kirjallisuuden historia ja tutkimus
References: Etelä-Afrikan englanninkielisen kirjallisuuden historia ja tutkimus
References: Arabiankielisen kirjallisuuden historia ja tutkimus
type: YKL-luokka
alternative label: Afrika, ursprungsspråk, litteraturhistoria (86.96) @sv
alternative label: Afrikansk litteratur, historia och forskning, allm. (86.96) @sv
alternative label: Afrikka, alkuperäiskielet, kirjallisuudenhistoria (86.96)
alternative label: Afrikkalainen kirjallisuus, historia ja tutkimus, yl. (86.96)
alternative label: Bantukielet, kirjallisuudenhistoria (86.96)
alternative label: Bantuspråk, litteraturhistoria (86.96) @sv
alternative label: Bushmanspråk, litteraturhistoria (86.96) @sv
alternative label: Busmannikielet, kirjallisuudenhistoria (86.96)
alternative label: Hottentottikielet, kirjallisuudenhistoria (86.96)
alternative label: Hottentottspråk, litteraturhistoria (86.96) @sv
alternative label: Kannada (86.96) @sv
alternative label: Kannadan kieli (86.96)
alternative label: Khoisankielet, kirjallisuudenhistoria (86.96)
alternative label: Khoisaspråk, litteraturhistoria (86.96) @sv
alternative label: Lingala (86.96) @sv
alternative label: Lingalan kieli (86.96)
alternative label: Malaijin kieli (86.96)
alternative label: Malajalamin kieli (86.96)
alternative label: Malajiska (86.96) @sv
alternative label: Malayalam (86.96) @sv
alternative label: Sudanilaiset kielet, kirjallisuudenhistoria (86.96)
alternative label: Sudanska språk, litteraturhistoria (86.96) @sv
alternative label: Swahili, litteraturhistoria (86.96) @sv
alternative label: Swahilin kieli, kirjallisuudenhistoria (86.96)
broader: Muiden kielten kirjallisuuden historia ja tutkimus
in scheme: YKL - Yleisten kirjastojen luokitusjärjestelmä
notation: 86.96
preferred label: History of and research in literature in African languages @en
preferred label: Litteraturhistoria och -forskning som rör litteratur på afrikanska språk @sv
scope note: Hit litteraturhistoria och -forskning som rör litteratur på de språk som talas söder om Sahara, Etiopien och Somalia Hit också allmänna verk i litteraturhistoria och -forskning som rör Afrikas litteratur @sv
scope note: Tähän Saharan, Etiopian ja Somalian eteläpuolella puhuttujen afrikkalaisten kielten kirjallisuuden historia ja tutkimus Tähän myös Afrikan kirjallisuuden historian ja tutkimuksen yleisteokset

Eskimo- ja intiaanikielten kirjallisuuden historia ja tutkimus
type: Concept
type: YKL-luokka
alternative label: Amerika, ursprungsspråk, litteraturhistoria (86.98) @sv
alternative label: Amerikka, alkuperäiskielet, kirjallisuudenhistoria (86.98)
alternative label: Eskimokielet, kirjallisuudenhistoria (86.98)
alternative label: Eskimåspråk, litteraturhistoria (86.98) @sv
alternative label: Grönlannin kieli, kirjallisuudenhistoria (86.98)
alternative label: Grönländska, litteraturhistoria (86.98) @sv
alternative label: Indianspråk, litteraturhistoria (86.98) @sv
alternative label: Intiaanikielet, kirjallisuudenhistoria (86.98)
alternative label: Inuit, litteraturhistoria (86.98) @sv
alternative label: Inuitin kieli, kirjallisuudenhistoria (86.98)
broader: Muiden kielten kirjallisuuden historia ja tutkimus
in scheme: YKL - Yleisten kirjastojen luokitusjärjestelmä
notation: 86.98
preferred label: History of and research in literature in Eskimo and Indian languages @en
preferred label: Litteraturhistoria och -forskning som rör litteratur på eskimå- och indianspråk @sv
scope note: Grönlanninkielisen kirjallisuuden historia ja tutkimus
scope note: Litteraturhistoria och -forskning som rör litteratur på grönländska @sv

Muiden ei-indoeurooppalaisten kielten kirjallisuuden historia ja tutkimus
type: Concept
type: YKL-luokka
alternative label: Ainu, litteraturhistoria (86.99) @sv
alternative label: Ainun kieli, kirjallisuudenhistoria (86.99)
alternative label: Australia, alkuperäiskielet, kirjallisuudenhistoria (86.99)
alternative label: Australien, ursprungsspråk, litteraturhistoria (86.99) @sv
alternative label: Austroaasialaiset kielet, kirjallisuudenhistoria (86.99)
alternative label: Austroasiatiska språk, litteraturhistoria (86.99) @sv
alternative label: Avaarin kieli, kirjallisuudenhistoria (86.99)
alternative label: Avariska, litteraturhistoria (86.99) @sv
alternative label: Baskin kieli, kirjallisuudenhistoria (86.99)
alternative label: Baskiska, litteraturhistoria (86.99) @sv
alternative label: Dravidakielet, kirjallisuudenhistoria (86.99)
alternative label: Dravidiska språk, litteraturhistoria (86.99) @sv
alternative label: Etruskin kieli, kirjallisuudenhistoria (86.99)
alternative label: Etruskiska, litteraturhistoria (86.99) @sv
alternative label: Georgian kieli, kirjallisuudenhistoria (86.99)
alternative label: Georgiska, litteraturhistoria (86.99) @sv
alternative label: Grusiska, litteraturhistoria (86.99) @sv
alternative label: Gruusian kieli, kirjallisuudenhistoria (86.99)
alternative label: Indonesian kieli, kirjallisuudenhistoria (86.99)
alternative label: Indonesiska, litteraturhistoria (86.99) @sv
alternative label: Kaukasialaiset kielet, kirjallisuudenhistoria (86.99)
alternative label: Kaukasiska språk, litteraturhistoria (86.99) @sv
alternative label: Khmerin kieli, kirjallisuudenhistoria (86.99)
alternative label: Khmeriska, litteraturhistoria (86.99) @sv
alternative label: Kreolikielet, kirjallisuudenhistoria (86.99)
alternative label: Kreolspråk, litteraturhistoria (86.99) @sv
alternative label: Malaijikielet, kirjallisuudenhistoria (86.99)
alternative label: Malaijipolynesialaiset kielet, kirjallisuudendehistoria (86.99)
alternative label: Malajiska språk, litteraturhistoria (86.99) @sv
alternative label: Malajo-polynesiska språk, litteraturhistoria (86.99) @sv
alternative label: Melanesialaiset kielet, kirjallisuudenhistoria (86.99)
alternative label: Melanesiska språk, litteraturhistoria (86.99) @sv
alternative label: Mikronesialaiset kielet, kirjallisuudenhistoria (86.99)
alternative label: Mikronesiska språk, litteraturhistoria (86.99) @sv
alternative label: Mongolikielet, kirjallisuudenhistoria (86.99)
alternative label: Mongoliska språk, litteraturhistoria (86.99) @sv
alternative label: Mundakielet, kirjallisuudenhistoria (86.99)
alternative label: Mundaspråk, litteraturhistoria (86.99) @sv
alternative label: Oceaniens språk, litteraturhistoria (86.99) @sv
alternative label: Oseanian kielet, kirjallisuudenhistoria (86.99)
alternative label: Paleoaasialaiset kielet, kirjallisuudenhistoria (86.99)
alternative label: Paleoasiatiska språk, litteraturhistoria (86.99) @sv
alternative label: Papuakielet, kirjallisuudenhistoria (86.99)
alternative label: Papuanska språk, litteraturhistoria (86.99) @sv
alternative label: Pidginkielet, kirjallisuudenhistoria (86.99)
alternative label: Pidginspråk, litteraturhistoria (86.99) @sv
alternative label: Polynesialaiset kielet, kirjallisuudenhistoria (86.99)
alternative label: Polynesiska språk, litteraturhistoria (86.99) @sv
alternative label: Tamilin kieli, kirjallisuudenhistoria (86.99)
alternative label: Tamiliska, litteraturhistoria (86.99) @sv
alternative label: Telugu, språket, litteraturhistoria (86.99) @sv
alternative label: Telugun kieli, kirjallisuudenhistoria (86.99)
alternative label: Tjerkessiska, litteraturhistoria (86.99) @sv
alternative label: Tjetjenska, litteraturhistoria (86.99) @sv
alternative label: Tjuktjiska, litteraturhistoria (86.99) @sv
alternative label: Tserkessin kieli, kirjallisudenhistoria (86.99)
alternative label: Tsetseenin kieli, kirjallisuudenhistoria (86.99)
alternative label: Tsuktsin kieli, kirjallisuudenhistoria (86.99)
alternative label: Tungusspråk, litteraturhistoria (86.99) @sv
alternative label: Tunguusikielet, kirjallisuduenhistoria (86.99)
broader: Muiden kielten kirjallisuuden historia ja tutkimus
in scheme: YKL - Yleisten kirjastojen luokitusjärjestelmä
narrower: Keinotekoisten kielten kirjallisuuden historia ja tutkimus
notation: 86.99
preferred label: History of and research in literature in other Non-Indoeuropean languages @en
preferred label: Litteraturhistoria och -forskning som rör litteratur på övriga icke-indoeuropeiska språk @sv

Keinotekoisten kielten kirjallisuuden historia ja tutkimus
type: Concept
type: YKL-luokka
alternative label: Artificiella språk, litteraturhistoria (86.991) @sv
alternative label: Chifferspråk, litteraturhistoria (86.991) @sv
alternative label: Esperanto, litteraturhistoria (86.991) @sv
alternative label: Esperanton kieli, kirjallisuudenhistoria (86.991)
alternative label: Ido, litteraturhistoria (86.991) @sv
alternative label: Idon kieli, kirjallisuudenhistoria (86.991)
alternative label: Keinotekoiset kielet, kirjallisuudenhistoria (86.991)
alternative label: Konstgjorda språk, litteraturhistoria (86.991) @sv
alternative label: Konstruoidut kielet, kirjallisuudenhistoria (86.991)
alternative label: Novial, kieli, kirjallisuudenhistoria (86.991)
alternative label: Novial, språket, litteraturhistoria (86.991) @sv
alternative label: Occidental, kieli, kirjallisuudenhistoria (86.991)
alternative label: Occidental, språket, litteraturhistoria (86.991) @sv
alternative label: Salakielet, kirjallisuudenhistoria (86.991)
broader: Muiden ei-indoeurooppalaisten kielten kirjallisuuden historia ja tutkimus
in scheme: YKL - Yleisten kirjastojen luokitusjärjestelmä
notation: 86.991
preferred label: History of and research in literature in artificial languages @en
preferred label: Litteraturhistoria och -forskning som rör litteratur på artificiella språk @sv

KIELITIEDE
type: Concept
References: Kirjoitus
References: Oppimisen psykologia
References: Kieli-, kommunikaatio- ja ilmaisupsykologia
References: Kielten ja kirjallisuuden opetusoppi
References: KIRJALLISUUSTIEDE
alternative label: Ammattikieli (87+)
alternative label: Ammattislangit (87+)
alternative label: Anagram, språkvetenskap (87) @sv
alternative label: Anagrammit, kielitiede (87)
alternative label: Datalingvistik, språkvetenskap (87+) @sv
alternative label: Dialekter (87+) @sv
alternative label: Fackspråk (87+) @sv
alternative label: Filologi (87+) @sv
alternative label: Filologia (87+)
alternative label: Flerspråkighet (87) @sv
alternative label: Invandring, språkpolitik (87) @sv
alternative label: Jämförande lingvistik (87+) @sv
alternative label: Kaksikielisyys (87)
alternative label: Kielenhuolto (87+)
alternative label: Kielet, kielitiede (87+)
alternative label: Kielet, ryhmittely (87)
alternative label: Kielimaantiede (87)
alternative label: Kielipolitiikka (87)
alternative label: Kielisosiologia (87)
alternative label: Kielitaito (87+)
alternative label: Kieliteknologia, kielitiede (87+)
alternative label: Kielitiede (87+)
alternative label: Kielitiede, vertaileva (87+)
alternative label: Kielitypologia (87)
alternative label: Kirjakielet (87+)
alternative label: Kirjallinen viestintä, kielitiede (87+)
alternative label: Krestomatier, för språkstudier (87 ... 89+) @sv
alternative label: Leksikografia (87)
alternative label: Leksikologia (87+)
alternative label: Lexikografi (87) @sv
alternative label: Lexikologi (87+) @sv
alternative label: Lingvistiikka (87+)
alternative label: Lingvistik (87+) @sv
alternative label: Lukemistot, kielten opiskeluun tarkoitetut (87 ... 89+)
alternative label: Lättläst text (87+) @sv
alternative label: Monikielisyys (87)
alternative label: Murteet (87+)
alternative label: Oikeakielisyys (87+)
alternative label: Ordboksarbete (87) @sv
alternative label: Ordlekar, språkvetenskap (87) @sv
alternative label: Palindromer, språkvetenskap (87) @sv
alternative label: Palindromit, kielitiede (87)
alternative label: Puhekielet (87+)
alternative label: Puheteknologia, kielitiede (87+)
alternative label: Sanakirjatyö (87)
alternative label: Sanaleikit, kielitiede (87)
alternative label: Sanasto-oppi (87+)
alternative label: Selkokieli (87+)
alternative label: Siirtolaisuus, kielipolitiikka (87)
alternative label: Skriftlig kommunikation, språkvetenskap (87+) @sv
alternative label: Skriftspråk (87+) @sv
alternative label: Slang (87+) @sv
alternative label: Slangi (87+)
alternative label: Sociolingvistik (87) @sv
alternative label: Sosiolingvistiikka (87)
alternative label: Språk, gruppering (87) @sv
alternative label: Språk, språkvetenskap (87+) @sv
alternative label: Språkgeografi (87) @sv
alternative label: Tekstikritiikki, kielitiede (87)
alternative label: Terminologia (87)
alternative label: Tietokonelingvistiikka, kielitiede (87+)
alternative label: Tyylioppi, kielitiede (87+)
alternative label: Vertaileva kielitiede (87+)
broader: KAUNOKIRJALLISUUS. KIRJALLISUUSTIEDE. KIELITIEDE
in scheme: YKL - Yleisten kirjastojen luokitusjärjestelmä
narrower: Kielifilosofia
narrower: Sanakirjat
narrower: Kielioppi. Muoto-oppi. Sanaoppi
narrower: Äänneoppi
narrower: Kääntäminen. Tulkkaus
narrower: Etymologia. Onomastiikka
notation: 87
scope note: Hit allmänna verk om språkvetenskap, lingvistik och filologi Hit också allmän och jämförande språkvetenskap Indelning av språk. Språkgeografi Talade och skrivna språk Talspråk. Dialekter. Skriftspråk Regionala och lokala slangspråk. Yrkesjargong Stilistik och stilistisk forskning ur språkvetenskaplig synvinkel Textkritik. Lexikologi. Terminologi. Lexikografi Språksociologi. Språkpolitik Sociolingvistik Språkkunskap. Två- och flerspråkighet. Verk om lättläst litteratur Språkriktighet. Språkvård Verk som behandlar ett visst språk eller en viss språkgrupp förs till klassen för språket eller språkgruppen i fråga 88-89+ Språkvetenskapens och språkets historia i allmänhet 87.09 @sv
scope note: Tähän kielitieteen, lingvistiikan ja filologian yleisteokset Tähän myös yleinen ja vertaileva kielitiede Kielten ryhmittely. Kielimaantiede Puhutut ja kirjoitetut kielet Puhekielet. Murteet. Kirjakielet Maantieteelliset slangit. Ammattislangit Tyylioppi ja tyylintutkimus kielitieteen kannalta Tekstikritiikki. Leksikologia. Terminologia. Leksikografia Kielisosiologia. Kielipolitiikka. Sosiolingvistiikka Kielitaito. Kaksi- ja monikielisyys. Selkokieli Oikeakielisyys. Kielenhuolto Tiettyä kieltä tai kieliryhmää koskevat teokset sijoitetaan ko. kielen tai kieliryhmän luokkaan 88-89+ Kielitieteen ja kielen historia yleensä 87.09

Kielifilosofia
type: Concept
References: Symbolit. Koodit. Merkkijärjestelmät
References: URN:NBN:fi:au:ykl:00.201
References: LOGIIKKA
type: YKL-luokka
alternative label: Betydelselära, lingvistik (87.01) @sv
alternative label: Kielifilosofia (87.01)
alternative label: Merkitysoppi, kielitiede (87.01)
alternative label: Semantiikka, kielitiede (87.01)
alternative label: Semantik, lingvistik (87.01) @sv
alternative label: Semiotiikka, kielitiede (87.01)
alternative label: Semiotik, lingvistik (87.01) @sv
alternative label: Språkfilosofi (87.01) @sv
broader: KIELITIEDE
in scheme: YKL - Yleisten kirjastojen luokitusjärjestelmä
notation: 87.01
preferred label: Philosophy of language @en
preferred label: Språkfilosofi @sv
scope note: Hit allmänna verk om språkets och språkvetenskapens filosofi, teori och forskningsmetoder Hit också semantik och semiotik ur språkvetenskaplig synvinkel i allmänhet Språkfilosofi som rör ett visst språk eller en viss språkgrupp förs till klassen för språket eller språkgruppen i fråga 88-89+ @sv
scope note: Tähän kielen ja kielitieteen filosofian, teorian ja tutkimusmenetelmien yleisteokset Tähän myös semantiikka ja semiotiikka kielitieteen kannalta yleensä Tiettyä kieltä tai kieliryhmää koskeva kielifilosofia luokitetaan ko. kielen tai kieliryhmän luokkaan 88-89+

Sanakirjat
type: Concept
References: Mietelausekokoelmat. Sitaattikokoelmat
type: YKL-luokka
alternative label: Främmande ord, ordböcker (87.038) @sv
alternative label: Förkortningskataloger (87.038) @sv
alternative label: Förkortningsordböcker (87.038) @sv
alternative label: Lyhenneluettelot (87.038)
alternative label: Lyhennesanakirjat (87.038)
alternative label: Ordböcker över främmande ord (87.038) @sv
alternative label: Ordböcker, flerspråkiga (87.038) @sv
alternative label: Ordböcker, främmande ord (87.038) @sv
alternative label: Polyglotit (87.038)
alternative label: Polyglotter (87.038) @sv
alternative label: Sanakirjat, monikieliset (87.038)
alternative label: Sanakirjat, sivistyssanakirjat (87.038)
alternative label: Sivistyssanakirjat (87.038)
alternative label: Vierasperäisten sanojen sanakirjat (87.038)
broader: KIELITIEDE
in scheme: YKL - Yleisten kirjastojen luokitusjärjestelmä
notation: 87.038
preferred label: Dictionaries @en
preferred label: Ordböcker @sv
scope note: Hit allmänna flerspråkiga ordböcker Hit oavsett publikationens språk också allmänna ordböcker över främmande ord samt förkortningslistor och förkortningsordböcker Ordböcker för specialområden klassificeras enligt område Enspråkiga ordböcker förs till ifrågavarande språks klass 88-89+ Tvåspråkiga ordböcker klassificeras enligt det språk som är mest främmande i klasserna 88-89+ @sv
scope note: Tähän yleiset monikieliset sanakirjat Tähän julkaisun kielestä riippumatta myös yleiset sivistyssanakirjat, vierasperäisten sanojen sanakirjat sekä lyhenneluettelot ja lyhennesanakirjat Erikoisalojen sanakirjat luokitetaan alan mukaan Yksikieliset sanakirjat luokitetaan ko. kielen luokkaan 88-89+ Kaksikieliset sanakirjat luokitetaan vieraamman kielen mukaan luokkiin 88-89+

Kielioppi. Muoto-oppi. Sanaoppi
type: Concept
References: LOGIIKKA
References: Etymologia. Onomastiikka
type: YKL-luokka
alternative label: Adjektiivit, kielioppi, yl. (87.3)
alternative label: Adjektiv, grammatik, allm. (87.3) @sv
alternative label: Adverb, grammatik, allm. (87.3) @sv
alternative label: Adverbit, kielioppi, yl. (87.3)
alternative label: Affiksit, kielioppi, yl. (87.3)
alternative label: Affix, grammatik, allm. (87.3) @sv
alternative label: Asemosanat, kielioppi (87.3)
alternative label: Böjning, lingvistik (87.3) @sv
alternative label: Demonstratiivipronominit, kielioppi (87.3)
alternative label: Demonstrativpronomen, grammatik (87.3) @sv
alternative label: Enklitiska partiklar, grammatik (87.3) @sv
alternative label: Formlära, språkvetenskap (87.3) @sv
alternative label: Grammatik (87.3) @sv
alternative label: Indefiniittipronominit, kielioppi (87.3)
alternative label: Indefinitpronomen, grammatik (87.3) @sv
alternative label: Interjektioner, grammatik (87.3) @sv
alternative label: Interjektiot, kielioppi (87.3)
alternative label: Kasus, grammatik (87.3) @sv
alternative label: Kielioppi (87.3)
alternative label: Konjunktioner, grammatik (87.3) @sv
alternative label: Konjunktiot, kielioppi (87.3)
alternative label: Lauseoppi (87.3)
alternative label: Liitepartikkelit, kielioppi (87.3)
alternative label: Lukusanat, kielioppi (87.3)
alternative label: Morfologi, lingvistik (87.3) @sv
alternative label: Morfologia, kielitiede (87.3)
alternative label: Muoto-oppi, kielitiede (87.3)
alternative label: Nomen, grammatik (87.3) @sv
alternative label: Nominit, kielioppi (87.3)
alternative label: Numeraalit, kielioppi (87.3)
alternative label: Numeralia, grammatik (87.3) @sv
alternative label: Ordbildning (87.3) @sv
alternative label: Ordklasser (87.3) @sv
alternative label: Ordlära (87.3) @sv
alternative label: Partikkelit, kielioppi (87.3)
alternative label: Partiklar, grammatik (87.3) @sv
alternative label: Personliga pronomen, grammatik (87.3) @sv
alternative label: Persoonapronominit, kielioppi (87.3)
alternative label: Possessiivipronominit, kielioppi (87.3)
alternative label: Possessiivisuffiksit, kielioppi (87.3)
alternative label: Possessivpronomen, grammatik (87.3) @sv
alternative label: Possessivsuffix, grammatik (87.3) @sv
alternative label: Postpositioner, grammatik (87.3) @sv
alternative label: Postpostitiot, kielioppi (87.3)
alternative label: Prefiksit, kielioppi (87.3)
alternative label: Prefix, grammatik (87.3) @sv
alternative label: Prepositioner, grammatik (87.3) @sv
alternative label: Prepostitiot, kielioppi (87.3)
alternative label: Pronomen, grammatik (87.3) @sv
alternative label: Pronomina, grammatik (87.3) @sv
alternative label: Pronominit, kielioppi (87.3)
alternative label: Relatiivipronominit, kielioppi (87.3)
alternative label: Relativpronomen, grammatik (87.3) @sv
alternative label: Räkneord, grammatik (87.3) @sv
alternative label: Sanaluokat (87.3)
alternative label: Sananmuodostus (87.3)
alternative label: Sanaoppi (87.3)
alternative label: Satslära (87.3) @sv
alternative label: Sijamuodot, kielioppi (87.3)
alternative label: Substantiivit, kielioppi (87.3)
alternative label: Substantiv, grammatik (87.3) @sv
alternative label: Suffiksit, kielioppi (87.3)
alternative label: Suffix, grammatik (87.3) @sv
alternative label: Syntaksi, kielitiede (87.3)
alternative label: Syntax, lingvistik (87.3) @sv
alternative label: Taivutus, kielitiede (87.3)
alternative label: Verb, grammatik (87.3) @sv
alternative label: Verbit, kielioppi (87.3)
broader: KIELITIEDE
in scheme: YKL - Yleisten kirjastojen luokitusjärjestelmä
notation: 87.3
preferred label: Grammar. Morphology. Lexicology @en
preferred label: Grammatik. Ordlära @sv
scope note: Hit allmänna verk om grammatik, språkets morfologi och ordlära Komparativ grammatik, morfologi och ordlära Ordklasser. Ordbildning. Böjning Satslära eller syntax Grammatik, morfologi eller ordlära som rör ett visst språk eller en viss språkgrupp förs till klassen för språket eller språkgruppen i fråga 88-89+ @sv
scope note: Tähän kieliopin, kielen muoto-opin ja sanaopin yleisteokset Vertaileva kieli-, muoto- ja sanaoppi Sanaluokat. Sananmuodostus. Taivutus Lauseoppi eli syntaksi Tiettyä kieltä tai kieliryhmää koskeva kieli-, muoto- ja sanaoppi luokitetaan ko. kielen tai kieliryhmän luokkaan 88-89+

Äänneoppi
type: Concept
References: Oppimisen psykologia
References: Erityisopetus. Erityiskasvatus, luku-, kirjoitus- ja puhehäiriöiset
References: Ilmaisutaito. Puhetaito. Lausuntataide
type: YKL-luokka
alternative label: Accent, lingvistik (87.4) @sv
alternative label: Accent, språkvetenskap (87.4) @sv
alternative label: Aksentti, kielitiede (87.4)
alternative label: Betoning, lingvistik (87.4) @sv
alternative label: Fonetiikka (87.4)
alternative label: Fonetik (87.4) @sv
alternative label: Fonologi (87.4) @sv
alternative label: Fonologia (87.4)
alternative label: Intonaatio, kielitiede (87.4)
alternative label: Intonation, språkvetenskap (87.4) @sv
alternative label: Kombinaatio-oppi, kielitiede (87.4)
alternative label: Kombinatorik, språkvetenskap (87.4) @sv
alternative label: Konsonanter (87.4) @sv
alternative label: Konsonantit (87.4)
alternative label: Korko, kielitiede (87.4)
alternative label: Kvantiteetti, kielitiede (87.4)
alternative label: Kvantitet, språkvetenskap (87.4) @sv
alternative label: Ljud, fonetik (87.4) @sv
alternative label: Ljudlära (87.4) @sv
alternative label: Ljudövergångar (87.4) @sv
alternative label: Paino, kielitiede (87.4)
alternative label: Rytm, lingvistik (87.4) @sv
alternative label: Rytmi, kielitiede (87.4)
alternative label: Röstfysiologi (87.4) @sv
alternative label: Tempo, kielitiede (87.4)
alternative label: Tempo, lingvistik (87.4) @sv
alternative label: Uttalning, lingvistik (87.4) @sv
alternative label: Vokaalit (87.4)
alternative label: Vokaler (87.4) @sv
alternative label: Äänifysiologia (87.4)
alternative label: Äänneoppi (87.4)
alternative label: Äänteenmuutokset (87.4)
alternative label: Äänteet (87.4)
alternative label: Ääntäminen, kielitiede (87.4)
broader: KIELITIEDE
in scheme: YKL - Yleisten kirjastojen luokitusjärjestelmä
notation: 87.4
preferred label: Ljudlära @sv
preferred label: Phonetics @en
scope note: Hit allmänna verk om ljudlära, fonetik och fonologi Röstfysiologi. Språkljud. Uttal Vokaler. Konsonanter. Kombinatorik Kvantitet. Accent. Ljudövergångar Ljudlära som rör ett visst språk eller en viss språkgrupp förs till klassen för språket eller språkgruppen i fråga 88-89+ @sv
scope note: Tähän äänneopin, fonetiikan ja fonologian yleisteokset Äänifysiologia. Äänteet. Ääntäminen Vokaalit. Konsonantit. Kombinaatio-oppi Kvantiteetti. Aksentti. Äänteenmuutokset Tiettyä kieltä tai kieliryhmää koskeva äänneoppi luokitetaan ko. kielen tai kieliryhmän luokkaan 88-89+

Kääntäminen. Tulkkaus
type: Concept
References: Kaunokirjallisuuden kirjoittaminen ja kääntäminen
type: YKL-luokka
alternative label: Automaattinen kielenkääntäminen (87.5)
alternative label: Automatisk översättning (87.5) @sv
alternative label: Datorstödd översättning (87.5) @sv
alternative label: Datorstödd översättning, facklitteratur (87.5) @sv
alternative label: Kielenkääntäminen (87.5)
alternative label: Kielenkääntäminen, tietokirjallisuus (87.5)
alternative label: Kielenkääntäminen, tulkkaus (87.5)
alternative label: Kääntäjän työ (87.5)
alternative label: Kääntäjän työ, tietokirjallisuus (87.5)
alternative label: Kääntäminen (87.5)
alternative label: Kääntäminen, tietokirjallisuus (87.5)
alternative label: Kääntäminen, tulkkaus (87.5)
alternative label: Simultaanitulkkaus (87.5)
alternative label: Simultantolkning (87.5) @sv
alternative label: Tietokoneavusteinen kääntäminen (87.5)
alternative label: Tietokoneavusteinen kääntäminen, tietokirjallisuus (87.5)
alternative label: Tolken arbete (87.5) @sv
alternative label: Tolkning (87.5) @sv
alternative label: Tulkin työ (87.5)
alternative label: Tulkkaus (87.5)
alternative label: Översättarens arbete (87.5) @sv
alternative label: Översättarens arbete, facklitteratur (87.5) @sv
alternative label: Översättning (87.5) @sv
alternative label: Översättning, facklitteratur (87.5) @sv
alternative label: Översättning, tolkning (87.5) @sv
alternative label: Översättningsarbete (87.5) @sv
alternative label: Översättningsarbete, facklitteratur (87.5) @sv
alternative label: Översättningsarbete, tolkning (87.5) @sv
broader: KIELITIEDE
in scheme: YKL - Yleisten kirjastojen luokitusjärjestelmä
notation: 87.5
preferred label: Translation. Interpretation @en
preferred label: Översättning. Tolkning @sv
scope note: Kääntäjän ja tulkin työ Tietokirjallisuuden kääntäminen Automaattinen kielenkääntäminen Simultaanitulkkaus Jos teoksessa on sekä kauno- että tietokirjallisuuden kääntämistä, annetaan etusija luokalle 87.5
scope note: Översättarens och tolkens arbete Översättning av facklitteratur Maskinöversättning och datorstödd översättning Simultantolkning Om verket behandlar översättning av såväl skön- som facklitteratur, ges företräde åt klass 87.5 @sv

Etymologia. Onomastiikka
type: Concept
type: YKL-luokka
alternative label: Etunimet, etymologia (87.9)
alternative label: Etymologi (87.9) @sv
alternative label: Etymologia (87.9)
alternative label: Förnamn, etymologi (87.9) @sv
alternative label: Henkilönnimitutkimus, etymologia (87.9)
alternative label: Namn, etymologi (87.9) @sv
alternative label: Namnforskning, etymologi (87.9) @sv
alternative label: Namnsdagar, etymologi (87.9) @sv
alternative label: Nimet, etymologia (87.9)
alternative label: Nimipäivät, etymologia (87.9)
alternative label: Nimistötiede, etymologia (87.9)
alternative label: Onomastiikka (87.9)
alternative label: Onomastik (87.9) @sv
alternative label: Ordförklaringslära (87.9) @sv
alternative label: Ortnamnsforskning, etymologi (87.9) @sv
alternative label: Paikannimitutkimus, etymologia (87.9)
alternative label: Personnamnsforskning, etymologi (87.9) @sv
alternative label: Ristimänimet, etymologia (87.9)
alternative label: Sananselitysoppi (87.9)
alternative label: Släktnamn, etymologi (87.9) @sv
alternative label: Sukunimet, etymologia (87.9)
broader: KIELITIEDE
in scheme: YKL - Yleisten kirjastojen luokitusjärjestelmä
notation: 87.9
preferred label: Etymologi. Onomastik @sv
preferred label: Etymology. Onomastics @en
scope note: Hit allmänna verk om etymologi och onomastik Ordförklaringslära. Namnforskning Forskning i ursprunget till ord och namn Ort- och personnamnsforskning Böcker om etymologi, onomastik och förnamn som rör ett visst språk eller en viss språkgrupp förs till klassen för språket eller språkgruppen i fråga 88-89+ @sv
scope note: Tähän etymologian ja onomastiikan yleisteokset Sananselitysoppi. Nimistötiede Sanojen ja nimien alkuperän tutkimus Paikan- ja henkilönnimitutkimus Tiettyä kieltä tai kieliryhmää koskeva etymologia, onomastiikka ja etunimikirjat luokitetaan ko. kielen tai kieliryhmän luokkaan 88-89+

SUOMALAIS-UGRILAISET JA URALILAISET KIELET
type: Concept
References: Turkkilaiset kielet
type: YKL-luokka
alternative label: Finsk-ugriska språk (88+) @sv
alternative label: Itämerensuomalaiset kielet (88 ... 88.4)
alternative label: Kielet (88 ... 89+)
alternative label: Kielikurssit (88 ... 89+)
alternative label: Krestomatier, för språkstudier (87 ... 89+) @sv
alternative label: Lukemistot, kielten opiskeluun tarkoitetut (87 ... 89+)
alternative label: Språk (88 ... 89+) @sv
alternative label: Språkkurser (88 ... 89+) @sv
alternative label: Suomalais-ugrilaiset kielet (88+)
alternative label: Uralilaiset kielet (88+)
alternative label: Uraliska språk (88+) @sv
alternative label: Östersjöfinska språk (88 ... 88.4) @sv
broader: KAUNOKIRJALLISUUS. KIRJALLISUUSTIEDE. KIELITIEDE
in scheme: YKL - Yleisten kirjastojen luokitusjärjestelmä
narrower: Suomen kieli
narrower: Viron kieli
narrower: Muut itämerensuomalaiset kielet
narrower: Muut suomalais-ugrilaiset ja uralilaiset kielet
notation: 88
preferred label: FINNO-UGRIC AND URALIC LANGUAGES @en
preferred label: FINSK-UGRISKA OCH URALISKA SPRÅK @sv

Suomen kieli
type: Concept
References: Oppimisen psykologia
References: Kieli-, kommunikaatio- ja ilmaisupsykologia
References: Kielten ja kirjallisuuden opetusoppi
References: Opiskelutekniikka
References: Suomenkieliset kaunokirjalliset sekasisältöiset teokset
References: Suomen, suomalais-ugrilaisten ja uralilaisten kielten kirjallisuuden historia ja tutkimus
type: YKL-luokka
alternative label: Ainekirjoitusoppaat, suomi (88.2)
alternative label: Finska (88.2+) @sv
alternative label: Kielenhuolto, suomi (88.2+)
alternative label: Kirjakieli, suomi (88.2+)
alternative label: Kirjallinen viestintä, suomi (88.2+)
alternative label: Kirjoittaminen, oppaat, suomen kieli (88.2+)
alternative label: Leksikologia, suomi (88.2+)
alternative label: Lexikologi, finska (88.2+) @sv
alternative label: Lättläst text, finska (88.2+) @sv
alternative label: Nätskrivande, språkriktighetshandböcker, finska (88.2+) @sv
alternative label: Oikeakielisyysoppaat, suomi (88.2+)
alternative label: Puhekieli, suomi (88.2+)
alternative label: Sanasto-oppi, suomi (88.2+)
alternative label: Selkokieli, suomi (88.2+)
alternative label: Skriftlig kommunikation, finska (88.2+) @sv
alternative label: Skriftspråk, svenska (88.2+) @sv
alternative label: Skrivande, handböcker, finska (88.2+) @sv
alternative label: Språkriktighetshandböcker, finska (88.2+) @sv
alternative label: Språkvård, finska (88.2+) @sv
alternative label: Stilistik, finska (88.2+) @sv
alternative label: Suomen kieli (88.2+)
alternative label: Talspråk, finska (88.2+) @sv
alternative label: Tyylioppi, suomen kieli (88.2+)
alternative label: Uppsatshandledning, finska (88.2) @sv
alternative label: Verkkokirjoittaminen, oikeakielisyysopaat, suomen kieli (88.2+)
broader: SUOMALAIS-UGRILAISET JA URALILAISET KIELET
in scheme: YKL - Yleisten kirjastojen luokitusjärjestelmä
narrower: Suomen kielen kielioppi, muoto-oppi ja sanaoppi
narrower: Suomen kielen äänneoppi
narrower: Suomen kielen murteet
narrower: Suomen kielen etymologia ja onomastiikka
notation: 88.2
preferred label: Finnish @en
preferred label: Finska @sv
scope note: Hit allmänna verk om finska eller forskning i finska. Skriftspråk. Talspråk. Verk om lättläst litteratur. Språkriktighet. Språkvård. Språkriktighetshandböcker. Handböcker i uppsatsskrivning. Stilistik och stilistisk forskning ur språkvetenskaplig synvinkel. Lexikologi. Språksociologi. Sociolingvistik. Språkpolitik. Hit också text- och läseböcker för studier i finska med förklaringar eller ordlistor. Allmänna finska ordböcker 88.2038. Finska uppsatssamlingar 88.204. Allmänna läro- och övningsböcker i finska 88.207. Språkläroböcker som riktar sig till olika yrkesgrupper hit. Finska språkets allmänna historia och finsk språkforsknings allmänna historia 88.209 @sv
scope note: Tähän suomen kieltä tai sen tutkimusta koskevat yleisteokset. Kirjakieli. Puhekieli. Selkokieli. Oikeakielisyys. Kielenhuolto. Oikeakielisyysoppaat. Ainekirjoitusoppaat. Tyylioppi ja tyylintutkimus kielitieteen kannalta. Leksikologia. Kielisosiologia. Sosiolingvistiikka. Kielipolitiikka. Tähän myös suomen kielen opiskeluun liittyvät selityksillä tai sanastolla varustetut lukemistot ja lukukirjat. Suomen kielen yleiset sanakirjat 88.2038. Suomen kielen ainekokoelmat 88.204. Suomen kielen yleiset oppi- ja harjoituskirjat 88.207. Eri ammattialojen kielten oppikirjat tähän. Suomen kielen ja sen tutkimuksen yleinen historia 88.209

Suomen kielen kielioppi, muoto-oppi ja sanaoppi
type: Concept
References: Kielioppi. Muoto-oppi. Sanaoppi
References: Suomen kielen murteet
References: Suomen kielen etymologia ja onomastiikka
type: YKL-luokka
alternative label: Böjning, finska (88.23) @sv
alternative label: Formlära, finska (88.23) @sv
alternative label: Grammatik, finska (88.23) @sv
alternative label: Kasus, finska (88.23) @sv
alternative label: Kielioppi, suomi (88.23)
alternative label: Lauseoppi, suomi (88.23)
alternative label: Morfologi, finska (88.23) @sv
alternative label: Morfologia, suomen kieli (88.23)
alternative label: Muoto-oppi, suomen kieli (88.23)
alternative label: Ordbildning, finska (88.23) @sv
alternative label: Ordklasser, finska (88.23) @sv
alternative label: Ordlära, finska (88.23) @sv
alternative label: Sanaluokat, suomi (88.23)
alternative label: Sananmuodostus, suomi (88.23)
alternative label: Sanaoppi, suomi (88.23)
alternative label: Satslära, finska (88.23) @sv
alternative label: Sijamuodot, suomen kieli (88.23)
alternative label: Syntaksi, suomen kieli (88.23)
alternative label: Syntax, finska (88.23) @sv
alternative label: Taivutus, suomi (88.23)
broader: Suomen kieli
in scheme: YKL - Yleisten kirjastojen luokitusjärjestelmä
notation: 88.23
preferred label: Finnish grammar, morphology and lexicology @en
preferred label: Finsk grammatik, formlära och ordlära @sv
scope note: Ordklasser. Ordbildning. Böjning. Syntax @sv
scope note: Sanaluokat. Sananmuodostus. Taivutus. Lauseoppi eli syntaksi

Suomen kielen äänneoppi
type: Concept
References: Oppimisen psykologia
References: Erityisopetus. Erityiskasvatus, luku-, kirjoitus- ja puhehäiriöiset
References: Ilmaisutaito. Puhetaito. Lausuntataide
References: Äänneoppi
References: Suomen kielen murteet
type: YKL-luokka
alternative label: Accent, finska (88.24) @sv
alternative label: Aksentti, suomi (88.24)
alternative label: Betoning, finska (88.24) @sv
alternative label: Fonetiikka, suomi (88.24)
alternative label: Fonetik, finska (88.24) @sv
alternative label: Fonologi, finska (88.24) @sv
alternative label: Fonologia, suomi (88.24)
alternative label: Intonaatio, suomi (88.24)
alternative label: Intonation, finska (88.24) @sv
alternative label: Kombinaatio-oppi, suomi (88.24)
alternative label: Kombinatorik, finska (88.24) @sv
alternative label: Konsonanter, finska (88.24) @sv
alternative label: Konsonantit, suomi (88.24)
alternative label: Korko, suomen kieli (88.24)
alternative label: Kvantiteetti, suomen kieli (88.24)
alternative label: Kvantitet, finska (88.24) @sv
alternative label: Ljudlära, finska (88.24) @sv
alternative label: Paino, suomen kieli (88.24)
alternative label: Rytm, finska (88.24) @sv
alternative label: Rytmi, suomen kieli (88.24)
alternative label: Tempo, finska (88.24) @sv
alternative label: Tempo, suomen kieli (88.24)
alternative label: Vokaalit, suomi (88.24)
alternative label: Vokaler, finska (88.24) @sv
alternative label: Äänneoppi, suomi (88.24)
broader: Suomen kieli
in scheme: YKL - Yleisten kirjastojen luokitusjärjestelmä
notation: 88.24
preferred label: Finnish phonetics @en
preferred label: Finsk ljudlära @sv
scope note: Fonetiikka. Fonologia Äänteet. Ääntäminen. Vokaalit. Konsonantit Kombinaatio-oppi. Kvantiteetti. Aksentti Äänteenmuutokset
scope note: Fonetik. Fonologi Ljud. Uttal. Vokaler. Konsonanter Kombinatorik. Kvantitet. Accent Ljudövergångar @sv

Suomen kielen murteet
type: Concept
References: KIELITIEDE
References: Suomen kielen etymologia ja onomastiikka
type: YKL-luokka
alternative label: Amerikafinska (88.25) @sv
alternative label: Amerikansuomi (88.25)
alternative label: Ammattikieli, suomi (88.25)
alternative label: Ammattislangit, suomi (88.25)
alternative label: Dialekter, finska (88.25) @sv
alternative label: Dialektområden, finska (88.25) @sv
alternative label: Fackspråk, finska (88.25) @sv
alternative label: Ingermanlandsfinska (88.25) @sv
alternative label: Ingermanländska dialekter, finska (88.25) @sv
alternative label: Inkerin suomalaismurteet (88.25)
alternative label: Inkerinsuomi (88.25)
alternative label: Murrealueet, suomi (88.25)
alternative label: Murteet, suomi (88.25)
alternative label: Slang, finska (88.25) @sv
alternative label: Slangi, suomi (88.25)
alternative label: Udmurtin kieli, kirjallisuudenhistoria (88.25)
alternative label: Udmurtiska, litteraturhistoria (88.25) @sv
alternative label: Yrkesjargonger, finska (88.25) @sv
broader: Suomen kieli
in scheme: YKL - Yleisten kirjastojen luokitusjärjestelmä
narrower: Meänkieli
narrower: Kveenin kieli
notation: 88.25
preferred label: Finnish dialects @en
preferred label: Finska dialekter @sv
scope note: Dialektforskning. Dialektområden Slang. Slangforskning. Regional och lokal slang Yrkesjargong och jargong inom olika branscher Hit också dialekternas grammatik, deras form-, ord och ljudlära samt etymologi och onomastik Finska dialekt- och slangordböcker 88.25038 Finska dialekt- och slangprovsamlingar 88.2504 @sv
scope note: Murretutkimus. Murrealueet Slangit. Slangitutkimus. Maantieteelliset slangit Eri ammattien ja alojen slangit Tähän myös murteiden kieli-, muoto-, sana- ja äänneoppi sekä etymologia ja onomastiikka Suomen kielen murre- ja slangisanakirjat 88.25038 Suomen kielen murre- ja slanginäytekokoelmat 88.2504

Meänkieli
type: Concept
References: KIELITIEDE
References: Suomen kielen etymologia ja onomastiikka
type: YKL-luokka
alternative label: Meänkieli (88.251)
alternative label: Tornedalsfinska (88.251) @sv
broader: Suomen kielen murteet
in scheme: YKL - Yleisten kirjastojen luokitusjärjestelmä
notation: 88.251

Kveenin kieli
type: Concept
References: KIELITIEDE
References: Suomen kielen etymologia ja onomastiikka
type: YKL-luokka
alternative label: Kveenin kieli (88.252)
alternative label: Kvänska (88.252) @sv
broader: Suomen kielen murteet
in scheme: YKL - Yleisten kirjastojen luokitusjärjestelmä
notation: 88.252
preferred label: Kven language @en
preferred label: Kvänska @sv

Suomen kielen etymologia ja onomastiikka
type: Concept
References: Etymologia. Onomastiikka
References: Suomen kielen murteet
type: YKL-luokka
alternative label: Etunimet, suomi (88.29)
alternative label: Etymologi, finska (88.29) @sv
alternative label: Etymologia, suomi (88.29)
alternative label: Förnamn, finska (88.29) @sv
alternative label: Henkilönnimitutkimus, suomi (88.29)
alternative label: Lainasanat, suomi, etymologia (88.29)
alternative label: Lånord, finska, etymologi (88.29) @sv
alternative label: Namn, finska (88.29) @sv
alternative label: Namnforskning, finska (88.29) @sv
alternative label: Nimet, suomi (88.29)
alternative label: Nimistötiede, suomi (88.29)
alternative label: Onomastiikka, suomi (88.29)
alternative label: Onomastik, finska (88.29) @sv
alternative label: Ordförklaringslära, finska (88.29) @sv
alternative label: Ortnamnsforskning, finska (88.29) @sv
alternative label: Paikannimitutkimus, suomi (88.29)
alternative label: Personnamnsforskning, finska (88.29) @sv
alternative label: Ristimänimet, suomi (88.29)
alternative label: Sananselitysoppi, suomi (88.29)
alternative label: Släktnamn, finska (88.29) @sv
alternative label: Sukunimet, suomi (88.29)
broader: Suomen kieli
in scheme: YKL - Yleisten kirjastojen luokitusjärjestelmä
notation: 88.29
preferred label: Finnish etymology and onomastics @en
preferred label: Finska språkets etymologi och onomastik @sv
scope note: Ordförklaringslära. Namnforskning Ortnamnsforskning. Personnamnsforskning Finska etymologiordböcker, namnordböcker och förnamnsböcker 88.29038 @sv
scope note: Sananselitysoppi. Nimistötiede Paikannimitutkimus. Henkilönnimitutkimus Suomen kielen etymologiset sanakirjat, nimisanakirjat ja etunimikirjat 88.29038

Viron kieli
type: Concept
type: YKL-luokka
alternative label: Eestin kieli (88.3)
alternative label: Estniska (88.3) @sv
alternative label: Viron kieli (88.3)
broader: SUOMALAIS-UGRILAISET JA URALILAISET KIELET
in scheme: YKL - Yleisten kirjastojen luokitusjärjestelmä
notation: 88.3
preferred label: Estniska @sv
preferred label: Estonian @en

Muut itämerensuomalaiset kielet
type: Concept
References: Suomen kieli
References: Suomen kielen murteet
References: Viron kieli
type: YKL-luokka
alternative label: Aunuksen murre (88.4)
alternative label: Ingermanländska dialekter, ingriska (88.4) @sv
alternative label: Ingriska (88.4) @sv
alternative label: Ingriska dialekter (88.4) @sv
alternative label: Inkerin kieli (88.4)
alternative label: Inkeroinen (88.4)
alternative label: Inkeroismurteet (88.4)
alternative label: Karelska (88.4) @sv
alternative label: Karjalan kieli (88.4)
alternative label: Liivin kieli (88.4)
alternative label: Liviska (88.4) @sv
alternative label: Lydiska (88.4) @sv
alternative label: Lyydin kieli (88.4)
alternative label: Olonets dialekt (88.4) @sv
alternative label: Vatjan kieli (88.4)
alternative label: Vepsiska (88.4) @sv
alternative label: Vepsän kieli (88.4)
alternative label: Votiska (88.4) @sv
broader: SUOMALAIS-UGRILAISET JA URALILAISET KIELET
in scheme: YKL - Yleisten kirjastojen luokitusjärjestelmä
notation: 88.4
preferred label: Other Finno-Baltic languages @en
preferred label: Övriga östersjöfinska språk @sv
scope note: Ingermanländska, karelska, liviska, lydiska, vepsiska och votiska @sv
scope note: Inkerin, karjalan, liivin, lyydin, vatjan ja vepsän kieli

Muut suomalais-ugrilaiset ja uralilaiset kielet
type: Concept
type: YKL-luokka
alternative label: Ersän kieli (88.5)
alternative label: Erzamordvinska (88.5) @sv
alternative label: Komi (88.5) @sv
alternative label: Komin kieli (88.5)
alternative label: Mari, språket (88.5) @sv
alternative label: Marin kieli (88.5)
alternative label: Moksan kieli (88.5)
alternative label: Moksha-språket (88.5) @sv
alternative label: Mordvan kieli (88.5)
alternative label: Mordvinska (88.5) @sv
alternative label: Ostjakin kieli (88.5)
alternative label: Ostjakiska (88.5) @sv
alternative label: Permiläiset kielet (88.5)
alternative label: Permiska språk (88.5) @sv
alternative label: Syrjänska (88.5) @sv
alternative label: Syrjäänin kieli (88.5)
alternative label: Tjeremissiska (88.5) @sv
alternative label: Tseremissin kieli (88.5)
alternative label: Udmurtin kieli (88.5)
alternative label: Udmurtiska (88.5) @sv
alternative label: Ugrilaiset kielet (88.5+)
alternative label: Ugriska språk (88.5+) @sv
alternative label: Vogulin kieli (88.5)
alternative label: Voguliska (88.5) @sv
alternative label: Volgafinska språk (88.5) @sv
alternative label: Volgansuomalaiset kielet (88.5)
alternative label: Votjakin kieli (88.5)
alternative label: Votjakiska (88.5) @sv
broader: SUOMALAIS-UGRILAISET JA URALILAISET KIELET
in scheme: YKL - Yleisten kirjastojen luokitusjärjestelmä
narrower: Unkarin kieli
narrower: Saamen kieli
narrower: Samojedikielet
notation: 88.5
preferred label: Other Finno-Ugric and Uralic languages @en
preferred label: Övriga finsk-ugriska och uraliska språk @sv
scope note: Ugrilaiset kielet. Volgansuomalaiset kielet Mordvan, hantin (ostjakin), komin (syrjäänin), marin (tseremissin), mansin (vogulin) ja udmurtin (votjakin) kieli
scope note: Ugriska språk. Volgafinska språk Mordvinska, chanti (ostjakiska), komi (syrjänska), mari (tjeremissiska), mansi (voguliska) och udmurtiska (votjakiska) @sv

Unkarin kieli
type: Concept
type: YKL-luokka
alternative label: Ungerska (88.51) @sv
alternative label: Unkarin kieli (88.51)
broader: Muut suomalais-ugrilaiset ja uralilaiset kielet
in scheme: YKL - Yleisten kirjastojen luokitusjärjestelmä
notation: 88.51
preferred label: Hungarian @en
preferred label: Ungerska @sv

Saamen kieli
type: Concept
type: YKL-luokka
alternative label: Koltan kieli (88.52)
alternative label: Saamen kieli (88.52)
alternative label: Samiska (88.52) @sv
alternative label: Skoltsamiska (88.52) @sv
broader: Muut suomalais-ugrilaiset ja uralilaiset kielet
in scheme: YKL - Yleisten kirjastojen luokitusjärjestelmä
notation: 88.52
preferred label: Sami @en
preferred label: Samiska @sv

Samojedikielet
type: Concept
type: YKL-luokka
alternative label: Samojedikielet (88.53)
alternative label: Samojedspråk (88.53) @sv
broader: Muut suomalais-ugrilaiset ja uralilaiset kielet
in scheme: YKL - Yleisten kirjastojen luokitusjärjestelmä
notation: 88.53
preferred label: Samojedspråk @sv
preferred label: Samoyedic languages @en

INDOEUROOPPALAISET KIELET. MUUT KIELET
type: Concept
References: SUOMALAIS-UGRILAISET JA URALILAISET KIELET
type: YKL-luokka
alternative label: Indoeurooppalaiset kielet (89)
alternative label: Indoeuropeiska språk (89) @sv
alternative label: Kielet (88 ... 89+)
alternative label: Kielikurssit (88 ... 89+)
alternative label: Krestomatier, för språkstudier (87 ... 89+) @sv
alternative label: Lukemistot, kielten opiskeluun tarkoitetut (87 ... 89+)
alternative label: Orientalistiikka, kielitiede (89+)
alternative label: Orientalistik, lingvistik (89+) @sv
alternative label: Språk (88 ... 89+) @sv
alternative label: Språkkurser (88 ... 89+) @sv
broader: KAUNOKIRJALLISUUS. KIRJALLISUUSTIEDE. KIELITIEDE
in scheme: YKL - Yleisten kirjastojen luokitusjärjestelmä
narrower: Pohjoismaiset kielet
narrower: Germaaniset kielet
narrower: Englannin kieli
narrower: Romaaniset kielet
narrower: Slaavilaiset ja balttilaiset kielet
narrower: Muut indoeurooppalaiset kielet
narrower: Muut kielet
notation: 89
preferred label: INDO-EUROPEAN LANGUAGES. OTHER LANGUAGES @en
preferred label: INDOEUROPEISKA SPRÅK. ÖVRIGA SPRÅK @sv
scope note: Hit allmänna verk om indoeuropeiska språk @sv
scope note: Tähän indoeurooppalaisia kieliä koskevat yleisteokset

Pohjoismaiset kielet
type: Concept
type: YKL-luokka
alternative label: Nordgermanska språk (89.3+) @sv
alternative label: Nordiska språk (89.3+) @sv
alternative label: Pohjoisgermaaniset kielet (89.3+)
alternative label: Pohjoismaiset kielet (89.3+)
alternative label: Skandinaaviset kielet (89.3+)
alternative label: Skandinaviska språk (89.3+) @sv
broader: INDOEUROOPPALAISET KIELET. MUUT KIELET
in scheme: YKL - Yleisten kirjastojen luokitusjärjestelmä
narrower: Ruotsin kieli
narrower: Norjan kieli
narrower: Tanskan kieli
narrower: Islannin kieli
narrower: Fäärin kieli
notation: 89.3
preferred label: Nordic languages @en
preferred label: Nordiska språk @sv

Ruotsin kieli
type: Concept
References: Oppimisen psykologia
References: Kieli-, kommunikaatio- ja ilmaisupsykologia
References: Kielten ja kirjallisuuden opetusoppi
References: Opiskelutekniikka
References: Ruotsinkieliset kaunokirjalliset sekasisältöiset teokset
References: Suomenruotsalaisen kirjallisuuden historia ja tutkimus
References: Ruotsinkielisen kirjallisuuden historia ja tutkimus
type: YKL-luokka
alternative label: Ainekirjoitusoppaat, ruotsi (89.31)
alternative label: Finlandssvenska (89.31+) @sv
alternative label: Kielenhuolto, ruotsi (89.31+)
alternative label: Kirjakieli, ruotsi (89.31+)
alternative label: Kirjallinen viestintä, ruotsi (89.31+)
alternative label: Leksikologia, ruotsi (89.31+)
alternative label: Lexikologi, svenska (89.31+) @sv
alternative label: Lättläst text, svenska (89.31+) @sv
alternative label: Nätskrivande, språkriktighetshandböcker, svenska (89.31+) @sv
alternative label: Oikeakielisyysoppaat, ruotsi (89.31+)
alternative label: Oikeakielisyysoppaat, suomenruotsi (89.31+)
alternative label: Puhekieli, ruotsi (89.31+)
alternative label: Ruotsin kieli (89.31+)
alternative label: Sanasto-oppi, ruotsi (89.31+)
alternative label: Selkokieli, ruotsi (89.31+)
alternative label: Skriftlig kommunikation, svenska (89.31+) @sv
alternative label: Skriftspråk, finska (89.31+) @sv
alternative label: Språkriktighetshandböcker, finlandssvenska (89.31+) @sv
alternative label: Språkriktighetshandböcker, svenska (89.31+) @sv
alternative label: Språkvård, svenska (89.31+) @sv
alternative label: Stilistik, svenska (89.31+) @sv
alternative label: Suomenruotsi (89.31+)
alternative label: Svenska (89.31+) @sv
alternative label: Talspråk, svenska (89.31+) @sv
alternative label: Tyylioppi, ruotsin kieli (89.31+)
alternative label: Uppsatshandledning, svenska (89.31) @sv
alternative label: Verkkokirjoittaminen, oikeakielisyysopaat, ruotsin kieli (89.31+)
broader: Pohjoismaiset kielet
in scheme: YKL - Yleisten kirjastojen luokitusjärjestelmä
narrower: Ruotsin kielen kielioppi, muoto-oppi ja sanaoppi
narrower: Ruotsin kielen äänneoppi
narrower: Ruotsin kielen murteet
narrower: Ruotsin kielen etymologia ja onomastiikka
notation: 89.31
preferred label: Svenska @sv
preferred label: Swedish @en
scope note: Hit allmänna verk om svenska eller om forskning i svenska. Skriftspråk. Talspråk. Verk om lättläst litteratur. Språkriktighet. Språkvård. Handböcker i språkriktighet. Handböcker i uppsatsskrivning. Stilistik och stilistikforskning ur språkvetenskaplig synvinkel. Lexikologi. Språksociologi. Sociolingvistik. Språkpolitik. Hit också text- och läseböcker för studier i svenska med förklaringar och ordlistor. Hit och till underklasserna också finlandssvenska. Allmänna svenska ordböcker 89.31038. Svenska uppsatssamlingar 89.3104. Allmänna läro- och övningsböcker i svenska 89.3107. Språkläroböcker som riktar sig till olika yrkesgrupper hit. Allmän svensk språkhistoria och allmän svensk språkforskningshistoria 89.3109 @sv
scope note: Tähän ruotsin kieltä tai sen tutkimusta koskevat yleisteokset. Kirjakieli. Puhekieli. Selkokieli. Oikeakielisyys. Kielenhuolto. Oikeakielisyysoppaat. Ainekirjoitusoppaat. Tyylioppi ja tyylintutkimus kielitieteen kannalta. Leksikologia. Kielisosiologia. Sosiolingvistiikka. Kielipolitiikka. Tähän myös ruotsin kielen opiskeluun liittyvät selityksillä tai sanastolla varustetut lukemistot ja lukukirjat. Tähän ja alaluokkiin myös suomenruotsi. Ruotsin kielen yleiset sanakirjat 89.31038. Ruotsin kielen ainekokoelmat 89.3104. Ruotsin kielen yleiset oppi- ja harjoituskirjat 89.3107. Eri ammattialojen kielten oppikirjat tähän. Ruotsin kielen ja sen tutkimuksen yleinen historia 89.3109

Ruotsin kielen kielioppi, muoto-oppi ja sanaoppi
type: Concept
References: Kielioppi. Muoto-oppi. Sanaoppi
References: Ruotsin kielen murteet
References: Ruotsin kielen etymologia ja onomastiikka
type: YKL-luokka
alternative label: Böjning, svenska (89.313) @sv
alternative label: Formlära, svenska (89.313) @sv
alternative label: Grammatik, svenska (89.313) @sv
alternative label: Kasus, svenska (89.313) @sv
alternative label: Kielioppi, ruotsi (89.313)
alternative label: Lauseoppi, ruotsi (89.313)
alternative label: Morfologi, svenska (89.313) @sv
alternative label: Morfologia, ruotsin kieli (89.313)
alternative label: Muoto-oppi, ruotsin kieli (89.313)
alternative label: Ordbildning, svenska (89.313) @sv
alternative label: Ordklasser, svenska (89.313) @sv
alternative label: Ordlära, svenska (89.313) @sv
alternative label: Sanaluokat, ruotsi (89.313)
alternative label: Sananmuodostus, ruotsi (89.313)
alternative label: Sanaoppi, ruotsi (89.313)
alternative label: Satslära, svenska (89.313) @sv
alternative label: Sijamuodot, ruotsin kieli (89.313)
alternative label: Syntaksi, ruotsin kieli (89.313)
alternative label: Syntax, svenska (89.313) @sv
alternative label: Taivutus, ruotsi (89.313)
broader: Ruotsin kieli
in scheme: YKL - Yleisten kirjastojen luokitusjärjestelmä
notation: 89.313
preferred label: Svensk grammatik, morfologi och ordlära @sv
preferred label: Swedish grammar, morphology and lexicology @en
scope note: Ordklasser. Ordbildning. Böjning. Syntax @sv
scope note: Sanaluokat. Sananmuodostus. Taivutus. Lauseoppi eli syntaksi

Ruotsin kielen äänneoppi
type: Concept
References: Oppimisen psykologia
References: Erityisopetus. Erityiskasvatus, luku-, kirjoitus- ja puhehäiriöiset
References: Ilmaisutaito. Puhetaito. Lausuntataide
References: Äänneoppi
References: URN:NBN:fi:au:ykl:88.315
type: YKL-luokka
alternative label: Accent, svenska (89.314) @sv
alternative label: Aksentti, ruotsi (89.314)
alternative label: Betoning, svenska (89.314) @sv
alternative label: Fonetiikka, ruotsi (89.314)
alternative label: Fonetik, svenska (89.314) @sv
alternative label: Fonologi, svenska (89.314) @sv
alternative label: Fonologia, ruotsi (89.314)
alternative label: Intonaatio, ruotsi (89.314)
alternative label: Intonation, svenska (89.314) @sv
alternative label: Kombinaatio-oppi, ruotsi (89.314)
alternative label: Kombinatorik, svenska (89.314) @sv
alternative label: Konsonanter, svenska (89.314) @sv
alternative label: Konsonantit, ruotsi (89.314)
alternative label: Korko, ruotsin kieli (89.314)
alternative label: Kvantiteetti, ruotsin kieli (89.314)
alternative label: Kvantitet, svenska (89.314) @sv
alternative label: Ljudlära, svenska (89.314) @sv
alternative label: Paino, ruotsin kieli (89.314)
alternative label: Rytm, svenska (89.314) @sv
alternative label: Rytmi, ruotsin kieli (89.314)
alternative label: Tempo, ruotsin kieli (89.314)
alternative label: Tempo, svenska (89.314) @sv
alternative label: Vokaalit, ruotsi (89.314)
alternative label: Vokaler, svenska (89.314) @sv
alternative label: Äänneoppi, ruotsi (89.314)
broader: Ruotsin kieli
in scheme: YKL - Yleisten kirjastojen luokitusjärjestelmä
notation: 89.314
preferred label: Svensk ljudlära @sv
preferred label: Swedish phonetics @en
scope note: Fonetiikka. Fonologia Äänteet. Ääntäminen. Vokaalit. Konsonantit Kombinaatio-oppi. Kvantiteetti. Aksentti Äänteenmuutokset
scope note: Fonetik. Fonologi Ljud. Uttal. Vokaler. Konsonanter Kombinatorik. Kvantitet. Accent Ljudövergångar @sv

Ruotsin kielen murteet
type: Concept
References: KIELITIEDE
References: Ruotsin kieli
References: Ruotsin kielen etymologia ja onomastiikka
type: YKL-luokka
alternative label: Amerikanruotsi (89.315)
alternative label: Amerikasvenska (89.315) @sv
alternative label: Ammattikieli, ruotsi (89.315)
alternative label: Ammattislangit, ruotsi (89.315)
alternative label: Dialekter, svenska (89.315) @sv
alternative label: Dialektområden, svenska (89.315) @sv
alternative label: Fackspråk, svenska (89.315) @sv
alternative label: Murrealueet, ruotsi (89.315)
alternative label: Murteet, ruotsi (89.315)
alternative label: Slang, svenska (89.315) @sv
alternative label: Slangi, ruotsi (89.315)
alternative label: Yrkesjargonger, svenska (89.315) @sv
broader: Ruotsin kieli
in scheme: YKL - Yleisten kirjastojen luokitusjärjestelmä
notation: 89.315
preferred label: Svenska dialekter @sv
preferred label: Swedish dialects @en
scope note: Dialektforskning. Dialektområden Slang. Slangforskning. Regional och lokal slang Yrkesjargong och jargong inom olika branscher Hit också grammatik, form-, ord- och ljudlära samt etymologi och onomastik i dialekterna Svenska dialekt- och slangordböcker 89.315038 Svenska dialekt- och slangprovsamlingar 89.31504 @sv
scope note: Murretutkimus. Murrealueet Slangit. Slangitutkimus. Maantieteelliset slangit Eri ammattien ja alojen slangit Tähän myös murteiden kieli-, muoto-, sana- ja äänneoppi sekä etymologia ja onomastiikka Ruotsin kielen murre- ja slangisanakirjat 89.315038 Ruotsin kielen murre- ja slanginäytekokoelmat 89.31504

Ruotsin kielen etymologia ja onomastiikka
type: Concept
References: Etymologia. Onomastiikka
References: Ruotsin kielen murteet
type: YKL-luokka
alternative label: Etunimet, ruotsi (89.319)
alternative label: Etymologi, svenska (89.319) @sv
alternative label: Etymologia, ruotsi (89.319)
alternative label: Förnamn, svenska (89.319) @sv
alternative label: Henkilönnimitutkimus, ruotsi (89.319)
alternative label: Lainasanat, ruotsi, etymologia (89.319)
alternative label: Lånord, svenska, etymologi (89.319) @sv
alternative label: Metsäsuomalaiset, nimistö (89.319)
alternative label: Metsäsuomalaiset, nimistötiede (89.319)
alternative label: Namn, svenska (89.319) @sv
alternative label: Namnforskning, svenska (89.319) @sv
alternative label: Nimet, ruotsi (89.319)
alternative label: Nimistötiede, ruotsi (89.319)
alternative label: Onomastiikka, ruotsi (89.319)
alternative label: Onomastik, svenska (89.319) @sv
alternative label: Ordförklaringslära, svenska (89.319) @sv
alternative label: Ortnamnsforskning, svenska (89.319) @sv
alternative label: Paikannimitutkimus, ruotsi (89.319)
alternative label: Personnamnsforskning, svenska (89.319) @sv
alternative label: Ristimänimet, ruotsi (89.319)
alternative label: Sananselitysoppi, ruotsi (89.319)
alternative label: Skogsfinnar, namn (89.319) @sv
alternative label: Skogsfinnar, namnforskning (89.319) @sv
alternative label: Släktnamn, svenska (89.319) @sv
alternative label: Sukunimet, ruotsi (89.319)
broader: Ruotsin kieli
in scheme: YKL - Yleisten kirjastojen luokitusjärjestelmä
notation: 89.319
preferred label: Svensk etymologi och onomastik @sv
preferred label: Swedish etymology and onomastics @en
scope note: Ordförklaringslära. Namnvetenskap Ortnamnsforskning. Personnamnsforskning Svenska etymologiska ordböcker, namnordböcker och förnamnsböcker 89.319038 @sv
scope note: Sananselitysoppi. Nimistötiede Paikannimitutkimus. Henkilönnimitutkimus Ruotsin kielen etymologiset sanakirjat, nimisanakirjat ja etunimikirjat 89.319038

Norjan kieli
type: Concept
type: YKL-luokka
alternative label: Norjan kieli (89.32)
alternative label: Norska (89.32) @sv
broader: Pohjoismaiset kielet
in scheme: YKL - Yleisten kirjastojen luokitusjärjestelmä
notation: 89.32
preferred label: Norska @sv
preferred label: Norwegian @en

Tanskan kieli
type: Concept
type: YKL-luokka
alternative label: Danska (89.33) @sv
alternative label: Tanskan kieli (89.33)
broader: Pohjoismaiset kielet
in scheme: YKL - Yleisten kirjastojen luokitusjärjestelmä
notation: 89.33
preferred label: Danish @en
preferred label: Danska @sv

Islannin kieli
type: Concept
type: YKL-luokka
alternative label: Islannin kieli (89.34)
alternative label: Isländska (89.34) @sv
broader: Pohjoismaiset kielet
in scheme: YKL - Yleisten kirjastojen luokitusjärjestelmä
notation: 89.34
preferred label: Icelandic @en
preferred label: Isländska @sv

Fäärin kieli
type: Concept
type: YKL-luokka
alternative label: Färöiska (89.35) @sv
alternative label: Fäärin kieli (89.35)
broader: Pohjoismaiset kielet
in scheme: YKL - Yleisten kirjastojen luokitusjärjestelmä
notation: 89.35
preferred label: Faeroese @en
preferred label: Färöiska @sv

Germaaniset kielet
type: Concept
References: Pohjoismaiset kielet
References: Englannin kieli
type: YKL-luokka
alternative label: Germaaniset kielet (89.4+)
alternative label: Germanska språk (89.4+) @sv
alternative label: Gootin kieli (89.4)
alternative label: Gotiska språket (89.4) @sv
alternative label: Itägermaaniset kielet (89.4)
alternative label: Länsigermaaniset kielet (89.4+)
alternative label: Västgermanska språk (89.4+) @sv
alternative label: Östgermanska språk (89.4) @sv
broader: INDOEUROOPPALAISET KIELET. MUUT KIELET
in scheme: YKL - Yleisten kirjastojen luokitusjärjestelmä
narrower: Saksan kieli
narrower: Friisin kieli
narrower: Hollannin kieli
notation: 89.4
preferred label: Germanic languages @en
preferred label: Germanska språk @sv

Saksan kieli
type: Concept
type: YKL-luokka
alternative label: Saksan kieli (89.41)
alternative label: Tyska (89.41) @sv
broader: Germaaniset kielet
in scheme: YKL - Yleisten kirjastojen luokitusjärjestelmä
narrower: Jiddišin kieli
notation: 89.41
preferred label: German @en
preferred label: Tyska @sv

Jiddišin kieli
type: Concept
type: YKL-luokka
alternative label: Jiddisch (89.415) @sv
alternative label: Jiddish (89.415)
alternative label: Jiddiš (89.415)
alternative label: Jiddišin kieli (89.415)
broader: Saksan kieli
in scheme: YKL - Yleisten kirjastojen luokitusjärjestelmä
notation: 89.415
preferred label: Jiddisch @sv
preferred label: Yiddish @en

Friisin kieli
type: Concept
type: YKL-luokka
alternative label: Friisin kieli (89.43)
alternative label: Frisiska (89.43) @sv
broader: Germaaniset kielet
in scheme: YKL - Yleisten kirjastojen luokitusjärjestelmä
notation: 89.43
preferred label: Frisian @en
preferred label: Frisiska @sv

Hollannin kieli
type: Concept
type: YKL-luokka
alternative label: Afrikaans (89.48) @sv
alternative label: Afrikaansin kieli (89.48)
alternative label: Flaamin kieli (89.48)
alternative label: Flamländska (89.48) @sv
alternative label: Hollannin kieli (89.48)
alternative label: Holländska (89.48) @sv
alternative label: Nederländska (89.48) @sv
broader: Germaaniset kielet
in scheme: YKL - Yleisten kirjastojen luokitusjärjestelmä
notation: 89.48
preferred label: Dutch @en
preferred label: Nederländska @sv
scope note: Hit också flamländska och afrikaans @sv
scope note: Tähän myös flaamin ja afrikaansin kieli

Englannin kieli
type: Concept
type: YKL-luokka
alternative label: Engelska (89.5+) @sv
alternative label: Englannin kieli (89.5+)
broader: INDOEUROOPPALAISET KIELET. MUUT KIELET
in scheme: YKL - Yleisten kirjastojen luokitusjärjestelmä
notation: 89.5
preferred label: Engelska @sv
preferred label: English @en
scope note: Eri ammattialojen kielten oppikirjat tähän.
scope note: Språkläroböcker som riktar sig till olika yrkesgrupper hit. @sv

Romaaniset kielet
type: Concept
type: YKL-luokka
alternative label: Romaaniset kielet (89.6+)
alternative label: Romanska språk (89.6+) @sv
broader: INDOEUROOPPALAISET KIELET. MUUT KIELET
in scheme: YKL - Yleisten kirjastojen luokitusjärjestelmä
narrower: Ranskan kieli
narrower: Italian kieli
narrower: Espanjan kieli
narrower: Portugalin kieli
narrower: Romanian kieli
narrower: Muut romaaniset kielet
notation: 89.6
preferred label: Romanic languages @en
preferred label: Romanska språk @sv

Ranskan kieli
type: Concept
type: YKL-luokka
alternative label: Franska (89.61) @sv
alternative label: Ranskan kieli (89.61)
broader: Romaaniset kielet
in scheme: YKL - Yleisten kirjastojen luokitusjärjestelmä
notation: 89.61
preferred label: Franska @sv
preferred label: French @en

Italian kieli
type: Concept
type: YKL-luokka
alternative label: Italian kieli (89.62)
alternative label: Italienska (89.62) @sv
broader: Romaaniset kielet
in scheme: YKL - Yleisten kirjastojen luokitusjärjestelmä
notation: 89.62
preferred label: Italian @en
preferred label: Italienska @sv

Espanjan kieli
type: Concept
type: YKL-luokka
alternative label: Amerika, spanska språket (89.63) @sv
alternative label: Amerikanespanja (89.63)
alternative label: Amerikansk spanska (89.63) @sv
alternative label: Amerikka, espanjan kieli (89.63)
alternative label: Espanjan kieli (89.63)
alternative label: Spanska (89.63) @sv
broader: Romaaniset kielet
in scheme: YKL - Yleisten kirjastojen luokitusjärjestelmä
notation: 89.63
preferred label: Spanish @en
preferred label: Spanska @sv

Portugalin kieli
type: Concept
type: YKL-luokka
alternative label: Amerikanportugali (89.64)
alternative label: Amerikansk portugisiska (89.64) @sv
alternative label: Portugalin kieli (89.64)
alternative label: Portugisiska (89.64) @sv
broader: Romaaniset kielet
in scheme: YKL - Yleisten kirjastojen luokitusjärjestelmä
notation: 89.64
preferred label: Portugisiska @sv
preferred label: Portuguese @en

Romanian kieli
type: Concept
type: YKL-luokka
alternative label: Romanian kieli (89.65)
alternative label: Rumänska (89.65) @sv
broader: Romaaniset kielet
in scheme: YKL - Yleisten kirjastojen luokitusjärjestelmä
notation: 89.65
preferred label: Romanian @en
preferred label: Rumänska @sv

Muut romaaniset kielet
type: Concept
type: YKL-luokka
alternative label: Dalmatian kieli (89.67)
alternative label: Dalmatiska (89.67) @sv
alternative label: Galego (89.67) @sv
alternative label: Galegon kieli (89.67)
alternative label: Galician kieli (89.67)
alternative label: Galiciska (89.67) @sv
alternative label: Katalaanin kieli (89.67)
alternative label: Katalanska (89.67) @sv
alternative label: Ladinin kieli (89.67)
alternative label: Ladiniska (89.67) @sv
alternative label: Ladinon kieli (89.67)
alternative label: Ladinska (89.67) @sv
alternative label: Moldavian kieli (89.67)
alternative label: Moldaviska (89.67) @sv
alternative label: Occitanska (89.67) @sv
alternative label: Oksitaanin kieli (89.67)
alternative label: Provensaalin kieli (89.67)
alternative label: Provensalska (89.67) @sv
alternative label: Retoromaanin kieli (89.67)
alternative label: Rätoromanska (89.67) @sv
alternative label: Sardin kieli (89.67)
alternative label: Sardiska (89.67) @sv
broader: Romaaniset kielet
in scheme: YKL - Yleisten kirjastojen luokitusjärjestelmä
notation: 89.67
preferred label: Other Romanic languages @en
preferred label: Övriga romanska språk @sv
scope note: Galician, katalaanin, ladinin, ladinon, moldavian, oksitaanin, retoromaanin ja sardin kieli
scope note: Galiciska, katalanska, ladinska, ladino, moldaviska, provensalska, rätoromanska och sardiska @sv

Slaavilaiset ja balttilaiset kielet
type: Concept
type: YKL-luokka
alternative label: Kirkkoslaavi (89.7)
alternative label: Kyrkoslaviska (89.7) @sv
alternative label: Slaavilaiset kielet (89.7+)
alternative label: Slaviska språk (89.7+) @sv
alternative label: Sorbin kieli (89.7)
alternative label: Sorbiska (89.7) @sv
broader: INDOEUROOPPALAISET KIELET. MUUT KIELET
in scheme: YKL - Yleisten kirjastojen luokitusjärjestelmä
narrower: Venäjän kieli
narrower: Ukrainan kieli. Valkovenäjän kieli
narrower: Puolan kieli
narrower: Tšekin kieli
narrower: Slovakin kieli
narrower: Eteläslaavilaiset kielet
narrower: Balttilaiset kielet
notation: 89.7
preferred label: Slaviska och baltiska språk @sv
preferred label: Slavonic and Baltic languages @en

Venäjän kieli
type: Concept
type: YKL-luokka
alternative label: Ryska (89.71) @sv
alternative label: Venäjän kieli (89.71)
broader: Slaavilaiset ja balttilaiset kielet
in scheme: YKL - Yleisten kirjastojen luokitusjärjestelmä
notation: 89.71
preferred label: Russian @en
preferred label: Ryska @sv

Ukrainan kieli. Valkovenäjän kieli
type: Concept
type: YKL-luokka
alternative label: Ukrainan kieli (89.72)
alternative label: Ukrainska (89.72) @sv
alternative label: Valkovenäjän kieli (89.72)
alternative label: Vitryska (89.72) @sv
broader: Slaavilaiset ja balttilaiset kielet
in scheme: YKL - Yleisten kirjastojen luokitusjärjestelmä
narrower: Ukrainan kieli
narrower: Valkovenäjän kieli
notation: 89.72
preferred label: Ukrainian. Belorussian @en
preferred label: Ukrainska. Vitryska @sv

Ukrainan kieli
type: Concept
type: YKL-luokka
alternative label: Ukrainan kieli (89.721)
alternative label: Ukrainska (89.721) @sv
broader: Ukrainan kieli. Valkovenäjän kieli
in scheme: YKL - Yleisten kirjastojen luokitusjärjestelmä
notation: 89.721
preferred label: Ukrainian @en
preferred label: Ukrainska @sv

Valkovenäjän kieli
type: Concept
type: YKL-luokka
alternative label: Valkovenäjän kieli (89.722)
alternative label: Vitryska (89.722) @sv
broader: Ukrainan kieli. Valkovenäjän kieli
in scheme: YKL - Yleisten kirjastojen luokitusjärjestelmä
notation: 89.722
preferred label: Belorussian @en
preferred label: Vitryska @sv

Puolan kieli
type: Concept
type: YKL-luokka
alternative label: Polska, språket (89.73) @sv
alternative label: Puolan kieli (89.73)
broader: Slaavilaiset ja balttilaiset kielet
in scheme: YKL - Yleisten kirjastojen luokitusjärjestelmä
notation: 89.73
preferred label: Polish @en
preferred label: Polska @sv

Tšekin kieli
type: Concept
type: YKL-luokka
alternative label: Tjeckiska (89.74) @sv
alternative label: Tšekin kieli (89.74)
broader: Slaavilaiset ja balttilaiset kielet
in scheme: YKL - Yleisten kirjastojen luokitusjärjestelmä
notation: 89.74
preferred label: Czech @en
preferred label: Tjeckiska @sv

Slovakin kieli
type: Concept
type: YKL-luokka
alternative label: Slovakin kieli (89.75)
alternative label: Slovakiska (89.75) @sv
broader: Slaavilaiset ja balttilaiset kielet
in scheme: YKL - Yleisten kirjastojen luokitusjärjestelmä
notation: 89.75
preferred label: Slovak @en
preferred label: Slovakiska @sv

Eteläslaavilaiset kielet
type: Concept
type: YKL-luokka
alternative label: Serbokroaatin kieli (89.76+)
alternative label: Serbokroatiska (89.76+) @sv
broader: Slaavilaiset ja balttilaiset kielet
in scheme: YKL - Yleisten kirjastojen luokitusjärjestelmä
narrower: Bulgarian kieli
narrower: Makedonian kieli
narrower: Sloveenin kieli
narrower: Serbian kieli
narrower: Kroatian kieli
narrower: Bosnian kieli
notation: 89.76
preferred label: South-Slavonic languages @en
preferred label: Sydslaviska språk @sv

Bulgarian kieli
type: Concept
type: YKL-luokka
alternative label: Bulgarian kieli (89.761)
alternative label: Bulgariska (89.761) @sv
broader: Eteläslaavilaiset kielet
in scheme: YKL - Yleisten kirjastojen luokitusjärjestelmä
notation: 89.761
preferred label: Bulgarian @en
preferred label: Bulgariska @sv

Makedonian kieli
type: Concept
type: YKL-luokka
alternative label: Makedonian kieli (89.762)
alternative label: Makedoniska (89.762) @sv
broader: Eteläslaavilaiset kielet
in scheme: YKL - Yleisten kirjastojen luokitusjärjestelmä
notation: 89.762
preferred label: Macedonian @en
preferred label: Makedonska @sv

Sloveenin kieli
type: Concept
type: YKL-luokka
alternative label: Sloveenin kieli (89.763)
alternative label: Slovenska (89.763) @sv
broader: Eteläslaavilaiset kielet
in scheme: YKL - Yleisten kirjastojen luokitusjärjestelmä
notation: 89.763
preferred label: Slovenian @en
preferred label: Slovenska @sv

Serbian kieli
type: Concept
type: YKL-luokka
alternative label: Serbian kieli (89.764)
alternative label: Serbiska (89.764) @sv
broader: Eteläslaavilaiset kielet
in scheme: YKL - Yleisten kirjastojen luokitusjärjestelmä
notation: 89.764
preferred label: Serbian @en
preferred label: Serbiska @sv

Kroatian kieli
type: Concept
type: YKL-luokka
alternative label: Kroaatin kieli (89.765)
alternative label: Kroatian kieli (89.765)
alternative label: Kroatiska (89.765) @sv
broader: Eteläslaavilaiset kielet
in scheme: YKL - Yleisten kirjastojen luokitusjärjestelmä
notation: 89.765
preferred label: Croatian @en
preferred label: Kroatiska @sv

Bosnian kieli
type: Concept
type: YKL-luokka
alternative label: Bosnian kieli (89.766)
alternative label: Bosniska (89.766) @sv
broader: Eteläslaavilaiset kielet
in scheme: YKL - Yleisten kirjastojen luokitusjärjestelmä
notation: 89.766
preferred label: Bosnian @en
preferred label: Bosniska @sv

Balttilaiset kielet
type: Concept
type: YKL-luokka
alternative label: Baltiska språk (89.78+) @sv
alternative label: Balttilaiset kielet (89.78+)
broader: Slaavilaiset ja balttilaiset kielet
in scheme: YKL - Yleisten kirjastojen luokitusjärjestelmä
narrower: Latvian kieli
narrower: Liettuan kieli
notation: 89.78
preferred label: Baltic languages @en
preferred label: Baltiska språk @sv

Latvian kieli
type: Concept
type: YKL-luokka
alternative label: Latvian kieli (89.781)
alternative label: Lettiska (89.781) @sv
alternative label: Lätin kieli (89.781)
broader: Balttilaiset kielet
in scheme: YKL - Yleisten kirjastojen luokitusjärjestelmä
notation: 89.781
preferred label: Latvian @en
preferred label: Lettiska @sv

Liettuan kieli
type: Concept
type: YKL-luokka
alternative label: Liettuan kieli (89.782)
alternative label: Litauiska (89.782) @sv
broader: Balttilaiset kielet
in scheme: YKL - Yleisten kirjastojen luokitusjärjestelmä
notation: 89.782
preferred label: Litauiska @sv
preferred label: Lithuanian @en

Muut indoeurooppalaiset kielet
type: Concept
type: YKL-luokka
alternative label: Armenian kieli (89.8)
alternative label: Armenien, språk (89.8) @sv
broader: INDOEUROOPPALAISET KIELET. MUUT KIELET
in scheme: YKL - Yleisten kirjastojen luokitusjärjestelmä
narrower: Kreikan kieli
narrower: Latinan kieli
narrower: Indoiraaniset kielet
narrower: Albanian kieli
narrower: Kelttiläiset kielet
notation: 89.8
preferred label: Other Indo-European languages @en
preferred label: Övriga indoeuropeiska språk @sv
scope note: Hit armeniska @sv
scope note: Tähän armenian kieli

Kreikan kieli
type: Concept
type: YKL-luokka
alternative label: Grekiska, forngrekiska (89.81) @sv
alternative label: Kreikan kieli, muinaiskreikka (89.81)
broader: Muut indoeurooppalaiset kielet
in scheme: YKL - Yleisten kirjastojen luokitusjärjestelmä
narrower: Nykykreikan kieli
notation: 89.81
preferred label: Greek @en
preferred label: Grekiska @sv
scope note: Hit forngrekiska @sv
scope note: Tähän muinaiskreikan kieli

Nykykreikan kieli
type: Concept
type: YKL-luokka
alternative label: Grekiska, nygrekiska (89.812) @sv
alternative label: Kreikan kieli, nykykreikka (89.812)
alternative label: Nygrekiska (89.812) @sv
alternative label: Nykykreikan kieli (89.812)
broader: Kreikan kieli
in scheme: YKL - Yleisten kirjastojen luokitusjärjestelmä
notation: 89.812
preferred label: Modern Greek @en
preferred label: Nygrekiska @sv

Latinan kieli
type: Concept
type: YKL-luokka
alternative label: Kirkkolatina (89.82)
alternative label: Kyrkolatin (89.82) @sv
alternative label: Latin (89.82) @sv
alternative label: Latinan kieli (89.82)
broader: Muut indoeurooppalaiset kielet
in scheme: YKL - Yleisten kirjastojen luokitusjärjestelmä
notation: 89.82
preferred label: Latin @en
scope note: Eri ammattialojen kielten oppikirjat tähän.
scope note: Språkläroböcker som riktar sig till olika yrkesgrupper hit. @sv

Indoiraaniset kielet
type: Concept
type: YKL-luokka
alternative label: Afgaanin kieli (89.83)
alternative label: Afghanska (89.83) @sv
alternative label: Avestan kieli (89.83)
alternative label: Avestas språk (89.83) @sv
alternative label: Beluchi (89.83) @sv
alternative label: Belutsin kieli (89.83)
alternative label: Bengalin kieli (89.83)
alternative label: Bengaliska (89.83) @sv
alternative label: Bihari (89.83) @sv
alternative label: Biharin kieli (89.83)
alternative label: Gudzaratin kieli (89.83)
alternative label: Gujarati (89.83) @sv
alternative label: Gujaratin kieli (89.83)
alternative label: Hindi (89.83) @sv
alternative label: Hindin kieli (89.83)
alternative label: Indiska språk (89.83) @sv
alternative label: Indoiraaniset kielet (89.83+)
alternative label: Indoiranska språk (89.83+) @sv
alternative label: Intialaiset kielet (89.83)
alternative label: Iranilaiset kielet (89.83+)
alternative label: Iranska språk (89.83+) @sv
alternative label: Jaghnob, språket (89.83) @sv
alternative label: Jagnobin kieli (89.83)
alternative label: Kashmiriska (89.83) @sv
alternative label: Kasmirin kieli (89.83)
alternative label: Kurmandžin kieli (89.83)
alternative label: Kurmanji (89.83) @sv
alternative label: Marathi, språket (89.83) @sv
alternative label: Marathin kieli (89.83)
alternative label: Nepali (89.83) @sv
alternative label: Nepalin kieli (89.83)
alternative label: Orijan kieli (89.83)
alternative label: Oriya, språket (89.83) @sv
alternative label: Osseetin kieli (89.83)
alternative label: Ossetiska (89.83) @sv
alternative label: Pali, språket (89.83) @sv
alternative label: Palin kieli (89.83)
alternative label: Pandzabin kieli (89.83)
alternative label: Panjabi (89.83) @sv
alternative label: Pashto (89.83) @sv
alternative label: Pashtun kieli (89.83)
alternative label: Pashtunska (89.83) @sv
alternative label: Paštun kieli (89.83)
alternative label: Prakrit (89.83) @sv
alternative label: Prakritin kieli (89.83)
alternative label: Punjabi (89.83) @sv
alternative label: Punjabin kieli (89.83)
alternative label: Radzastanin kieli (89.83)
alternative label: Rajasthani (89.83) @sv
alternative label: Rajasthanin kieli (89.83)
alternative label: Romani (89.83) @sv
alternative label: Romanikieli (89.83)
alternative label: Romanin kieli (89.83)
alternative label: Romanispråk (89.83) @sv
alternative label: Sanskrit (89.83) @sv
alternative label: Sanskritin kieli (89.83)
alternative label: Singalesiska (89.83) @sv
alternative label: Singalin kieli (89.83)
alternative label: Sorani (89.83) @sv
alternative label: Soranin kieli (89.83)
alternative label: Tadzikin kieli (89.83)
alternative label: Tadzjikiska (89.83) @sv
alternative label: Urdu, språket (89.83) @sv
alternative label: Urdun kieli (89.83)
broader: Muut indoeurooppalaiset kielet
in scheme: YKL - Yleisten kirjastojen luokitusjärjestelmä
narrower: Persian kieli
narrower: Kurdin kieli
notation: 89.83
preferred label: Indo-Iranian languages @en
preferred label: Indoiranska språk @sv
scope note: Indiska språk. Iranska språk. Fornindiska och levande indiska språk. Bengaliska, bihari, gujarati, hindi, kashmiri, marathi, oriya, panjabi, prakrit, rajasthani, sanskrit, singalesiska och urdu. Romani. Baluchiska, jaghnob, kurdiska, ossetiska, pamir, pashto, persiska eller farsi och tadjikiska @sv
scope note: Intialaiset kielet. Iranilaiset kielet. Muinais- ja nykyintialaiset kielet. Bengalin, biharin, gudzaratin, hindin, kasmirin, marathin, orijan, prakritin, pandzabin, radzastanin, sanskriitin, singalin ja urdun kielet. Romanikieli. Afgaanin eli paštun kieli , belutsin, jagnobin, kurdin, osseetin, persian eli farsin ja tadzikin kieli

Persian kieli
type: Concept
type: YKL-luokka
alternative label: Farsi (89.831) @sv
alternative label: Farsin kieli (89.831)
alternative label: Pehlevi, språket (89.831) @sv
alternative label: Pehlevin kieli (89.831)
alternative label: Persian kieli (89.831)
alternative label: Persiska (89.831) @sv
broader: Indoiraaniset kielet
in scheme: YKL - Yleisten kirjastojen luokitusjärjestelmä
narrower: Darin kieli
notation: 89.831
preferred label: Persian @en
preferred label: Persiska @sv

Darin kieli
type: Concept
type: YKL-luokka
alternative label: Dari (89.8311) @sv
alternative label: Darin kieli (89.8311)
broader: Persian kieli
in scheme: YKL - Yleisten kirjastojen luokitusjärjestelmä
notation: 89.8311
preferred label: Dari @sv
preferred label: Dari language @en

Kurdin kieli
type: Concept
type: YKL-luokka
alternative label: Kurdin kieli (89.832)
alternative label: Kurdiska (89.832) @sv
broader: Indoiraaniset kielet
in scheme: YKL - Yleisten kirjastojen luokitusjärjestelmä
notation: 89.832
preferred label: Kurdish @en
preferred label: Kurdiska @sv

Albanian kieli
type: Concept
modified: 2026-02-24T13:26:14
type: YKL-luokka
alternative label: Albanian kieli (89.84)
alternative label: Albanska (89.84) @sv
broader: Muut indoeurooppalaiset kielet
in scheme: YKL - Yleisten kirjastojen luokitusjärjestelmä
notation: 89.84
preferred label: Albanian @en
preferred label: Albanska @sv

Kelttiläiset kielet
type: Concept
type: YKL-luokka
alternative label: Bretonin kieli (89.88)
alternative label: Bretonska (89.88) @sv
alternative label: Gaelin kieli (89.88)
alternative label: Gaeliska (89.88) @sv
alternative label: Iirin kieli (89.88)
alternative label: Iriska (89.88) @sv
alternative label: Keltiska språk (89.88) @sv
alternative label: Kelttiläiset kielet (89.88)
alternative label: Kymrin kieli (89.88)
alternative label: Kymriska (89.88) @sv
alternative label: Manx (89.88) @sv
alternative label: Manxin kieli (89.88)
alternative label: Walesin kieli (89.88)
alternative label: Walesiska (89.88) @sv
broader: Muut indoeurooppalaiset kielet
in scheme: YKL - Yleisten kirjastojen luokitusjärjestelmä
notation: 89.88
preferred label: Celtic languages @en
preferred label: Keltiska språk @sv
scope note: Bretonin, gaelin, iirin, kymrin ja manxin kieli
scope note: Bretonska, gaeliska, iriska, kymriska och manx @sv

Muut kielet
type: Concept
modified: 2026-02-20T12:50:51
type: YKL-luokka
broader: INDOEUROOPPALAISET KIELET. MUUT KIELET
in scheme: YKL - Yleisten kirjastojen luokitusjärjestelmä
narrower: Turkkilaiset kielet
narrower: Seemiläiset kielet
narrower: Afroaasialaiset kielet. Somalin kieli
narrower: Tiibetiläis-burmalaiset kielet
narrower: Japanin kieli. Korean kieli
narrower: Afrikan kielet
narrower: Eskimokielet. Amerikan alkuperäiskielet
narrower: Muut ei-indoeurooppalaiset kielet
notation: 89.9
preferred label: Other languages @en
preferred label: Övriga språk @sv

Turkkilaiset kielet
type: Concept
type: YKL-luokka
alternative label: Altailaiset kielet (89.91+)
alternative label: Altaiska språk (89.91+) @sv
alternative label: Azerbajdzjanska (89.91) @sv
alternative label: Azerin kieli (89.91)
alternative label: Basjkiriska (89.91) @sv
alternative label: Baskiirin kieli (89.91)
alternative label: Burjaatin kieli (89.91)
alternative label: Burjatiska (89.91) @sv
alternative label: Daguriska (89.91) @sv
alternative label: Dahurin kieli (89.91)
alternative label: Gagauzin kieli (89.91)
alternative label: Gagauziska (89.91) @sv
alternative label: Jakutiska (89.91) @sv
alternative label: Jakuutin kieli (89.91)
alternative label: Kalmuckiska (89.91) @sv
alternative label: Kalmukin kieli (89.91)
alternative label: Kasakin kieli (89.91)
alternative label: Kazakin kieli (89.91)
alternative label: Kazakiska (89.91) @sv
alternative label: Kirgiisin kieli (89.91)
alternative label: Kirgisiska (89.91) @sv
alternative label: Manchu, språket (89.91) @sv
alternative label: Mantsun kieli (89.91)
alternative label: Oiraattin kieli (89.91)
alternative label: Oiratiska (89.91) @sv
alternative label: Tataarikielet (89.91)
alternative label: Tatarspråk (89.91) @sv
alternative label: Tjuvasjiska (89.91) @sv
alternative label: Tsuvassin kieli (89.91)
alternative label: Turkiska språk (89.91) @sv
alternative label: Turkkilaiset kielet (89.91)
alternative label: Turkmeenin kieli (89.91)
alternative label: Turkmeniska (89.91) @sv
alternative label: Uiguriska (89.91) @sv
alternative label: Uiguurin kieli (89.91)
alternative label: Uzbekin kieli (89.91)
alternative label: Uzbekiska (89.91) @sv
broader: Muut kielet
in scheme: YKL - Yleisten kirjastojen luokitusjärjestelmä
narrower: Turkin kieli
notation: 89.91
preferred label: Turkic languages @en
preferred label: Turkiska språk @sv
scope note: Turkiska språk. Tungusiska språk. Azerbaidjanska, basjkiriska, gagauziska, jakutiska, kazakiska, kirgisiska, tatariska, tjuvasjiska, turkmenska, uiguriska och uzbekiska. Burjatiska, daguriska, kalmuckiska, mongoliska och oiratiska. Evenki (tungusiska) och manchu @sv
scope note: Turkkilaiset kielet. Tunguusikielet. Azerin, baskiirin, gagauzin, jakuutin, kazakin, kirgiisin, tataarin, tsuvassin, turkmeenin, uiguurin ja uzbekin kieli. Burjatin, dahurin, kalmukin, mongolin ja oiraattin kieli. Tunguusin ja mantsun kieli

Turkin kieli
type: Concept
type: YKL-luokka
alternative label: Turkin kieli (89.911)
alternative label: Turkiska (89.911) @sv
broader: Turkkilaiset kielet
in scheme: YKL - Yleisten kirjastojen luokitusjärjestelmä
notation: 89.911
preferred label: Turkish @en
preferred label: Turkiska @sv

Seemiläiset kielet
type: Concept
type: YKL-luokka
alternative label: Akkadin kieli (89.92)
alternative label: Akkadiska (89.92) @sv
alternative label: Amharan kieli (89.92)
alternative label: Amhariska (89.92) @sv
alternative label: Aramean kieli (89.92)
alternative label: Arameiska (89.92) @sv
alternative label: Assyrialais-babylonialaiset kielet (89.92)
alternative label: Assyrisk-babyloniska språk (89.92) @sv
alternative label: Feniciska (89.92) @sv
alternative label: Foinikian kieli (89.92)
alternative label: Gurage, språket (89.92) @sv
alternative label: Guragen kieli (89.92)
alternative label: Harari (89.92) @sv
alternative label: Hararin kieli (89.92)
alternative label: Maltan kieli (89.92)
alternative label: Maltesiska (89.92) @sv
alternative label: Seemiläiset kielet (89.92+)
alternative label: Semitiska språk (89.92+) @sv
alternative label: Syriska (89.92) @sv
alternative label: Syyrian kieli (89.92)
alternative label: Tigre, språket (89.92) @sv
alternative label: Tigren kieli (89.92)
alternative label: Tigrinja, språket (89.92) @sv
alternative label: Tigrinjan kieli (89.92)
broader: Muut kielet
in scheme: YKL - Yleisten kirjastojen luokitusjärjestelmä
narrower: Heprean kieli
narrower: Arabian kieli
notation: 89.92
preferred label: Semitic languages @en
preferred label: Semitiska språk @sv
scope note: Amharaiska, arameiska, gurageiska, harari, maltesiska, syriska, tigré och tigrinja @sv
scope note: Amharan, aramean, guragen, hararin, maltan, syyrian, tigren ja tigrinjan kieli

Heprean kieli
type: Concept
type: YKL-luokka
alternative label: Hebreiska (89.922) @sv
alternative label: Heprean kieli (89.922)
broader: Seemiläiset kielet
in scheme: YKL - Yleisten kirjastojen luokitusjärjestelmä
notation: 89.922
preferred label: Hebreiska @sv
preferred label: Hebrew @en

Arabian kieli
type: Concept
type: YKL-luokka
alternative label: Arabian kieli (89.923)
alternative label: Arabiska (89.923) @sv
broader: Seemiläiset kielet
in scheme: YKL - Yleisten kirjastojen luokitusjärjestelmä
notation: 89.923
preferred label: Arabic @en
preferred label: Arabiska @sv

Afroaasialaiset kielet. Somalin kieli
type: Concept
type: YKL-luokka
alternative label: Afroaasialaiset kielet (89.93)
alternative label: Afroasiatiska språk (89.93) @sv
alternative label: Berberikielet (89.93)
alternative label: Berberspråk (89.93) @sv
alternative label: Egyptin kieli, muinainen (89.93)
alternative label: Egyptiska, fornegyptiska (89.93) @sv
alternative label: Hausa (89.93) @sv
alternative label: Hausan kieli (89.93)
alternative label: Koptin kieli (89.93)
alternative label: Koptiska (89.93) @sv
alternative label: Kushitiska språk (89.93) @sv
alternative label: Kusiittikielet (89.93)
alternative label: Kuusilaiset kielet (89.93)
alternative label: Somalin kieli (89.93)
alternative label: Somaliska (89.93) @sv
broader: Muut kielet
in scheme: YKL - Yleisten kirjastojen luokitusjärjestelmä
notation: 89.93
preferred label: Afroasiatic languages. Somali @en
preferred label: Afroasiatiska språk. Somaliska @sv
scope note: Berberikielet. Kuusilaiset kielet Hausan kieli. Somalin kieli
scope note: Berberispråk. Kushitiska språk. Hausa. Somaliska @sv

Tiibetiläis-burmalaiset kielet
type: Concept
type: YKL-luokka
alternative label: Burman kieli (89.94)
alternative label: Burmesiska (89.94) @sv
alternative label: Indokiinalaiset kielet (89.94+)
alternative label: Indokinesiska språk (89.94+) @sv
alternative label: Karenin kieli (89.94+)
alternative label: Karenska (89.94+) @sv
alternative label: Laon kieli (89.94)
alternative label: Laotiska (89.94) @sv
alternative label: Sinotibetanska språk (89.94+) @sv
alternative label: Sinotiibetiläiset kielet (89.94+)
alternative label: Tibetanska (89.94) @sv
alternative label: Tibeto-burmanska språk (89.94+) @sv
alternative label: Tiibetiläis-burmalaiset kielet (89.94+)
alternative label: Tiibetin kieli (89.94)
broader: Muut kielet
in scheme: YKL - Yleisten kirjastojen luokitusjärjestelmä
narrower: Kiinan kieli
narrower: Thain kieli
narrower: Vietnamin kieli
notation: 89.94
preferred label: Tibeto-Burman languages @en
preferred label: Tibeto-burmanska språk @sv
scope note: Burman, laon ja tiibetin kieli
scope note: Tibetanska, burmanska, laotiska @sv

Kiinan kieli
type: Concept
type: YKL-luokka
alternative label: Kiinan kieli (89.943)
alternative label: Kinesiska (89.943) @sv
broader: Tiibetiläis-burmalaiset kielet
in scheme: YKL - Yleisten kirjastojen luokitusjärjestelmä
notation: 89.943
preferred label: Chinese @en
preferred label: Kinesiska @sv

Thain kieli
type: Concept
type: YKL-luokka
alternative label: Thai (89.946) @sv
alternative label: Thain kieli (89.946)
broader: Tiibetiläis-burmalaiset kielet
in scheme: YKL - Yleisten kirjastojen luokitusjärjestelmä
notation: 89.946
preferred label: Thai @en
preferred label: Thailändska @sv

Vietnamin kieli
type: Concept
type: YKL-luokka
alternative label: Annamin kieli (89.948)
alternative label: Annamitiska (89.948) @sv
alternative label: Vietnamesiska (89.948) @sv
alternative label: Vietnamin kieli (89.948)
broader: Tiibetiläis-burmalaiset kielet
in scheme: YKL - Yleisten kirjastojen luokitusjärjestelmä
notation: 89.948
preferred label: Vietnamese @en
preferred label: Vietnamesiska @sv

Japanin kieli. Korean kieli
type: Concept
type: YKL-luokka
broader: Muut kielet
in scheme: YKL - Yleisten kirjastojen luokitusjärjestelmä
narrower: Japanin kieli
narrower: Korean kieli
notation: 89.95
preferred label: Japanese. Korean @en
preferred label: Japanska. Koreanska @sv

Japanin kieli
type: Concept
type: YKL-luokka
alternative label: Japanin kieli (89.951)
alternative label: Japanska (89.951) @sv
broader: Japanin kieli. Korean kieli
in scheme: YKL - Yleisten kirjastojen luokitusjärjestelmä
notation: 89.951
preferred label: Japanese @en
preferred label: Japanska @sv

Korean kieli
type: Concept
type: YKL-luokka
alternative label: Korean kieli (89.955)
alternative label: Koreanska (89.955) @sv
broader: Japanin kieli. Korean kieli
in scheme: YKL - Yleisten kirjastojen luokitusjärjestelmä
notation: 89.955
preferred label: Korean @en
preferred label: Koreanska @sv

Afrikan kielet
type: Concept
type: YKL-luokka
alternative label: Afrika, ursprungsspråk (89.96) @sv
alternative label: Afrikka, alkuperäiskielet (89.96)
alternative label: Bantukielet (89.96)
alternative label: Bantuspråk (89.96) @sv
alternative label: Bushmanspråk (89.96) @sv
alternative label: Busmannikielet (89.96)
alternative label: Hottentottikielet (89.96)
alternative label: Hottentottspråk (89.96) @sv
alternative label: Khoisankielet (89.96)
alternative label: Khoisaspråk (89.96) @sv
alternative label: Sudanilaiset kielet (89.96)
alternative label: Sudanska språk (89.96) @sv
alternative label: Swahili (89.96) @sv
alternative label: Swahilin kieli (89.96)
broader: Muut kielet
in scheme: YKL - Yleisten kirjastojen luokitusjärjestelmä
notation: 89.96
preferred label: African languages @en
preferred label: Afrikanska språk @sv
scope note: Hit afrikanska språk som talas söder om Sahara, Etiopien och Somalia Sudanska språk. Bantuspråk. Xhosaspråk. Bushmanspråk. Hottentottspråk. Swahili @sv
scope note: Tähän Saharan, Etiopian ja Somalian eteläpuolella puhutut afrikkalaiset kielet Sudanilaiset kielet. Bantukielet. Khoisankielet. Busmannikielet. Hottentottikielet. Swahilin kieli

Eskimokielet. Amerikan alkuperäiskielet
type: Concept
type: YKL-luokka
alternative label: Aleutin kieli (89.98)
alternative label: Aleutiska (89.98) @sv
alternative label: Amerika, ursprungsspråk (89.98) @sv
alternative label: Amerikan alkuperäiskielet (89.98)
alternative label: Amerikka, alkuperäiskielet (89.98)
alternative label: Eskimokielet (89.98)
alternative label: Eskimåspråk (89.98) @sv
alternative label: Grönlannin kieli (89.98)
alternative label: Grönländska (89.98) @sv
alternative label: Inuit (89.98) @sv
alternative label: Inuitin kieli (89.98)
broader: Muut kielet
in scheme: YKL - Yleisten kirjastojen luokitusjärjestelmä
notation: 89.98
preferred label: Eskimo languages. Indigenous languages of the Americas @en
preferred label: Eskimåspråk. Amerikanska ursprungsspråk @sv
scope note: Grönlannin ja aleutin kieli
scope note: Grönländska och aleutiska @sv

Muut ei-indoeurooppalaiset kielet
type: Concept
type: YKL-luokka
alternative label: Ainu (89.99) @sv
alternative label: Ainun kieli (89.99)
alternative label: Australia, alkuperäiskielet (89.99)
alternative label: Australien, ursprungsspråk (89.99) @sv
alternative label: Austroaasialaiset kielet (89.99)
alternative label: Austroasiatiska språk (89.99) @sv
alternative label: Avaarin kieli (89.99)
alternative label: Avariska (89.99) @sv
alternative label: Baskin kieli (89.99)
alternative label: Baskiska (89.99) @sv
alternative label: Dravidakielet (89.99)
alternative label: Dravidiska språk (89.99) @sv
alternative label: Etruskin kieli (89.99)
alternative label: Etruskiska (89.99) @sv
alternative label: Georgian kieli (89.99)
alternative label: Georgiska (89.99) @sv
alternative label: Grusiska (89.99) @sv
alternative label: Gruusian kieli (89.99)
alternative label: Indonesian kieli (89.99)
alternative label: Indonesiska (89.99) @sv
alternative label: Kaukasialaiset kielet (89.99)
alternative label: Kaukasiska språk (89.99) @sv
alternative label: Khmerin kieli (89.99)
alternative label: Khmeriska (89.99) @sv
alternative label: Kreolikielet (89.99)
alternative label: Kreolspråk (89.99) @sv
alternative label: Malaijikielet (89.99)
alternative label: Malaijipolynesialaiset kielet (89.99)
alternative label: Malajiska språk (89.99) @sv
alternative label: Malajo-polynesiska språk (89.99) @sv
alternative label: Melanesialaiset kielet (89.99)
alternative label: Melanesiska språk (89.99) @sv
alternative label: Mikronesialaiset kielet (89.99)
alternative label: Mikronesiska språk (89.99) @sv
alternative label: Mongolikielet (89.99)
alternative label: Mongoliska språk (89.99) @sv
alternative label: Mundakielet (89.99)
alternative label: Mundaspråk (89.99) @sv
alternative label: Oceaniens språk (89.99) @sv
alternative label: Oseanian kielet (89.99)
alternative label: Paleoaasialaiset kielet (89.99)
alternative label: Paleoasiatiska språk (89.99) @sv
alternative label: Papuakielet (89.99)
alternative label: Papuanska språk (89.99) @sv
alternative label: Pidginkielet (89.99)
alternative label: Pidginspråk (89.99) @sv
alternative label: Polynesialaiset kielet (89.99)
alternative label: Polynesiska språk (89.99) @sv
alternative label: Tagalog (89.99)
alternative label: Tamilin kieli (89.99)
alternative label: Tamiliska (89.99) @sv
alternative label: Telugu, språket (89.99) @sv
alternative label: Telugun kieli (89.99)
alternative label: Tjerkessiska (89.99) @sv
alternative label: Tjetjenska (89.99) @sv
alternative label: Tjuktjiska (89.99) @sv
alternative label: Tserkessin kieli (89.99)
alternative label: Tsetseenin kieli (89.99)
alternative label: Tsuktsin kieli (89.99)
alternative label: Tungusspråk (89.99) @sv
alternative label: Tunguusikielet (89.99)
broader: Muut kielet
in scheme: YKL - Yleisten kirjastojen luokitusjärjestelmä
narrower: Keinotekoiset kielet
narrower: Viittomakieli
notation: 89.99
preferred label: Other Non-Indoeuropean languages @en
preferred label: Övriga icke-indoeuropeiska språk @sv
scope note: Baskin kieli. Etruskin kieli Australian ja Oseanin kielet. Papuakielet Austro- ja paleoaasialaiset kielet Dravidakielet. Tamilin kieli. Tagalog Polynesialaiset kielet. Malaijipolynesialaiset kielet. Kaukasialaiset kielet Khmerin kieli. Georgian, tserkessin ja avaarin kieli Tähän myös pidgin- ja kreolikielet
scope note: Baskiska. Etruskiska Språk i Australien och Oceanien. Papuaspråk Austro- och paleoasiatiska språk Dravidiska språk. Tamiliska. Tagalog Polynesiska språk. Malajopolynesiska språk. Kaukasiska språk Khmer. Georgiska, tjerkessiska och avariska Hit också pidgin och kreolska @sv

Keinotekoiset kielet
type: Concept
References: Symbolit. Koodit. Merkkijärjestelmät
type: YKL-luokka
alternative label: Artificiella språk (89.991) @sv
alternative label: Bliss-kieli (89.991)
alternative label: Blissymboler (89.991) @sv
alternative label: Chifferspråk (89.991) @sv
alternative label: Esperanto (89.991) @sv
alternative label: Esperanton kieli (89.991)
alternative label: Ido (89.991) @sv
alternative label: Idon kieli (89.991)
alternative label: Keinotekoiset kielet (89.991)
alternative label: Konstgjorda språk (89.991) @sv
alternative label: Konstruoidut kielet (89.991)
alternative label: Latino sine flexione (89.991)
alternative label: Novial, kieli (89.991)
alternative label: Novial, språket (89.991) @sv
alternative label: Occidental, kieli (89.991)
alternative label: Occidental, språket (89.991) @sv
alternative label: Salakielet (89.991)
broader: Muut ei-indoeurooppalaiset kielet
in scheme: YKL - Yleisten kirjastojen luokitusjärjestelmä
notation: 89.991
preferred label: Artificial languages @en
preferred label: Artificiella språk @sv
scope note: Esperanto. Ido. Latino sine fleksione. Novial Salakielet
scope note: Esperanto. Ido. Latino sine flexione. Novial Chifferspråk @sv

Viittomakieli
type: Concept
References: Erityisopetus. Erityiskasvatus, kuulovammaiset
type: YKL-luokka
alternative label: AAC-menetelmät, viittomakieli (89.999)
alternative label: AKK-metoden, dövas teckenspråk (89.999) @sv
alternative label: Alternativ och kompletterande kommunikation, dövas teckenspråk (89.999) @sv
alternative label: Puhetta tukeva ja korvaava kommunikaatio, viittomakieli (89.999)
alternative label: Stödtecken (89.999) @sv
alternative label: Teckenspråk (89.999) @sv
alternative label: Tuettu kommunikointi, viittomakieli (89.999)
alternative label: Tukiviittomat (89.999)
alternative label: Viittomakieli (89.999)
broader: Muut ei-indoeurooppalaiset kielet
in scheme: YKL - Yleisten kirjastojen luokitusjärjestelmä
notation: 89.999
preferred label: Sign language @en
preferred label: Teckenspråk @sv

HISTORIA
type: Concept
type: YKL-luokka
in scheme: YKL - Yleisten kirjastojen luokitusjärjestelmä
narrower: HISTORIANTUTKIMUS. YLEINEN KULTTUURIHISTORIA YLEINEN SOTAHISTORIA. YLEINEN ARKEOLOGIA
narrower: MAAILMANHISTORIA. EUROOPAN HISTORIA
narrower: SUOMEN HISTORIA
narrower: POHJOISMAIDEN HISTORIA
narrower: KESKI-EUROOPAN HISTORIA
narrower: BRITTEINSAARTEN HISTORIA
narrower: ETELÄ-EUROOPAN HISTORIA
narrower: ITÄ-EUROOPAN HISTORIA
narrower: MUIDEN MAANOSIEN HISTORIA
narrower: HENKILÖ- JA SUKUHISTORIA
notation: 9
preferred label: HISTORY @en
top concept of: YKL - Yleisten kirjastojen luokitusjärjestelmä

HISTORIANTUTKIMUS. YLEINEN KULTTUURIHISTORIA YLEINEN SOTAHISTORIA. YLEINEN ARKEOLOGIA
type: Concept
References: Taloushistoria
References: KANSATIEDE. KULTTUURIANTROPOLOGIA
References: MAAILMANHISTORIA. EUROOPAN HISTORIA
References: SUOMEN HISTORIA
References: POHJOISMAIDEN HISTORIA
References: KESKI-EUROOPAN HISTORIA
References: BRITTEINSAARTEN HISTORIA
References: ETELÄ-EUROOPAN HISTORIA
References: ITÄ-EUROOPAN HISTORIA
References: MUIDEN MAANOSIEN HISTORIA
type: YKL-luokka
alternative label: Historia, historiantutkimus (90+)
alternative label: Historia, historieforskning (90+) @sv
alternative label: Historiakulttuuri (90+)
alternative label: Historiantutkimus (90+)
alternative label: Historiatieteet (90+)
alternative label: Historieforskning (90+) @sv
alternative label: Historiekultur (90+) @sv
alternative label: Historiska vetenskaper (90+) @sv
alternative label: Källkritik, historieforskning (90+) @sv
alternative label: Lähdekritiikki, historiantutkimus (90+)
broader: HISTORIA
in scheme: YKL - Yleisten kirjastojen luokitusjärjestelmä
narrower: Historialliset maailmankartat ja -kartastot
narrower: Historianfilosofia. Kulttuurifilosofia
narrower: Yleinen kulttuurihistoria
narrower: Yleinen sotahistoria
narrower: Yleinen arkeologia
narrower: Historian aputieteet
notation: 90
preferred label: HISTORICAL RESEARCH. GENERAL CULTURAL HISTORY. GENERAL MILITARY HISTORY. GENERAL ARCHAEOLOGY @en
preferred label: HISTORIEFORSKNING. ALLMÄN KULTURHISTORIA ALLMÄN KRIGSIHISTORIA. ALLMÄN ARKEOLOGI @sv
scope note: Hit allmänna verk om historia som rör t.ex. historieforskning, kulturhistoria och arkeologi samt världshistoria. Om verket innehåller både historia och geografi, ges företräde åt klass 4. Om verket innehåller både historia och etnologi, ges företräde åt klass 9. Specialområdens historia klassificeras enligt område Historieforskningens filosofi, teori och forskningsmetoder i allmänhet 90.01. Läroböcker i historia för grundskolan och gymnasiet till klass 90.07. Formtillägget 09 används inte i samband med klasserna 90-99.31 @sv
scope note: Tähän historian yleisteokset, jotka koskevat esim. sekä historiantutkimusta, kulttuurihistoriaa ja arkeologiaa että maailmanhistoriaa. Jos teoksessa on sekä historiaa että maantiedettä, annetaan etusija luokalle 4. Jos teoksessa on sekä historiaa että kansatiedettä, annetaan etusija luokalle 9. Erikoisalojen historia luokitetaan alan mukaan. Historiantutkimuksen filosofia, teoria ja tutkimusmenetelmät yleensä 90.01. Peruskoulun ja lukion historian oppikirjat luokkaan 90.07. Muotoluokkaa 09 ei käytetä luokkien 90-99.31 yhteydessä

Historialliset maailmankartat ja -kartastot
type: Concept
References: Maailmankartat ja -kartastot
type: YKL-luokka
alternative label: Atlakset, historialliset maailmankartat (90.02)
alternative label: Atlaser, historiska världskartor (90.02) @sv
alternative label: Historialliset kartat (90.02)
alternative label: Historialliset maailmankartat (90.02)
alternative label: Historiska kartor (90.02) @sv
alternative label: Historiska världskartor (90.02) @sv
alternative label: Kartastot, historialliset (90.02)
alternative label: Kartat, historialliset (90.02)
alternative label: Kartor, historiska (90.02) @sv
alternative label: Kartverk, historiska (90.02) @sv
alternative label: Maailmankartastot, historialliset (90.02)
alternative label: Världsatlaser, historiska (90.02) @sv
broader: HISTORIANTUTKIMUS. YLEINEN KULTTUURIHISTORIA YLEINEN SOTAHISTORIA. YLEINEN ARKEOLOGIA
in scheme: YKL - Yleisten kirjastojen luokitusjärjestelmä
notation: 90.02
preferred label: Historical world maps and atlases @en
preferred label: Historiska världskartor och kartverk @sv
scope note: Eri maanosien, maiden, alueiden ja aikakausien historialliset kartat luokitetaan ko. maanosan, maan, alueen tai aikakauden historiaan
scope note: Olika världsdelars, länders, regionens och tidsperioders historiska kartor klassificeras efter ifrågavarande världsdels, lands, regions eller tidsperiods historia @sv

Historianfilosofia. Kulttuurifilosofia
type: Concept
References: YLEINEN KULTTUURIPOLITIIKKA
References: FILOSOFIA
References: Tiedeoppi. Tieteenfilosofia
References: USKONNONFILOSOFIA
References: URN:NBN:fi:au:ykl:30.01
References: Elämäntapojen sosiologia. Kulttuurisosiologia
References: KANSATIEDE. KULTTUURIANTROPOLOGIA
References: URN:NBN:fi:au:ykl:90.01
References: Yleinen kulttuurihistoria
type: YKL-luokka
alternative label: Aatehistoria, historianfilosofia (90.1)
alternative label: Filosofi, historiefilosofi (90.1) @sv
alternative label: Filosofi, kulturfilosofi (90.1) @sv
alternative label: Filosofia, historianfilosofia (90.1)
alternative label: Filosofia, kulttuurifilosofia (90.1)
alternative label: Historianfilosofia (90.1)
alternative label: Historiefilosofi (90.1) @sv
alternative label: Humanism, kultur- och historiefilosofi (90.1) @sv
alternative label: Humanismi, kulttuuri- ja historianfilosofia (90.1)
alternative label: Högkultur, kulturfilosofi (90.1) @sv
alternative label: Idéhistoria, historiefilosofi (90.1) @sv
alternative label: Korkeakulttuuri, kulttuurifilosofia (90.1)
alternative label: Kulttuurielämä, kulttuurifilosofia (90.1)
alternative label: Kulttuurifilosofia (90.1)
alternative label: Kulttuurikehitys, kulttuurifilosofia (90.1)
alternative label: Kulttuurimorfologia, kulttuurifilosofia (90.1)
alternative label: Kulttuurimuodot, kulttuurifilosofia (90.1)
alternative label: Kulttuurinormit, kulttuurifilosofia (90.1)
alternative label: Kulttuurintutkimus, kulttuurifilosofia (90.1)
alternative label: Kulttuuripessimismi, kulttuurifilosofia (90.1)
alternative label: Kulturfilosofi (90.1) @sv
alternative label: Kulturformer, kulturfilosofi (90.1) @sv
alternative label: Kulturlivet, kulturfilosofi (90.1) @sv
alternative label: Kulturmorfologi, kulturfilosofi (90.1) @sv
alternative label: Kulturnormer, kulturfilosofi (90.1) @sv
alternative label: Kulturpessimism, kulturfilosofi (90.1) @sv
alternative label: Kulturutveckling, kulturfilosofi (90.1) @sv
alternative label: Kulturvetenskap, kulturfilosofi (90.1) @sv
alternative label: Populaarikulttuuri, kulttuurifilosofia (90.1)
alternative label: Populärkultur, kulturfilosofi (90.1) @sv
broader: HISTORIANTUTKIMUS. YLEINEN KULTTUURIHISTORIA YLEINEN SOTAHISTORIA. YLEINEN ARKEOLOGIA
in scheme: YKL - Yleisten kirjastojen luokitusjärjestelmä
notation: 90.1
preferred label: Historiefilosofi. Kulturfilosofi @sv
preferred label: Philosophy of history. Cultural philosophy @en
scope note: Hit filosofiska aspekter på kultur, kulturnormer, kulturformer, kulturutveckling, kulturhistoria och historia Kulturmorfologi Formtilläggen 01 och 09 används inte i samband med klassen 90.1 @sv
scope note: Tähän kulttuurin, kulttuurinormien, kulttuurimuotojen, kulttuurikehityksen, kulttuurihistorian ja historian filosofinen tarkastelu Kulttuurimorfologia Muotoluokkia 01 ja 09 ei käytetä luokan 90.1 yhteydessä

Yleinen kulttuurihistoria
type: Concept
References: YLEINEN KULTTUURIPOLITIIKKA
References: FILOSOFIA
References: URN:NBN:fi:au:ykl:16.09
References: URN:NBN:fi:au:ykl:20.09
References: Elämäntapojen sosiologia. Kulttuurisosiologia
References: Käytös- ja tapatieto
References: KANSATIEDE. KULTTUURIANTROPOLOGIA
References: Historianfilosofia. Kulttuurifilosofia
References: SUOMEN HISTORIA
alternative label: Aatehistoria, yl. (90.2)
alternative label: Aineellinen kulttuuri, kulttuurihistoria, yl. (90.2+)
alternative label: Andlig kultur, kulturhistoria (90.2+) @sv
alternative label: Arabialainen kulttuuri (90.2+)
alternative label: Arabisk kultur (90.2+) @sv
alternative label: Arabistiikka, kulttuurihistoria (90.2+)
alternative label: Arabistik, kulturhistoria (90.2+) @sv
alternative label: Begravningsskick, kulturhistoria (90.2) @sv
alternative label: Civilationshistoria (90.2+) @sv
alternative label: Dansbanor, kulturhistoria (90.2) @sv
alternative label: Esineellinen kulttuuri, kulttuurihistoria (90.2+)
alternative label: Festtradition, kulturhistoria (90.2) @sv
alternative label: Fästningar, kulturhistoria (90.2) @sv
alternative label: Hautaustavat, kulttuurihistoria (90.2)
alternative label: Henkinen kulttuuri, kulttuurihistoria (90.2+)
alternative label: Herrgårdar, kulturhistoria (90.2) @sv
alternative label: Högkultur, kulturhistoria (90.2+) @sv
alternative label: Idéhistoria, allm. (90.2) @sv
alternative label: Islam, kulttuuri (90.2+)
alternative label: Islam, kultur (90.2+) @sv
alternative label: Itämaiset kulttuurit (90.2)
alternative label: Juhlaperinne, kulttuurihistoria (90.2)
alternative label: Kartanot, kulttuurihistoria (90.2)
alternative label: Kaupunkikulttuuri, yleinen kulttuurihistoria (90.2)
alternative label: Korkeakulttuuri, kulttuurihistoria (90.2+)
alternative label: Kulttuurielämä, kulttuurihistoria (90.2+)
alternative label: Kulttuurihistoria (90.2+)
alternative label: Kulttuurikehitys, kulttuurihistoria (90.2+)
alternative label: Kulttuurintutkimus, kulttuurihistoria (90.2)
alternative label: Kulttuuriperintö, kaupungit yl. (90.2+)
alternative label: Kulttuuriperintö, kulttuurihistoria (90.2+)
alternative label: Kulturarv, kulturhistoria (90.2+) @sv
alternative label: Kulturarv, städer allm. (90.2+) @sv
alternative label: Kulturhistoria (90.2+) @sv
alternative label: Kulturlivet, kulturhistoria (90.2+) @sv
alternative label: Kulturutveckling, kulturhistoria (90.2+) @sv
alternative label: Kulturvetenskap, kulturhistoria (90.2) @sv
alternative label: Landsbygdskultur, allmän kulturhistoria (90.2) @sv
alternative label: Linnat, kulttuurihistoria (90.2)
alternative label: Linnoitukset, kulttuurihistoria (90.2)
alternative label: Länsimainen kulttuuri, kulttuurihistoria (90.2+)
alternative label: Maailmanperintökohteet, kulttuurihistoria (90.2)
alternative label: Maaseutukulttuuri, yleinen kulttuurihistoria (90.2)
alternative label: Materiell kultur, kulturhistoria, allm. (90.2+) @sv
alternative label: Nuuskaaminen, kulttuurihistoria (90.2)
alternative label: Orientalism, kulturhistoria (90.2+) @sv
alternative label: Orientalismi, kulttuurihistoria (90.2+)
alternative label: Orientalistiikka, kulttuurihistoria (90.2+)
alternative label: Orientalistik, kulturhistoria (90.2+) @sv
alternative label: Palatsit, kulttuurihistoria (90.2)
alternative label: Populaarikulttuuri, kulttuurihistoria (90.2+)
alternative label: Seurustelutavat, kulttuurihistoria (90.2+)
alternative label: Sivistyshistoria (90.2+)
alternative label: Sosiaalinen elämä, kulttuurihistoria (90.2+)
alternative label: Stadskultur, allmän kulturhistoria (90.2)
alternative label: Tanssilavat, kulttuurihistoria (90.2)
alternative label: Tapakulttuuri, kulttuurihistoria (90.2+)
alternative label: Tavat, kulttuurihistoria (90.2+)
alternative label: Tupakointi, kulttuurihistoria (90.2)
alternative label: Tyylihistoria, kulttuurihistoria (90.2+)
alternative label: Tyylikaudet, kulttuurihistoria (90.2+)
alternative label: Tyylisuunnat, kulttuurihistoria (90.2+)
alternative label: Tyylit, kulttuurihistoria (90.2+)
broader: HISTORIANTUTKIMUS. YLEINEN KULTTUURIHISTORIA YLEINEN SOTAHISTORIA. YLEINEN ARKEOLOGIA
in scheme: YKL - Yleisten kirjastojen luokitusjärjestelmä
narrower: Muoti ja muodin historia
narrower: Erotiikan historia
notation: 90.2
scope note: Hit allmänna verk om kulturhistoria Hit och till underklasserna forskning i och beskrivning av den materiella och andliga kulturens utveckling Hit och till underklasserna kulturarv från kulturhistoriens synvinkel Hit och till underklasserna också bildningens och kulturlivets samt sedernas,umgängesformernas och det sociala livets kulturhistoria Hit och till underklasserna också högkulturens och populärkulturens historia Hit och till underklasserna också allmän idéhistoria Enskilda världsdelars, länders, regionens eller tidsperioders kulturhistoria klassificeras till ifrågavarande världsdels, lands, regions eller tidsperiods historia Specialområdens kulturhistoria klassificeras enligt område Formtillägget 09 används inte i samband med klasserna 90-99.31 @sv
scope note: Tähän kulttuurihistorian yleisteokset Tähän ja alaluokkiin aineellisen ja henkisen kulttuurin kehityksen tutkiminen Tähän ja alaluokkiin kulttuuriperintö kulttuurihistorian kannalta Tähän ja alaluokkiin myös sivistys- ja kulttuurielämän sekä tapojen, seurustelumuotojen ja sosiaalisen elämän kulttuurihistoria Tähän ja alaluokkiin myös korkeakulttuurin ja populaarikulttuurin historia Tähän ja alaluokkiin myös yleinen aatehistoria Tietyn maanosan, maan, alueen tai aikakauden kulttuurihistoria luokitetaan ko. maanosan, maan, alueen tai aikakauden historiaan Erikoisalojen kulttuurihistoria luokitetaan alan mukaan Muotoluokkaa 09 ei käytetä luokkien 90-99.31 yhteydessä

Muoti ja muodin historia
type: Concept
References: Käytös- ja tapatieto
References: Kauneudenhoito. Ulkonäkö
References: Tekstiili- ja vaatetusteollisuus
References: Tekstiilitaide
type: YKL-luokka
alternative label: Doft, modets historia (90.21) @sv
alternative label: Dräkter, kulturhistoria (90.21) @sv
alternative label: Ehostus, kulttuurihistoria (90.21)
alternative label: Frisyrer, kulturhistoria (90.21) @sv
alternative label: Haute couture (90.21)
alternative label: Kampaukset, kulttuurihistoria (90.21)
alternative label: Kauneudenhoito, kulttuurihistoria (90.21)
alternative label: Kauneushoitolat, kulttuurihistoria (90.21)
alternative label: Kläddesigner (90.21) @sv
alternative label: Kläder, kulturhistoria (90.21) @sv
alternative label: Kläder, mode och modets historia (90.21) @sv
alternative label: Klädhistoria (90.21) @sv
alternative label: Klädsel, kulturhistoria (90.21) @sv
alternative label: Klädstilar, kulturhistoria (90.21) @sv
alternative label: Make up, kulttuurihistoria (90.21)
alternative label: Make up, kulturhistoria (90.21) @sv
alternative label: Makeup, kulturhistoria (90.21) @sv
alternative label: Meikkaus, kulttuurihistoria (90.21)
alternative label: Mode (90.21) @sv
alternative label: Mode, historia (90.21) @sv
alternative label: Mode, kulturhistoria (90.21) @sv
alternative label: Modedesign, historia (90.21) @sv
alternative label: Modeskapare, biografier och memoarer (90.21) @sv
alternative label: Modetecknare, biografier och memoarer (90.21) @sv
alternative label: Muoti (90.21)
alternative label: Muoti, historia (90.21)
alternative label: Muoti, kulttuurihistoria (90.21)
alternative label: Muotipiirtäjät, elämäkerrat ja muistelmat (90.21)
alternative label: Muotisuunnittelijat, elämäkerrat ja muistelmat (90.21)
alternative label: Muotisuunnittelu, historia (90.21)
alternative label: Pukeutuminen, kulttuurihistoria (90.21)
alternative label: Pukeutumistyylit, kulttuurihistoria (90.21)
alternative label: Pukuhistoria (90.21)
alternative label: Puvut, kulttuurihistoria (90.21)
alternative label: Skönhetssalonger, kulturhistoria (90.21) @sv
alternative label: Skönhetsvård, kulturhistoria (90.21) @sv
alternative label: Sminkning, kulturhistoria (90.21) @sv
alternative label: Stilar, modets historia (90.21) @sv
alternative label: Tekstiilit, muoti ja muodin historia (90.21)
alternative label: Textilier, mode och modets historia (90.21) @sv
alternative label: Tuoksu, muodin historia (90.21)
alternative label: Tyylit, muodin historia (90.21)
alternative label: Vaatesuunnittelijat (90.21)
alternative label: Vaatteet, kulttuurihistoria (90.21)
alternative label: Vaatteet, muoti ja muodin historia (90.21)
broader: Yleinen kulttuurihistoria
in scheme: YKL - Yleisten kirjastojen luokitusjärjestelmä
notation: 90.21
preferred label: Fashion and history of fashion @en
preferred label: Mode och modets historia @sv
scope note: Hit klädselns och klädstilarnas samt skönhetsvärdens, sminkningens och frisyrernas historia och kulturhistoria i olika världsdelar och länder samt under olika tidsperioden Hit även mode och modedesign samt modeskapares personhistoria och produktion oavsett land och tidsperiod Formtillägget 09 används inte i samband med klasserna 90-99.31 @sv
scope note: Tähän pukeutumisen ja pukeutumistyylien sekä kauneudenhoidon, meikkauksen ja kampausten historia ja kulttuurihistoria eri maanosissa ja maissa sekä eri aikakausina Tähän myös muoti ja muotisuunnittelu sekä muotisuunnittelijoiden henkilöhistoria ja tuotanto maasta ja aikakaudesta riippumatta Muotoluokkaa 09 ei käytetä luokkien 90-99.31 yhteydessä

Erotiikan historia
type: Concept
References: Persoonallisuuden psykologia
References: Seksologia
type: YKL-luokka
alternative label: Erotiikka, kulttuurihistoria (90.22)
alternative label: Erotik, kulturhistoria (90.22) @sv
alternative label: Seksuaalielämä, kulttuurihistoria (90.22)
alternative label: Sexualliv, kulturhistoria (90.22) @sv
broader: Yleinen kulttuurihistoria
in scheme: YKL - Yleisten kirjastojen luokitusjärjestelmä
notation: 90.22
preferred label: Erotikens historia @sv
preferred label: History of eroticism @en
scope note: Hit erotikens och sexualitetens historia och kulturhistoria i olika världsdelar och länder samt under olika tidsperioden Formtillägget 09 används inte i samband med klasserna 90-99.31 @sv
scope note: Tähän erotiikan ja seksuaalisuuden historia ja kulttuurihistoria eri maanosissa ja maissa sekä eri aikakausina Muotoluokkaa 09 ei käytetä luokkien 90-99.31 yhteydessä

Yleinen sotahistoria
type: Concept
References: URN:NBN:fi:au:ykl:32.2109
References: Rauhankysymys. Rauhantutkimus
References: Kansainvälinen oikeus
References: MAANPUOLUSTUS
References: URN:NBN:fi:au:ykl:39.09
References: URN:NBN:fi:au:ykl:39.109
References: MAAILMANHISTORIA. EUROOPAN HISTORIA
References: SUOMEN HISTORIA
References: Elämäkerrat. Muistelmat, sotamuistelmat
type: YKL-luokka
alternative label: Ilmasota, sotahistoria (90.3+)
alternative label: Kolmikymmenvuotinen sota, sotahistoria (90.3)
alternative label: Krig, krigshistoria (90.3+) @sv
alternative label: Krigshistoria (90.3+) @sv
alternative label: Krigshistoria, Europa (90.3+) @sv
alternative label: Krigstid, krigshistoria (90.3+) @sv
alternative label: Luftkrig, sotahistoria (90.3+) @sv
alternative label: Maailmansodat (90.3+)
alternative label: Militära operationer, krigshistoria (90.3+) @sv
alternative label: Operaatiot, sotahistoria (90.3+)
alternative label: Operationer, krigshistoria (90.3+) @sv
alternative label: Sodat, sotahistoria (90.3+)
alternative label: Sota-aika, sotahistoria (90.3+)
alternative label: Sotahistoria (90.3+)
alternative label: Sotahistoria, Eurooppa (90.3+)
alternative label: Sotilasoperaatiot, sotahistoria (90.3+)
alternative label: Trettioåriga kriget, krigshistoria (90.3) @sv
alternative label: Världskrigen (90.3+) @sv
broader: HISTORIANTUTKIMUS. YLEINEN KULTTUURIHISTORIA YLEINEN SOTAHISTORIA. YLEINEN ARKEOLOGIA
in scheme: YKL - Yleisten kirjastojen luokitusjärjestelmä
narrower: Ensimmäinen maailmansota 1914-1918
narrower: Toinen maailmansota 1939-1945
notation: 90.3
preferred label: Allmän krigshistoria @sv
preferred label: General military history @en
scope note: Hit allmänna verk om krigshistoria Hit också allmänna verk om Europas krigshistoria och verk som rör både Europas och någon annan världsdels krigshistoria Enskilda länders, regionens eller tidsperioders krigshistoria klassificeras efter ifrågavarande lands, regions eller tidsperiods historia Övriga världsdelars krigshistoria förs till klass 98+ Formtillägget 09 används inte i samband med klasserna 90-99.31 @sv
scope note: Tähän sotahistorian yleisteokset Tähän myös Euroopan sotahistorian yleisteokset ja teokset, jotka koskevat sekä Euroopan että jonkin muun maanosan sotahistoriaa Tietyn maan, alueen tai aikakauden sotahistoria luokitetaan järjestyksessä ko. maan, alueen tai aikakauden luokkaan Muiden maanosien sotahistoria sijoitetaan luokkaan 98+ Muotoluokkaa 09 ei käytetä luokkien 90-99.31 yhteydessä

Ensimmäinen maailmansota 1914-1918
type: Concept
References: Suomen historia, autonomian aika
References: Elämäkerrat. Muistelmat, sotamuistelmat
type: YKL-luokka
alternative label: Ensimmäinen maailmansota (90.34)
alternative label: Ensimmäinen maailmansota, Eurooppa (90.34)
alternative label: Första världskriget (90.34) @sv
alternative label: Första världskriget, Europa (90.34) @sv
alternative label: Ilmasota, I maailmansota (90.34)
alternative label: Krigshistoria, I världskriget (90.34) @sv
alternative label: Luftkrig, I världskriget (90.34) @sv
alternative label: Maailmansota, ensimmäinen (90.34)
alternative label: Maailmansota, ensimmäinen, Eurooppa (90.34)
alternative label: Sotahistoria, I maailmansota (90.34)
alternative label: Världskriget, första (90.34) @sv
alternative label: Världskriget, första, Europa (90.34) @sv
broader: Yleinen sotahistoria
in scheme: YKL - Yleisten kirjastojen luokitusjärjestelmä
notation: 90.34
preferred label: First World War 1914-1918 @en
preferred label: Första världskriget 1914-1918 @sv
scope note: Hit allmän historia om första världskriget Hit också allmänt om första världskrigets historia i Europa Första världskrigets historia ur ett enskilt lands synvinkel klassificeras till ifrågavarande lands historia Formtillägget 09 används inte i samband med klasserna 90-99.31 @sv
scope note: Tähän ensimmäisen maailmansodan yleinen historia Tähän myös ensimmäisen maailmansodan historia Euroopassa yleensä Ensimmäisen maailmansodan historia tietyn maan kannalta luokitetaan ko. maan historiaan Muotoluokkaa 09 ei käytetä luokkien 90-99.31 yhteydessä

Toinen maailmansota 1939-1945
type: Concept
References: URN:NBN:fi:au:ykl:32.209
References: URN:NBN:fi:au:ykl:32.2109
References: Suomen historia v. 1939-1945
References: Elämäkerrat. Muistelmat, sotamuistelmat
type: YKL-luokka
alternative label: Andra världskriget (90.35) @sv
alternative label: Andra världskriget, Europa (90.35) @sv
alternative label: Ilmasota, II maailmansota (90.35)
alternative label: Krigshistoria, II världskriget (90.35) @sv
alternative label: Luftkrig, IÍ världskriget (90.35) @sv
alternative label: Maailmansota, toinen (90.35)
alternative label: Maailmansota, toinen, Eurooppa (90.35)
alternative label: Sotahistoria, II maailmansota (90.35)
alternative label: Toinen maailmansota (90.35)
alternative label: Toinen maailmansota, Eurooppa (90.35)
alternative label: Världskriget, andra (90.35) @sv
alternative label: Världskriget, andra, Europa (90.35) @sv
broader: Yleinen sotahistoria
in scheme: YKL - Yleisten kirjastojen luokitusjärjestelmä
notation: 90.35
preferred label: Andra världskriget 1939-1945 @sv
preferred label: Second World War 1939-1945 @en
scope note: Hit allmän historia om andra världskriget Hit också allmänt om andra världskrigets historia i Europa Andra världskrigets historia ur ett enskilt lands synvinkel klassificeras till ifrågavarande lands historia Formtillägget 09 används inte i samband med klasserna 90-99.31 @sv
scope note: Tähän toisen maailmansodan yleinen historia Tähän myös toisen maailmansodan historia Euroopassa yleensä Toisen maailmansodan historia tietyn maan kannalta luokitetaan ko. maan historiaan Muotoluokkaa 09 ei käytetä luokkien 90-99.31 yhteydessä

Yleinen arkeologia
type: Concept
References: Ufot
References: URN:NBN:fi:au:ykl:69.6309
References: Yleinen kronologia ja kronografia
References: Vanha aika
References: Vanha aika, Egyptin historia
References: Vanha aika, antiikin historia
References: Suomen historia, esi- ja varhaishistoria
type: YKL-luokka
alternative label: Ajanmääritys, arkeologia, yl. (90.4)
alternative label: Arkeologi (90.4) @sv
alternative label: Arkeologia (90.4)
alternative label: Arkeologinen ajanmääritys (90.4)
alternative label: Arkeologinen stratigrafia (90.4)
alternative label: Arkeologiset kaivaukset (90.4)
alternative label: Arkeologisk stratigrafi (90.4) @sv
alternative label: Arkeologisk tidsbestämning (90.4) @sv
alternative label: Arkeologiska utgrävningar (90.4) @sv
alternative label: Esineellinen kulttuuri, arkeologia (90.4)
alternative label: Fornlämningar (90.4) @sv
alternative label: Forntidens människor, arkeologisk forskning (90.4) @sv
alternative label: Fornvetenskap (90.4) @sv
alternative label: Gravkammare, arkeologi (90.4) @sv
alternative label: Gravplatser, arkeologi (90.4) @sv
alternative label: Hautakammiot, arkeologia (90.4)
alternative label: Hautapaikat, arkeologia (90.4)
alternative label: Kaivaukset, arkeologia (90.4)
alternative label: Marinarkeologi (90.4) @sv
alternative label: Materiell kultur, arkeologi (90.4) @sv
alternative label: Meriarkeologia (90.4)
alternative label: Muinaisajan ihmiset, arkeologinen tutkimus (90.4)
alternative label: Muinaisjäännökset (90.4)
alternative label: Muinaistiede (90.4)
alternative label: Stratigrafi, arkeologi (90.4) @sv
alternative label: Stratigrafia, arkeologia (90.4)
alternative label: Tidsbestämning, arkeologi, allm. (90.4) @sv
alternative label: Undervattensarkeologi (90.4) @sv
alternative label: Utgrävningar, arkeologi (90.4) @sv
alternative label: Vedenalainen arkeologia (90.4)
broader: HISTORIANTUTKIMUS. YLEINEN KULTTUURIHISTORIA YLEINEN SOTAHISTORIA. YLEINEN ARKEOLOGIA
in scheme: YKL - Yleisten kirjastojen luokitusjärjestelmä
notation: 90.4
preferred label: Allmän arkeologi @sv
preferred label: General archaeology @en
scope note: Hit allmänna verk om arkeologi Arkeologiska utgrävningar Byggnader, boplatser och gravar samt föremålsfynd ur den arkeologiska forskningens synvinkel Arkeologisk datering och stratigrafi Hit också allmän marinarkeologi Enskilda världsdelars, länders, regioners eller tidsperioders arkeologi klassificeras till ifrågavarande världsdels, lands, regions eller tidsperiods historia Formtillägget 09 används inte i samband med klasserna 90-99.31 @sv
scope note: Tähän arkeologian yleisteokset Arkeologiset kaivaukset Rakennukset, asuin- ja hautapaikat sekä esinelöydöt arkeologisen tutkimuksen kannalta Arkeologinen ajanmääritys ja stratigrafia Tähän myös yleinen meriarkeologia Tietyn maanosan, maan, alueen tai aikakauden arkeologia luokitetaan ko. maanosan, maan, alueen tai aikakauden historiaan Muotoluokkaa 09 ei käytetä luokkien 90-99.31 yhteydessä

Historian aputieteet
type: Concept
References: Kirjoituksen historia. Paleografia. Epigrafia
References: URN:NBN:fi:au:ykl:90.01
References: Yleinen arkeologia
type: YKL-luokka
alternative label: Asiakirjat, diplomatiikka (90.5)
alternative label: Diplomatiikka (90.5)
alternative label: Diplomatik (90.5) @sv
alternative label: Handlingar, diplomatik (90.5) @sv
broader: HISTORIANTUTKIMUS. YLEINEN KULTTUURIHISTORIA YLEINEN SOTAHISTORIA. YLEINEN ARKEOLOGIA
in scheme: YKL - Yleisten kirjastojen luokitusjärjestelmä
narrower: Yleinen kronologia ja kronografia
narrower: Rahatiede. Mitalitiede
narrower: Vaakunatiede. Sinettitiede
narrower: Kunniamerkit. Arvonimet
notation: 90.5
preferred label: Auxiliary disciplines of history @en
preferred label: Historiska hjälpvetenskaper @sv
scope note: Hit allmänna verk om historiska hjälpvetenskaper Hit också diplomatik eller historisk forskning i dokument Formtillägget 09 används inte i samband med klasserna 90-99.31 @sv
scope note: Tähän historian aputieteitä koskevat yleisteokset Tähän myös diplomatiikka eli asiakirjojen historiallinen tutkimus Muotoluokkaa 09 ei käytetä luokkien 90-99.31 yhteydessä

Yleinen kronologia ja kronografia
type: Concept
References: Yleinen arkeologia
type: YKL-luokka
alternative label: Ajanmääritys, kronologia, yl. (90.51)
alternative label: Kronografi, historia (90.51) @sv
alternative label: Kronografia, historia (90.51)
alternative label: Kronologi, historia (90.51) @sv
alternative label: Kronologia, historia (90.51)
alternative label: Kronologiset taulukot, historia (90.51)
alternative label: Kronologiska tabeller, historia (90.51) @sv
alternative label: Tidsbestämning, kronologi, allm. (90.51) @sv
broader: Historian aputieteet
in scheme: YKL - Yleisten kirjastojen luokitusjärjestelmä
notation: 90.51
preferred label: Allmän kronologi och kronografi @sv
preferred label: General chronology and chronography @en
scope note: Hit också allmänna kronologiska tabeller Olika världsdelars, länders, regionens och tidsperioders kronologi, kronografi och kronologiska tabeller klassificeras till ifrågavarande världsdels, lands, regions eller tidsperiods historia Formtillägget 09 används inte i samband med klasserna 90-99.31 @sv
scope note: Tähän myös yleiset kronologiset taulukot Eri maanosien, maiden, alueiden ja aikakausien kronologia, kronografia ja kronologiset taulukot luokitetaan ko. maanosan, maan, alueen tai aikakauden historiaan Muotoluokkaa 09 ei käytetä luokkien 90-99.31 yhteydessä

Rahatiede. Mitalitiede
type: Concept
References: Raha. Valuutta
References: KUVANVEISTOTAIDE
type: YKL-luokka
alternative label: Kolikot, numismatiikka (90.52)
alternative label: Medaljer, samlande (90.52) @sv
alternative label: Medaljvetenskap (90.52) @sv
alternative label: Mitalit, keräily (90.52)
alternative label: Mitalitiede (90.52)
alternative label: Mynt, numismatik (90.52) @sv
alternative label: Numismatiikka (90.52)
alternative label: Numismatik (90.52) @sv
alternative label: Pengar, historia (90.52) @sv
alternative label: Pengar, samlande (90.52) @sv
alternative label: Rahat, historia (90.52)
alternative label: Rahat, keräily (90.52)
alternative label: Rahatiede (90.52)
alternative label: Sedlar, numismatik (90.52) @sv
alternative label: Setelit, numismatiikka (90.52)
broader: Historian aputieteet
in scheme: YKL - Yleisten kirjastojen luokitusjärjestelmä
notation: 90.52
preferred label: Numismatics. Phaleristics @en
preferred label: Numismatik @sv
scope note: Numismatiikka. Rahojen ja mitalien keräily Tähän eri maanosien, maiden, alueiden, alojen ja aikakausien rahat ja mitalit Muotoluokkaa 09 ei käytetä luokkien 90-99.31 yhteydessä
scope note: Numismatik. Samlande av mynt, sedlar och medaljer Hit olika världsdelars, länders, regionens, branschens och tidsperioders mynt, sedlar och medaljer Formtillägget 09 används inte i samband med klasserna 90-99.31 @sv

Vaakunatiede. Sinettitiede
type: Concept
type: YKL-luokka
alternative label: Flaggor (90.53) @sv
alternative label: Heraldiikka (90.53)
alternative label: Heraldik (90.53) @sv
alternative label: Liput (90.53)
alternative label: Sigill (90.53) @sv
alternative label: Sigillografi (90.53) @sv
alternative label: Sigillografia (90.53)
alternative label: Sigillvetenskap (90.53) @sv
alternative label: Sinetit (90.53)
alternative label: Sinettitiede (90.53)
alternative label: Symboler, heraldik (90.53) @sv
alternative label: Symbolit, heraldiikka (90.53)
alternative label: Vaakunat (90.53)
alternative label: Vaakunataide (90.53)
alternative label: Vaakunatiede (90.53)
alternative label: Vapen, heraldik (90.53) @sv
alternative label: Vapenkonst, heraldik (90.53) @sv
alternative label: Viirit (90.53)
alternative label: Vimplar (90.53) @sv
broader: Historian aputieteet
in scheme: YKL - Yleisten kirjastojen luokitusjärjestelmä
notation: 90.53
preferred label: Heraldik. Sigillograri @sv
preferred label: Heraldry. Sigillography @en
scope note: Heraldiikka. Sigillografia Tähän eri maanosien, maiden, alueiden, alojen ja aikakausien vaakunat, sinetit, liput ja viirit Muotoluokkaa 09 ei käytetä luokkien 90-99.31 yhteydessä
scope note: Heraldik. Sigillografi eller sfragistik Hit vapenbilder, sigill, flaggor och vimplar i olika världsdelar, länder, regioner, inom olika områden och under olika tidsperioden Formtillägget 09 används inte i samband med klasserna 90-99.31 @sv

Kunniamerkit. Arvonimet
type: Concept
References: Käytös- ja tapatieto
type: YKL-luokka
alternative label: Ansiomerkit (90.54)
alternative label: Arvonimet (90.54)
alternative label: Hederstecken (90.54) @sv
alternative label: Kunniamerkit (90.54)
alternative label: Titlar (90.54) @sv
alternative label: Utmärkelsetecken (90.54) @sv
broader: Historian aputieteet
in scheme: YKL - Yleisten kirjastojen luokitusjärjestelmä
notation: 90.54
preferred label: Decorations. Orders. Honorary titles @en
preferred label: Ordnar. Titlar @sv
scope note: Hit ordnar och titlar i olika världsdelar, länder och regioner, inom olika områden och under olika tidsperioden Formtillägget 09 används inte i samband med klasserna 90-99.31 @sv
scope note: Tähän eri maanosien, maiden, alueiden, alojen ja aikakausien kunniamerkit ja arvonimet Muotoluokkaa 09 ei käytetä luokkien 90-99.31 yhteydessä

MAAILMANHISTORIA. EUROOPAN HISTORIA
type: Concept
References: Taloushistoria
References: Historialliset maailmankartat ja -kartastot
References: Yleinen kulttuurihistoria
References: Yleinen sotahistoria
References: Yleinen arkeologia
References: Yleinen kronologia ja kronografia
References: SUOMEN HISTORIA
References: POHJOISMAIDEN HISTORIA
References: KESKI-EUROOPAN HISTORIA
References: BRITTEINSAARTEN HISTORIA
References: ETELÄ-EUROOPAN HISTORIA
References: ITÄ-EUROOPAN HISTORIA
References: MUIDEN MAANOSIEN HISTORIA
alternative label: Alpländer, historia (91) @sv
alternative label: Alppimaat, historia (91)
alternative label: Anarkism, historia (91+) @sv
alternative label: Anarkismi, historia (91+)
alternative label: Aseelliset vapautusrintamat (91 ... 98+)
alternative label: Asutushistoria, historia (91+)
alternative label: Bebyggelsehistoria, historia (91+) @sv
alternative label: Beväpnade befrielsefronter (91 ... 98+) @sv
alternative label: Eurooppa, historia (91+)
alternative label: Europa, historia (91+) @sv
alternative label: Fascism, historia (91+) @sv
alternative label: Fasismi, historia (91+)
alternative label: Finsk-ugriska folk, historia (91+) @sv
alternative label: Forskningsresor, historiska upptäcktsfärder (91+) @sv
alternative label: Gerillarörelser (91 ... 98+) @sv
alternative label: Historia, landsvis och regionvis (91 ... 98+) @sv
alternative label: Historia, maailmanhistoria (91+)
alternative label: Historia, maittain ja alueittain (91 ... 98+)
alternative label: Historia, världshistoria (91+) @sv
alternative label: Internationella relationer, historia (91+) @sv
alternative label: Itämeren alue, historia (91+)
alternative label: Jordenruntresor, upptäcktsfärder (91+) @sv
alternative label: Kansainväliset suhteet, historia (91+)
alternative label: Kolonialpolitik, historia (91 ... 98+) @sv
alternative label: Krigstid, historia (91+) @sv
alternative label: Kulttuurihistoria, Eurooppa (91+)
alternative label: Kulturhistoria, Europa (91+) @sv
alternative label: Länsi-Eurooppa, historia (91+)
alternative label: Löytöretket (91+)
alternative label: Maailmanhistoria (91+)
alternative label: Maailmanympärimatkat, löytöretket (91+)
alternative label: Matkakuvaukset, löytöretket (91+)
alternative label: Merimatkat, löytöretket (91+)
alternative label: Poliittinen historia (91+)
alternative label: Poliittiset kriisit, historia (91+)
alternative label: Politisk historia (91+) @sv
alternative label: Politiska kriser, historia (91+) @sv
alternative label: Reseskildringar, upptäcktsresor (91+) @sv
alternative label: Revolutioner (91 ... 98+) @sv
alternative label: Samhällshistoria (91+) @sv
alternative label: Siirtomaapolitiikka, historia (91 ... 98+)
alternative label: Sissiliikkeet (91 ... 98+)
alternative label: Sjöresor, upptäcktsresor (91+) @sv
alternative label: Socialhistoria (91+) @sv
alternative label: Sosiaalihistoria (91+)
alternative label: Sota-aika, historia (91+)
alternative label: Statskupper (91 ... 98+) @sv
alternative label: Suomalais-ugrilaiset kansat, historia (91+)
alternative label: Tutkimusmatkat, historialliset löytöretket (91+)
alternative label: Ulkopolitiikka, historia (91 ... 98+)
alternative label: Upptäcktsfärder (91+) @sv
alternative label: Utrikespolitik, historia (91 ... 98+) @sv
alternative label: Vallankaappaukset (91 ... 98+)
alternative label: Vallankumoukset (91 ... 98+)
alternative label: Världshistoria (91+) @sv
alternative label: Västeuropa, historia (91+) @sv
alternative label: Yhteiskuntahistoria (91+)
broader: HISTORIA
in scheme: YKL - Yleisten kirjastojen luokitusjärjestelmä
narrower: Vanha aika
narrower: Keskiaika
narrower: Uusi aika
narrower: Uusin aika
notation: 91
scope note: Hit och till underklasserna allmän världshistoria, politisk historia och samhällshistoria samt upptäcktsfärdernas allmänna historia. Hit och till underklasserna också Europas och Västeuropas allmänna historia, kulturhistoria och arkeologi. Specialområdens historia klassificeras enligt område . Olika länders och regioners allmänna historia klassificeras enligt land och region. Historia om upptäcktsfärder till enskilda världsdelar eller regioner klassificeras enligt ifrågavarande världsdels eller regions historia. Läroböcker i historia för grundskolan och gymnasiet till klass 90.07. Formtillägget 09 används inte i samband med klasserna 90-99.31 @sv
scope note: Tähän ja alaluokkiin yleinen maailmanhistoria, yleinen poliittinen ja yhteiskuntahistoria sekä löytöretkien yleinen historia. Tähän ja alaluokkiin myös Euroopan ja Länsi-Euroopan yleinen historia, yleinen kulttuurihistoria ja yleinen arkeologia. Erikoisalojen historia luokitetaan alan mukaan. Eri maiden ja alueiden yleinen historia luokitetaan maittain ja alueittain. Tiettyyn maanosaan tai tietylle alueelle kohdistuneen löytöretken historia luokitetaan ko. maanosan tai alueen historiaan. Peruskoulun ja lukion historian oppikirjat luokkaan 90.07. Muotoluokkaa 09 ei käytetä luokkien 90-99.31 yhteydessä

Vanha aika
type: Concept
References: Etu-Aasian historia
References: Intian historia
References: Kiinan historia
References: Japanin historia
alternative label: Arkeologi, Europa (91.1+) @sv
alternative label: Arkeologia, Eurooppa (91.1+)
alternative label: Assyria, arkeologia (91.1)
alternative label: Assyria, historia (91.1)
alternative label: Assyrien, arkeologi (91.1) @sv
alternative label: Assyrien, historia (91.1) @sv
alternative label: Assyriologi (91.1) @sv
alternative label: Assyriologia (91.1)
alternative label: Babylonia, arkeologia (91.1)
alternative label: Babylonia, historia (91.1)
alternative label: Babylonien, arkeologi (91.1) @sv
alternative label: Babylonien, historia (91.1) @sv
alternative label: Bronsåldern (91.1) @sv
alternative label: Cypern, arkeologi (91.1+) @sv
alternative label: Dödahavsfynd, arkeologi (91.1) @sv
alternative label: Esihistoria (91.1)
alternative label: Etu-Aasia, arkeologia (91.1+)
alternative label: Etu-Aasia, muinaishistoria (91.1+)
alternative label: Fenicien, arkeologi (91.1) @sv
alternative label: Fenicien, historia till år 636 e. Kr. (91.1) @sv
alternative label: Foinikia, arkeologia (91.1)
alternative label: Foinikia, historia vuoteen 636 j.Kr. (91.1)
alternative label: Forntidens människor, gamla tidens historia (91.1+) @sv
alternative label: Främre Asien, arkeologi (91.1+) @sv
alternative label: Främre Asien, fornhistoria (91.1+) @sv
alternative label: Förhistoria (91.1) @sv
alternative label: Gamla tiden, historia (91.1+) @sv
alternative label: Heettiläiset, arkeologia (91.1)
alternative label: Heettiläiset, historia (91.1)
alternative label: Hettiter, arkeologi (91.1) @sv
alternative label: Hettiter, historia (91.1) @sv
alternative label: Irak, arkeologi (91.1) @sv
alternative label: Irak, arkeologia (91.1)
alternative label: Iran, arkeologi (91.1) @sv
alternative label: Iran, arkeologia (91.1)
alternative label: Israel, arkeologi (91.1) @sv
alternative label: Israel, arkeologia (91.1)
alternative label: Järnåldern (91.1+) @sv
alternative label: Kaksoisvirranmaa, arkeologia (91.1)
alternative label: Kaksoisvirranmaa, historia vuoteen 637 j.Kr. (91.1)
alternative label: Karthago, arkeologia (91.1)
alternative label: Karthago, historia vuoteen 395 j.Kr. (91.1)
alternative label: Keltit, historia (91.1+)
alternative label: Kivikausi (91.1)
alternative label: Kuolleenmeren löydöt, arkeologia (91.1)
alternative label: Kypros, arkeologia (91.1+)
alternative label: Lähi-itä, arkeologia (91.1+)
alternative label: Lähi-itä, muinaishistoria (91.1+)
alternative label: Mesopotamia, arkeologia (91.1)
alternative label: Mesopotamia, historia vuoteen 637 j.Kr. (91.1)
alternative label: Muinaisajan ihmiset, vanhan ajan historia (91.1+)
alternative label: Neoliittinen kausi (91.1+)
alternative label: Paleoliittinen kausi (91.1+)
alternative label: Palestiina, arkeologia (91.1)
alternative label: Palestiina, muinaishistoria (91.1)
alternative label: Persia, arkeologia (91.1)
alternative label: Persia, historia vuoteen 642 j.Kr. (91.1)
alternative label: Pronssikausi (91.1)
alternative label: Rautakausi (91.1+)
alternative label: Sumerit, arkeologia (91.1)
alternative label: Sumerit, historia (91.1)
alternative label: Syyria, arkeologia (91.1)
alternative label: Syyria, historia vuoteen 636 j.Kr. (91.1)
alternative label: Turkki, arkeologia (91.1)
alternative label: Vanha aika, historia (91.1+)
alternative label: Varhaishistoria (91.1+)
alternative label: Vähä-Aasia, arkeologia (91.1+)
alternative label: Vähä-Aasia, historia vuoteen 395 j.Kr. (91.1+)
broader: MAAILMANHISTORIA. EUROOPAN HISTORIA
in scheme: YKL - Yleisten kirjastojen luokitusjärjestelmä
narrower: Vanha aika, Egyptin historia
narrower: Vanha aika, antiikin historia
notation: 91.1
scope note: Hit allmänna verk om gamla tidens historia Det mesopotamiska områdets historia till 637 e.Kr. Assyriens och Babyloniens historia. Sumerernas historia. Assyriologi Syriens och Feniciens historia till 636 e.Kr. Karthagos och Mindre Asiens historia till 395 e.Kr. Persiens historia till 642 e.Kr. Hit och till underklasserna också arkeologisk forskning i gamla tidens arkeologi i Europa och främre Asien Hit också sten-, brons- och järnålder samt neolitikum och paleolitikum i allmänhet Formtillägget 09 används inte i samband med klasserna 90-99.31 @sv
scope note: Tähän vanhan ajan historian yleisteokset Mesopotamian alueen historia vuoteen 637 j.Kr. Assyrian, Babylonian ja sumerilaisten historia. Assyriologia Syyrian ja Foinikian historia vuoteen 636 j.Kr. Karthagon ja Vähän-Aasian historia vuoteen 395 j.Kr. Persian historia vuoteen 642 j.Kr. Tähän ja alaluokkiin myös Euroopan ja Etu-Aasian vanhan ajan arkeologinen tutkimus Tähän myös kivi-, pronssi- ja rautakausi sekä neoliittinen ja paleoliittinen kausi yleensä Muotoluokkaa 09 ei käytetä luokkien 90-99.31 yhteydessä

Vanha aika, Egyptin historia
type: Concept
References: Yleinen taidehistoria, Afrikka
References: Pohjois-Afrikan historia
type: YKL-luokka
alternative label: Arkeologi, Egypten (91.11) @sv
alternative label: Arkeologia, Egypti (91.11)
alternative label: Egypten, arkeologi (91.11) @sv
alternative label: Egypten, historia till året 639 e.Kr. (91.11) @sv
alternative label: Egypti, arkeologia (91.11)
alternative label: Egypti, historia vuoteen 639 j.Kr. (91.11)
alternative label: Egyptologi (91.11) @sv
alternative label: Egyptologia (91.11)
alternative label: Faraoner, historia (91.11) @sv
alternative label: Faraot, historia (91.11)
alternative label: Pyramider, Egyptens historia (91.11) @sv
alternative label: Pyramidit, Egyptin historia (91.11)
broader: Vanha aika
in scheme: YKL - Yleisten kirjastojen luokitusjärjestelmä
notation: 91.11
preferred label: Ancient times, history of Egypt @en
preferred label: Gamla tiden, Egyptens historia @sv
scope note: Hit Egyptens historia till 639 e.Kr. Egyptologi. Egyptens arkeologi Allmänna verk om Egyptens forntidskultur Formtillägget 09 används inte i samband med klasserna 90-99.31 @sv
scope note: Tähän Egyptin historia vuoteen 639 j.Kr. Egyptologia. Egyptin arkeologia Egyptin muinaiskulttuuria koskevat yleisteokset Muotoluokkaa 09 ei käytetä luokkien 90-99.31 yhteydessä

Vanha aika, antiikin historia
type: Concept
References: Esihistoriallinen ja vanhan ajan taide
References: Vanhan ja keskiajan kirjallisuus, Eurooppa
type: YKL-luokka
alternative label: Antiikki, arkeologia (91.17+)
alternative label: Antiikki, historia (91.17+)
alternative label: Antiikki, kulttuuri (91.17+)
alternative label: Antiken, arkeologi (91.17+) @sv
alternative label: Antiken, historia (91.17+) @sv
alternative label: Antiken, kultur (91.17+) @sv
alternative label: Arkeologi, antiken (91.17+) @sv
alternative label: Arkeologia, antiikki (91.17+)
broader: Vanha aika
in scheme: YKL - Yleisten kirjastojen luokitusjärjestelmä
narrower: Vanha aika, antiikin Kreikan historia
narrower: Vanha aika, antiikin Rooman historia
notation: 91.17
preferred label: Ancient times, history of antiquity @en
preferred label: Gamla tiden, antikens historia @sv
scope note: Hit allmänna verk om antikens historia och arkeologi Hit också allmänna verk om antikens kultur Formtillägget 09 används inte i samband med klasserna 90-99.31 @sv
scope note: Tähän antiikin historian ja arkeologian yleisteokset Tähän myös antiikin kulttuuria koskevat yleisteokset Muotoluokkaa 09 ei käytetä luokkien 90-99.31 yhteydessä

Vanha aika, antiikin Kreikan historia
type: Concept
References: Esihistoriallinen ja vanhan ajan taide
References: Vanhan ja keskiajan kirjallisuus, Eurooppa
References: Kreikan historia
type: YKL-luokka
alternative label: Aigeialainen kulttuuri, yl. (91.172)
alternative label: Aigeianmeren saaret, antiikin historia (91.172)
alternative label: Aigeianmeren saaret, arkeologia (91.172)
alternative label: Ateena, antiikin historia (91.172)
alternative label: Ateena, arkeologia (91.172)
alternative label: Aten, antikens historia (91.172) @sv
alternative label: Aten, arkeologi (91.172) @sv
alternative label: Egeisk kultur, allm. (91.172) @sv
alternative label: Egeiska öarna, antikens historia (91.172) @sv
alternative label: Egeiska öarna, arkeologi (91.172) @sv
alternative label: Grekland, antikens historia (91.172) @sv
alternative label: Grekland, antikens kultur (91.172) @sv
alternative label: Grekland, arkeologi (91.172) @sv
alternative label: Helleenit, antiikin historia (91.172)
alternative label: Hellener, antikens historia (91.172) @sv
alternative label: Hellenistinen kulttuuri (91.172)
alternative label: Hellenistisk kultur (91.172) @sv
alternative label: Kaupunkivaltiot, antiikin Kreikan historia (91.172)
alternative label: Kolonier, antika Greklands historia (91.172) @sv
alternative label: Kreeta, antiikin historia (91.172)
alternative label: Kreeta, arkeologia (91.172)
alternative label: Kreetalainen kulttuuri (91.172)
alternative label: Kreikka, antiikin historia (91.172)
alternative label: Kreikka, antiikin kulttuuri (91.172)
alternative label: Kreikka, arkeologia (91.172)
alternative label: Kreta, antikens historia (91.172) @sv
alternative label: Kreta, arkeologi (91.172) @sv
alternative label: Kretensisk kultur (91.172) @sv
alternative label: Makedonia, antiikin historia (91.172)
alternative label: Makedonia, arkeologia (91.172)
alternative label: Makedonien, antikens historia (91.172) @sv
alternative label: Makedonien, arkeologi (91.172) @sv
alternative label: Minoisk kultur (91.172) @sv
alternative label: Minolainen kulttuuri (91.172)
alternative label: Mykeneläinen kulttuuri (91.172)
alternative label: Mykensk kultur (91.172) @sv
alternative label: Olympiad, antikens (91.172) @sv
alternative label: Olympiakisat, antiikin (91.172)
alternative label: Olympialaiset, antiikin (91.172)
alternative label: Olympiska spelen, antiken (91.172) @sv
alternative label: Peloponnesos, antiikin historia (91.172)
alternative label: Peloponnesos, antikens historia (91.172) @sv
alternative label: Peloponnesos, arkeologi (91.172) @sv
alternative label: Peloponnesos, arkeologia (91.172)
alternative label: Rhodos, antikens historia (91.172) @sv
alternative label: Rhodos, arkeologi (91.172) @sv
alternative label: Rodos, antiikin historia (91.172)
alternative label: Rodos, arkeologia (91.172)
alternative label: Siirtokunnat, antiikin Kreikan historia (91.172)
alternative label: Sparta, antiikin historia (91.172)
alternative label: Sparta, antikens historia (91.172) @sv
alternative label: Stadsstater, det antika Greklands historia (91.172) @sv
alternative label: Troijan sota (91.172)
alternative label: Trojanska kriget (91.172) @sv
broader: Vanha aika, antiikin historia
in scheme: YKL - Yleisten kirjastojen luokitusjärjestelmä
notation: 91.172
preferred label: Ancient times, history of ancient Greece @en
preferred label: Gamla tiden, antika Greklands historia @sv
scope note: Hit det antika Greklands historia och arkeologi Stadsstaterna. Kolonierna Kreta. Mykene. Aten. Sparta. Makedonien Hellenismen Hit också allmänna verk om antikens grekiska kultur Formtillägget 09 används inte i samband med klasserna 90-99.31 @sv
scope note: Tähän antiikin Kreikan historia ja arkeologia Kaupunkivaltiot. Siirtokunnat Kreeta. Mykene. Ateena. Sparta. Makedonia Hellenismi Tähän myös antiikin kreikkalaista kulttuuria koskevat yleisteokset Muotoluokkaa 09 ei käytetä luokkien 90-99.31 yhteydessä

Vanha aika, antiikin Rooman historia
type: Concept
References: Esihistoriallinen ja vanhan ajan taide
References: Vanhan ja keskiajan kirjallisuus, Eurooppa
References: Keskiaika
type: YKL-luokka
alternative label: Etrusker, arkeologi (91.173) @sv
alternative label: Etrusker, historia (91.173) @sv
alternative label: Etrusker, kultur (91.173) @sv
alternative label: Etruskit, arkeologia (91.173)
alternative label: Etruskit, historia (91.173)
alternative label: Etruskit, kulttuuri (91.173)
alternative label: Rom (91.173) @sv
alternative label: Romerska riket, antikens historia (91.173) @sv
alternative label: Romerska riket, arkeologi (91.173) @sv
alternative label: Romerska riket, kultur (91.173) @sv
alternative label: Rooman kaupunki, antiikin historia (91.173)
alternative label: Rooman kaupunki, arkeologia (91.173)
alternative label: Rooman valtakunta, antiikin historia (91.173)
alternative label: Rooman valtakunta, arkeologia (91.173)
alternative label: Rooman valtakunta, kulttuuri (91.173)
broader: Vanha aika, antiikin historia
in scheme: YKL - Yleisten kirjastojen luokitusjärjestelmä
notation: 91.173
preferred label: Ancient times, history of ancient Rome @en
preferred label: Gamla tiden, antika Romarrikets historia @sv
scope note: Hit det antika romarrikets historia och arkeologi Hit också allmänna verk om antikens romerska kultur Hit också etruskernas historia och arkeologi samt allmänna verk om etruskernas kultur Formtillägget 09 används inte i samband med klasserna 90-99.31 @sv
scope note: Tähän antiikin Rooman valtakunnan historia ja arkeologia Tähän myös antiikin roomalaista kulttuuria koskevat yleisteokset Tähän myös etruskien historia ja arkeologia sekä etruskien kulttuuria koskevat yleisteokset Muotoluokkaa 09 ei käytetä luokkien 90-99.31 yhteydessä

Keskiaika
type: Concept
References: Keskiajan taide
References: Keskiajan musiikki (n. 1000-1400)
References: Vanhan ja keskiajan kirjallisuus, Eurooppa
type: YKL-luokka
alternative label: Arabia, keskiajan historia (91.6)
alternative label: Arabialainen kulttuuri, keskiaika (91.6)
alternative label: Arabien, medeltida historia (91.6) @sv
alternative label: Arabisk kultur, medeltiden (91.6) @sv
alternative label: Bysans, historia (91.6) @sv
alternative label: Bysans, kulturhistoria (91.6) @sv
alternative label: Bysantti, historia (91.6)
alternative label: Bysantti, kulttuurihistoria (91.6)
alternative label: Folkvandringar (91.6) @sv
alternative label: Islam, keskiajan historia (91.6)
alternative label: Islam, keskiajan kulttuuri (91.6)
alternative label: Islam, medeltidens historia (91.6) @sv
alternative label: Islam, medeltidens kultur (91.6) @sv
alternative label: Kansainvaellukset (91.6)
alternative label: Keskiaika, arkeologia (91.6)
alternative label: Keskiaika, historia (91.6)
alternative label: Keskiaika, kulttuurihistoria (91.6)
alternative label: Korstågen, historia (91.6) @sv
alternative label: Medeltiden, arkeologi (91.6) @sv
alternative label: Medeltiden, historia (91.6) @sv
alternative label: Medeltiden, kulturhistoria (91.6) @sv
alternative label: Riddarordnar, historia (91.6 ... 91.81) @sv
alternative label: Riddarväsen, historia (91.6 ... 91.81) @sv
alternative label: Ristiretket, historia (91.6)
alternative label: Ritarikunnat, historia (91.6 ... 91.81)
alternative label: Ritarilaitos, historia (91.6 ... 91.81)
broader: MAAILMANHISTORIA. EUROOPAN HISTORIA
in scheme: YKL - Yleisten kirjastojen luokitusjärjestelmä
notation: 91.6
preferred label: Medeltiden @sv
preferred label: Middle Ages @en
scope note: Hit allmänna verk om medeltidens historia, arkeologi och kultur åren 400-1500 Hit också allmänna verk om Bysans historia, arkeologi och kultur och allmänna verk om det arabiska världsväldets historia, arkeologi och kultur Övriga österländska kulturers medeltidshistoria klassificeras till ifrågavarande lands eller regions historia Formtillägget 09 används inte i samband med klasserna 90-99.31 @sv
scope note: Tähän keskiajan historian, arkeologian ja kulttuurin yleisteokset v. 400-1500 Tähän myös Bysantin ja arabien maailmanvallan historian, arkeologian ja kulttuurin yleisteokset Muiden itämaisten kulttuurien keskiajan historia luokitetaan ko. maan tai alueen historiaan Muotoluokkaa 09 ei käytetä luokkien 90-99.31 yhteydessä

Uusi aika
type: Concept
References: Uuden ajan taide
References: Uuden ajan kirjallisuus, Eurooppa
type: YKL-luokka
alternative label: Barock, kulturhistoria (91.7) @sv
alternative label: Barokki, kulttuurihistoria (91.7)
alternative label: Nya tiden, historia (91.7 ... 91.8) @sv
alternative label: Reformaation aika, historia (91.7)
alternative label: Reformationstiden, historia (91.7) @sv
alternative label: Renessanssi, historia (91.7)
alternative label: Renessanssi, kulttuurihistoria (91.7)
alternative label: Renässans, historia (91.7) @sv
alternative label: Renässans, kulturhistoria (91.7) @sv
alternative label: Riddarordnar, historia (91.6 ... 91.81) @sv
alternative label: Riddarväsen, historia (91.6 ... 91.81) @sv
alternative label: Ritarikunnat, historia (91.6 ... 91.81)
alternative label: Ritarilaitos, historia (91.6 ... 91.81)
alternative label: Rokoko, kulturhistoria (91.7) @sv
alternative label: Rokokoo, kulttuurihistoria (91.7)
alternative label: Upplysningstiden, historia (91.7) @sv
alternative label: Uskonpuhdistuksen aika, historia (91.7)
alternative label: Uusi aika, historia (91.7 ... 91.8)
alternative label: Valistuksen aika, historia (91.7)
broader: MAAILMANHISTORIA. EUROOPAN HISTORIA
in scheme: YKL - Yleisten kirjastojen luokitusjärjestelmä
notation: 91.7
preferred label: Early modern era @en
preferred label: Nya tiden 1500-1788 @sv
scope note: Hit allmänna verk om nya tidens tidigare historia och kulturhistoria åren 1500-1788 Hit också allmänna verk om renässansens historia och kulturhistoria Formtillägget 09 används inte i samband med klasserna 90-99.31 @sv
scope note: Tähän uuden ajan historian ja kulttuurin yleisteokset v. 1500-1788 Tähän myös renessanssiajan historian ja kulttuurihistorian yleisteokset Muotoluokkaa 09 ei käytetä luokkien 90-99.31 yhteydessä

Uusin aika
type: Concept
References: Uuden ajan taide
References: Uuden ajan kirjallisuus, Eurooppa
type: YKL-luokka
alternative label: Industrialiseringens tidevarv, historia (91.8+) @sv
alternative label: Industrialism, historia (91.8+) @sv
alternative label: Industrialismi, historia (91.8+)
alternative label: Kansallisromantiikka, kulttuurihistoria (91.8)
alternative label: Nationalromantik, kulturhistoria (91.8) @sv
alternative label: Nya tiden, historia (91.7 ... 91.8) @sv
alternative label: Riddarordnar, historia (91.6 ... 91.81) @sv
alternative label: Riddarväsen, historia (91.6 ... 91.81) @sv
alternative label: Ritarikunnat, historia (91.6 ... 91.81)
alternative label: Ritarilaitos, historia (91.6 ... 91.81)
alternative label: Romantiikka, kulttuurihistoria (91.8)
alternative label: Romantik, kulturhistoria (91.8) @sv
alternative label: Teollistumisen aikakausi, historia (91.8+)
alternative label: Uusi aika, historia (91.7 ... 91.8)
broader: MAAILMANHISTORIA. EUROOPAN HISTORIA
in scheme: YKL - Yleisten kirjastojen luokitusjärjestelmä
narrower: Nykyaika
notation: 91.8
preferred label: Modern era @en
preferred label: Nya tiden 1789- @sv
scope note: Hit allmänna verk om nya tidens senare historia och kulturhistoria från år 1789 framåt Formtillägget 09 används inte i samband med klasserna 90-99.31 @sv
scope note: Tähän uusimman ajan historian ja kulttuurin yleisteokset vuodesta 1789- Muotoluokkaa 09 ei käytetä luokkien 90-99.31 yhteydessä

Nykyaika
type: Concept
References: Nykyajan taide
References: Nykyajan kirjallisuus, Eurooppa
References: Ensimmäinen maailmansota 1914-1918
References: Toinen maailmansota 1939-1945
type: YKL-luokka
alternative label: Modernism, kulturhistoria (91.81) @sv
alternative label: Modernismi, kulttuurihistoria (91.81)
alternative label: Postmodernism, kulturhistoria (91.81) @sv
alternative label: Postmodernismi, kulttuurihistoria (91.81)
broader: Uusin aika
in scheme: YKL - Yleisten kirjastojen luokitusjärjestelmä
notation: 91.81
preferred label: Late modern era to the present @en
preferred label: Nutiden @sv
scope note: Hit allmänna verk om nutidens historia och kultur från år 1900 Formtillägget 09 används inte i samband med klasserna 90-99.31 @sv
scope note: Tähän nykyajan historian ja kulttuurin yleisteokset vuodesta 1900- Muotoluokkaa 09 ei käytetä luokkien 90-99.31 yhteydessä

SUOMEN HISTORIA
type: Concept
References: Taloushistoria
References: POHJOISMAIDEN HISTORIA
type: YKL-luokka
alternative label: Aseelliset vapautusrintamat (91 ... 98+)
alternative label: Asutushistoria, historia, Suomi (92+)
alternative label: Bebyggelsehistoria, historia, Finland (92+) @sv
alternative label: Beväpnade befrielsefronter (91 ... 98+) @sv
alternative label: Dansbanor, kulturhistoria, Finland (92+) @sv
alternative label: Finland, historia (92+) @sv
alternative label: Gerillarörelser (91 ... 98+) @sv
alternative label: Historia, Finland (92+) @sv
alternative label: Historia, Suomi (92+)
alternative label: Historia, landsvis och regionvis (91 ... 98+) @sv
alternative label: Historia, maittain ja alueittain (91 ... 98+)
alternative label: Inrikespolitik, historia (92 ... 98+) @sv
alternative label: Internationella relationer, historia, Finland (92+) @sv
alternative label: Joukko-osastot, sotahistoria, Suomi (92+)
alternative label: Kansainväliset suhteet, historia, Suomi (92+)
alternative label: Kolonialpolitik, historia (91 ... 98+) @sv
alternative label: Krigshistoria, Finland (92+) @sv
alternative label: Kulttuurihistoria, Suomi (92+)
alternative label: Kulturhistoria, Finland (92+) @sv
alternative label: Poliittinen historia, Suomi (92+)
alternative label: Politisk historia, Finland (92+) @sv
alternative label: Revolutioner (91 ... 98+) @sv
alternative label: Samhällshistoria, Finland (92+) @sv
alternative label: Siirtomaapolitiikka, historia (91 ... 98+)
alternative label: Sissiliikkeet (91 ... 98+)
alternative label: Sisäpolitiikka, historia (92 ... 98+)
alternative label: Socialhistoria, Finland (92+) @sv
alternative label: Sosiaalihistoria, Suomi (92+)
alternative label: Sotahistoria, Suomi (92+)
alternative label: Statskupper (91 ... 98+) @sv
alternative label: Suomi, historia (92+)
alternative label: Tanssilavat, kulttuurihistoria, Suomi (92+)
alternative label: Truppförband, krigshistoria, Finland (92+) @sv
alternative label: Ulkopolitiikka, historia (91 ... 98+)
alternative label: Utrikespolitik, historia (91 ... 98+) @sv
alternative label: Vallankaappaukset (91 ... 98+)
alternative label: Vallankumoukset (91 ... 98+)
alternative label: Yhteiskuntahistoria, Suomi (92+)
broader: HISTORIA
in scheme: YKL - Yleisten kirjastojen luokitusjärjestelmä
narrower: Suomen historia, esi- ja varhaishistoria
narrower: Suomen historia, keskiaika
narrower: Suomen historia, reformaation aika
narrower: Suomen historia, Ruotsin suurvalta-aika
narrower: Suomen historia, vapauden aika ja kustavilainen aika
narrower: Suomen historia, autonomian aika
narrower: Suomen historia, itsenäisyyden aika
narrower: Suomen historia, paikallishistoria
narrower: Suomenruotsalaisten historia
notation: 92
preferred label: FINLANDS HISTORIA @sv
preferred label: HISTORY OF FINLAND @en
scope note: Hit och till underklasserna allmänna verk om Finlands historia Hit och till underklasserna också allmänna verk om Finlands politiska historia, samhällshistoria, krigshistoria samt kulturhistoria Formtillägget 09 används inte i samband med klasserna 90-99.31 @sv
scope note: Tähän ja alaluokkiin Suomen historian yleisteokset Tähän ja alaluokkiin myös Suomen poliittisen historian, yhteiskuntahistorian, sotahistorian sekä kulttuurihistorian yleisteokset Muotoluokkaa 09 ei käytetä luokkien 90-99.31 yhteydessä

Suomen historia, esi- ja varhaishistoria
type: Concept
References: POHJOISMAIDEN HISTORIA
type: YKL-luokka
alternative label: Arkeologi, Finland (92.1) @sv
alternative label: Arkeologia, Suomi (92.1)
alternative label: Bronsåldern, Finland (92.1) @sv
alternative label: Esihistoria, Suomi (92.1)
alternative label: Fornborgar, Finlands arkeologi (92.1) @sv
alternative label: Fornlämningar, Finlands arkeologi (92.1) @sv
alternative label: Fornvetenskap, Finland (92.1) @sv
alternative label: Förhistoria, Finland (92.1) @sv
alternative label: Järnåldern, Finland (92.1) @sv
alternative label: Kivikausi, Suomi (92.1)
alternative label: Muinaisjäännökset, Suomen arkeologia (92.1)
alternative label: Muinaislinnat, Suomen arkeologia (92.1)
alternative label: Muinaistiede, Suomi (92.1)
alternative label: Pronssikausi, Suomi (92.1)
alternative label: Rautakausi, Suomi (92.1)
alternative label: Stenåldern, Finland (92.1) @sv
alternative label: Tidig historia, Finland (92.1) @sv
alternative label: Varhaishistoria, Suomi (92.1)
alternative label: Viikingit, Suomen historia (92.1)
alternative label: Viikinkiaika, Suomen historia (92.1)
alternative label: Vikingar, Finlands historia (92.1) @sv
alternative label: Vikingatiden, Finlands historia (92.1) @sv
broader: SUOMEN HISTORIA
in scheme: YKL - Yleisten kirjastojen luokitusjärjestelmä
notation: 92.1
preferred label: Finlands historia, förhistoria och tidigare historia @sv
preferred label: History of Finland, prehistory and early history @en
scope note: Till år 1154 Hit också allmänna verk om Finlands arkeologi @sv
scope note: Vuoteen 1154 Tähän myös Suomen arkeologian yleisteokset

Suomen historia, keskiaika
type: Concept
type: YKL-luokka
alternative label: Keskiaika, Suomen historia (92.2)
alternative label: Korstågen, Finlands historia (92.2) @sv
alternative label: Medeltiden, Finlands historia (92.2) @sv
alternative label: Ristiretket, Suomen historia (92.2)
broader: SUOMEN HISTORIA
in scheme: YKL - Yleisten kirjastojen luokitusjärjestelmä
notation: 92.2
preferred label: Finlands historia, medeltiden @sv
preferred label: History of Finland, middle ages @en
scope note: Ensimmäisestä ristiretkestä Suomen Kalmarin unionin loppuun eli v. 1155-1523
scope note: Från första korståget till Kalmarunionens slut, dvs. 1155-1523 @sv

Suomen historia, reformaation aika
type: Concept
type: YKL-luokka
alternative label: Klubbekriget, Finlands historia (92.3) @sv
alternative label: Nuijasota, Suomen historia (92.3)
alternative label: Reformaation aika, Suomen historia (92.3)
alternative label: Reformationstiden, Finlands historia (92.3) @sv
alternative label: Uskonpuhdistuksen aika, Suomen historia (92.3)
broader: SUOMEN HISTORIA
in scheme: YKL - Yleisten kirjastojen luokitusjärjestelmä
notation: 92.3
preferred label: Finlands historia, reformationstiden @sv
preferred label: History of Finland, reformation @en
scope note: Kustaa Vaasan valtaistuimelle noususta Stolbovan rauhaan eli v. 1524-1617
scope note: Tiden från Gustav Vasas tronbestigning till Stolbovafreden, dvs. 1524-1617 @sv

Suomen historia, Ruotsin suurvalta-aika
type: Concept
type: YKL-luokka
alternative label: Isoviha, Suomen historia (92.4)
alternative label: Kolmikymmenvuotinen sota, Suomen historia (92.4)
alternative label: Stora ofreden (92.4) @sv
alternative label: Stormaktstiden, Finlands historia (92.4) @sv
alternative label: Suurvalta-aika, Suomen historia (92.4)
alternative label: Trettioåriga kriget, Finlands historia (92.4) @sv
broader: SUOMEN HISTORIA
in scheme: YKL - Yleisten kirjastojen luokitusjärjestelmä
notation: 92.4
preferred label: Finlands historia, Svenska stormaktstiden @sv
preferred label: History of Finland, Sweden's great power era @en
scope note: Stolbovan rauhaa seuranneesta ajasta Uudenkaupungin rauhaan eli v. 1618-1721
scope note: Tiden från Stolbovafreden till Nystadsfreden, dvs. 1618-1721 @sv

Suomen historia, vapauden aika ja kustavilainen aika
type: Concept
type: YKL-luokka
alternative label: Anjalaförbundet, Finlands historia (92.5) @sv
alternative label: Anjalan liitto, Suomen historia (92.5)
alternative label: Finlands krig 1808-1809 (92.5) @sv
alternative label: Frihetstiden, Finlands historia (92.5) @sv
alternative label: Gustavianska tiden, Finlands historia (92.5) @sv
alternative label: Kustavilainen aika, Suomen historia (92.5)
alternative label: Lilla ofreden, Finlands historia (92.5) @sv
alternative label: Pikkuviha, Suomen historia (92.5)
alternative label: Suomen sota 1808-1809 (92.5)
alternative label: Vapaudenaika, Suomen historia (92.5)
broader: SUOMEN HISTORIA
in scheme: YKL - Yleisten kirjastojen luokitusjärjestelmä
notation: 92.5
preferred label: Finlands historia, frihetstiden och gustavianska tiden @sv
preferred label: History of Finland, the age of freedom and the Gustavian era @en
scope note: Tiden från Nystadsfreden till Fredrikshamnsfreden, dvs. 1722-1809 @sv
scope note: Uudenkaupungin rauhaa seuranneesta ajasta Haminan rauhaan eli v. 1722-1809

Suomen historia, autonomian aika
type: Concept
type: YKL-luokka
alternative label: Autonomian aika, Suomen historia (92.6+)
alternative label: Autonomitiden, Finlands historia (92.6+) @sv
alternative label: Kansallisromantiikka, Suomen kulttuurihistoria (92.6)
alternative label: Nationalromantik, Finlands kulturhistoria (92.6) @sv
alternative label: Ofärdsåren, Finlands historia (92.6) @sv
alternative label: Passiivinen vastarinta, Suomen historia (92.6)
alternative label: Passivt motstånd, Finlands historia (92.6) @sv
alternative label: Routavuodet, Suomen historia (92.6)
alternative label: Sortovuodet, Suomen historia (92.6)
alternative label: Storstrejken, Finlands historia (92.6) @sv
alternative label: Suurlakko, Suomen historia (92.6)
broader: SUOMEN HISTORIA
in scheme: YKL - Yleisten kirjastojen luokitusjärjestelmä
narrower: Suomen historia, itsenäisyysliike ja itsenäistyminen
notation: 92.6
preferred label: Finlands historia, autonomins tid @sv
preferred label: History of Finland, the era of autonomy @en
scope note: Haminan rauhaa seuranneesta ajasta vuoteen 1917 eli v. 1810-1917
scope note: Tiden från Fredrikshamnsfreden till 1917, dvs. 1810-1917 @sv

Suomen historia, itsenäisyysliike ja itsenäistyminen
type: Concept
type: YKL-luokka
alternative label: Aktivister, Finlands historia (92.68) @sv
alternative label: Aktivistit, Suomen historia (92.68)
alternative label: Finskhetsrörelsen, Finlands historia (92.68) @sv
alternative label: Itsenäistyminen, Suomen historia (92.68)
alternative label: Itsenäisyysliike, Suomen historia (92.68)
alternative label: Jägarrörelsen, Finlands historia (92.68) @sv
alternative label: Jääkäriliike, Suomen historia (92.68)
alternative label: Självständighet, Finlands historia (92.68) @sv
alternative label: Självständighetsrörelsen, Finlands historia (92.68) @sv
alternative label: Suomalaisuusliike, Suomen historia (92.68)
broader: Suomen historia, autonomian aika
in scheme: YKL - Yleisten kirjastojen luokitusjärjestelmä
notation: 92.68
preferred label: Finlands historia, självständighetsrörelsen och självständigheten @sv
preferred label: History of Finland, independence movement and becoming independent @en

Suomen historia, itsenäisyyden aika
type: Concept
type: YKL-luokka
alternative label: Itsenäisyyden aika, Suomen historia (92.7+)
alternative label: Självständighetstiden, Finlands historia (92.7+) @sv
broader: SUOMEN HISTORIA
in scheme: YKL - Yleisten kirjastojen luokitusjärjestelmä
narrower: Suomen historia v. 1917-1920
narrower: Suomen historia v. 1921-1938
narrower: Suomen historia v. 1939-1945
narrower: Suomen historia vuodesta 1946-
notation: 92.7
preferred label: Finlands historia, självständighetstiden @sv
preferred label: History of Finland, the era of independence @en
scope note: Tiden från 1917 framåt @sv
scope note: Vuodesta 1917-

Suomen historia v. 1917-1920
type: Concept
References: Elämäkerrat. Muistelmat, sotamuistelmat
type: YKL-luokka
alternative label: Finska inbördeskriget (92.71) @sv
alternative label: Frihetskriget, Finlands historia (92.71) @sv
alternative label: Inbördeskrig, Finland (92.71) @sv
alternative label: Kansalaissota, Suomen historia (92.71)
alternative label: Klasskrig, Finlands historia (92.71) @sv
alternative label: Luokkasota, Suomen historia (92.71)
alternative label: Medborgarkriget, Finlands historia (92.71) @sv
alternative label: Sisällissodat, Suomi (92.71)
alternative label: Suomen sisällisota (92.71)
alternative label: Vapaussota, Suomen historia (92.71)
broader: Suomen historia, itsenäisyyden aika
in scheme: YKL - Yleisten kirjastojen luokitusjärjestelmä
notation: 92.71
preferred label: Finlands historia, åren 1917-1920 @sv
preferred label: History of Finland, years 1917-1920 @en
scope note: Hit också 1918 års krig @sv
scope note: Tähän myös vuoden 1918 sota

Suomen historia v. 1921-1938
type: Concept
type: YKL-luokka
broader: Suomen historia, itsenäisyyden aika
in scheme: YKL - Yleisten kirjastojen luokitusjärjestelmä
notation: 92.72
preferred label: Finlands historia, åren 1921-1938 @sv
preferred label: History of Finland, years 1921-1938 @en

Suomen historia v. 1939-1945
type: Concept
References: URN:NBN:fi:au:ykl:32.2109
References: Elämäkerrat. Muistelmat, sotamuistelmat
type: YKL-luokka
alternative label: Andra världskriget, Finland (92.73) @sv
alternative label: Fortsättningskriget, Finlands historia (92.73) @sv
alternative label: Jatkosota, Suomen historia (92.73)
alternative label: Lapin sota, Suomen historia (92.73)
alternative label: Lapska kriget, Finlands historia (92.73) @sv
alternative label: Maailmansota, toinen, Suomi (92.73)
alternative label: Talvisota, Suomen historia (92.73)
alternative label: Toinen maailmansota, Suomi (92.73)
alternative label: Vinterkriget, Finlands historia (92.73) @sv
alternative label: Världskriget, andra, Finland (92.73) @sv
broader: Suomen historia, itsenäisyyden aika
in scheme: YKL - Yleisten kirjastojen luokitusjärjestelmä
notation: 92.73
preferred label: Finlands historia, åren 1939-1945 @sv
preferred label: History of Finland, years 1939-1945 @en
scope note: Hit också vinter- och fortsättningskriget @sv
scope note: Tähän myös talvi- ja jatkosota

Suomen historia vuodesta 1946-
type: Concept
type: YKL-luokka
broader: Suomen historia, itsenäisyyden aika
in scheme: YKL - Yleisten kirjastojen luokitusjärjestelmä
notation: 92.74
preferred label: Finlands historia, tiden från 1946 framåt @sv
preferred label: History of Finland, from the year 1946- @en

Suomen historia, paikallishistoria
type: Concept
References: SUOMI
References: Suomen ja suomalais-ugrilaisten kansojen kansatiede
type: YKL-luokka
alternative label: Dansbanor, lokalhistoria, Finland (92.8+) @sv
alternative label: Etelä-Suomen lääni, historia (92.8+)
alternative label: Fornborgar, Finlands lokalhistoria (92.8+) @sv
alternative label: Fästningar, Finlands lokalhistoria (92.8+) @sv
alternative label: Hembygdsforskning, Finland (92.8+) @sv
alternative label: Herrgårdar, Finlands lokalhistoria (92.8+) @sv
alternative label: Industrisamhällen, lokalhistoriker (92.8+) @sv
alternative label: Itä-Suomen lääni, historia (92.8+)
alternative label: Kartanot, Suomen paikallishistoria (92.8+)
alternative label: Kauppalat, Suomen paikallishistoria (92.8+)
alternative label: Kaupungit, Suomen paikallishistoria (92.8+)
alternative label: Kaupunkihistoriat, Suomi (92.8+)
alternative label: Kommuner, Finlands lokalhistoria (92.8+) @sv
alternative label: Kotiseutututkimus, Suomi (92.8+)
alternative label: Kunnat, Suomen paikallishistoria (92.8+)
alternative label: Köpingar, Finlands lokalhistoria (92.8+) @sv
alternative label: Landskap, Finlands lokalhistoria (92.8+) @sv
alternative label: Linnat, Suomen paikallishistoria (92.8+)
alternative label: Linnoitukset, Suomen paikallishistoria (92.8+)
alternative label: Lokalhistoria, Finland (92.8+) @sv
alternative label: Län, Finlands lokalhistoria (92.8+) @sv
alternative label: Länsi-Suomen lääni (92.8+)
alternative label: Länsi-Suomen lääni, historia (92.8+)
alternative label: Läänit, Suomen paikallishistoria (92.8+)
alternative label: Maakunnat, Suomen paikallishistoria (92.8+)
alternative label: Muinaislinnat, Suomen paikallishistoria (92.8+)
alternative label: Paikallishistoria, Suomi (92.8+)
alternative label: Pappilat, Suomen paikallishistoria (92.8+)
alternative label: Pitäjät, Suomen paikallishistoria (92.8+)
alternative label: Prästgårdar, Finlands lokalhistoria (92.8+) @sv
alternative label: Slott, Finlands lokalhistoria (92.8+) @sv
alternative label: Socknar, Finlands lokalhistoria (92.8+) @sv
alternative label: Stadshistoria, Finland (92.8+) @sv
alternative label: Städer, Finlands lokalhistoria (92.8+) @sv
alternative label: Södra Finlands län, historia (92.8+) @sv
alternative label: Tanssilavat, paikallishistoria, Suomi (92.8+)
alternative label: Teollisuusyhdyskunnat, paikallishistoriat (92.8+)
alternative label: Västra Finlands län (92.8+) @sv
alternative label: Västra Finlands län, historia (92.8+) @sv
alternative label: Östra Finlands län, historia (92.8+) @sv
broader: SUOMEN HISTORIA
in scheme: YKL - Yleisten kirjastojen luokitusjärjestelmä
narrower: Varsinais-Suomen historia
narrower: Ahvenanmaan historia
narrower: Uudenmaan historia
narrower: Hämeen, Pirkanmaan ja Keski-Suomen historia
narrower: Satakunnan historia
narrower: Savon historia
narrower: Karjalan historia
narrower: Pohjanmaan ja Kainuun historia
narrower: Lapin historia
notation: 92.8
preferred label: Finlands historia, lokalhistoria @sv
preferred label: History of Finland, local history @en
scope note: Hit och till underklasserna Finlands lokalhistoria och hembygdsforskning. Om verket innehåller både lokalhistoria och geografi, ges företräde åt klass 42+. Om verket innehåller både etnologi och lokalhistoria eller hembygdsforskning, ges företräde åt klass 92.8+. Till exempel verk som behandlar Finska inbördeskriget på ortsnivå klassificeras enligt den orts historia det är fråga om. @sv
scope note: Tähän ja alaluokkiin Suomen paikallishistoria ja kotiseutututkimus. Tähän historiateokset, jotka koskevat Etelä-, Länsi- tai Itä-Suomen lääniä yleensä. Jos teoksessa on sekä paikallishistoriaa että maantiedettä, annetaan etusija luokalle 42+. Jos teoksessa on sekä kansatiedettä että paikallishistoriaa tai kotiseutututkimusta, annetaan etusija luokalle 92.8+. Esimerkiksi Suomen sisällissotaa tietyn paikkakunnan tasolla käsittelevät teokset luokitetaan kyseisen paikkakunnan historiaan.

Varsinais-Suomen historia
type: Concept
type: YKL-luokka
alternative label: Egentliga Finland, historia (92.81) @sv
alternative label: Turku, historia (92.81)
alternative label: Turun ja Porin lääni, Varsinais-Suomi, historia (92.81)
alternative label: Varsinais-Suomi, historia (92.81)
alternative label: Åbo och Björneborgs län, Egentliga Finland, historia (92.81) @sv
alternative label: Åbo, historia (92.81) @sv
broader: Suomen historia, paikallishistoria
in scheme: YKL - Yleisten kirjastojen luokitusjärjestelmä
notation: 92.81
preferred label: Egentliga Finlands historia @sv
preferred label: History of Finland Proper @en

Ahvenanmaan historia
type: Concept
type: YKL-luokka
alternative label: Ahvenanmaa, historia (92.82)
alternative label: Åland, historia (92.82) @sv
broader: Suomen historia, paikallishistoria
in scheme: YKL - Yleisten kirjastojen luokitusjärjestelmä
notation: 92.82
preferred label: History of Åland Islands @en
preferred label: Ålands historia @sv

Uudenmaan historia
type: Concept
type: YKL-luokka
alternative label: Keski-Uusimaa, historia (92.83+)
alternative label: Mellannyland, historia (92.83+) @sv
alternative label: Nyland, historia (92.83+) @sv
alternative label: Nylands län, historia (92.83+) @sv
alternative label: Uudenmaan lääni, historia (92.83+)
alternative label: Uusimaa, historia (92.83+)
broader: Suomen historia, paikallishistoria
in scheme: YKL - Yleisten kirjastojen luokitusjärjestelmä
narrower: Länsi-Uusimaa, historia
narrower: Pääkaupunkiseudun historia
narrower: Itä-Uudenmaan historia
notation: 92.83
preferred label: History of Uusimaa @en
preferred label: Nylands historia @sv
scope note: Landskapet Nyland till år 1997 och från året 2011 Verk som rör Nyland @sv
scope note: Uudenmaan maakunta vuoteen 1997 ja vuodesta 2010 Teokset, jotka koskevat Uuttamaata.

Länsi-Uusimaa, historia
type: Concept
type: YKL-luokka
alternative label: Länsi-Uusimaa, historia (92.831)
alternative label: Läntinen Uusimaa, historia (92.831)
alternative label: Porkala, historia (92.831) @sv
alternative label: Porkkala, historia (92.831)
alternative label: Västra Nyland, historia (92.831)
broader: Uudenmaan historia
in scheme: YKL - Yleisten kirjastojen luokitusjärjestelmä
notation: 92.831
preferred label: Västra Nyland, historia @sv
preferred label: Western Uusimaa, history @en
scope note: Läntinen uusimaa vuodesta 1997 vuoteen 2010 Teokset, jotka koskevat läntistä Uuttamaata
scope note: Västnyland från året 1997 till året 2010 Verk som rör Västnyland. @sv

Pääkaupunkiseudun historia
type: Concept
type: YKL-luokka
alternative label: Esbo, historia (92.833) @sv
alternative label: Espoo, historia (92.833)
alternative label: Grankulla, historia (92.833) @sv
alternative label: Helsingfors, historia (92.833) @sv
alternative label: Helsinki, historia (92.833)
alternative label: Huvudstadsregionen, historia (92.833) @sv
alternative label: Kauniainen, historia (92.833)
alternative label: Pääkaupunkiseutu, historia (92.833)
alternative label: Vanda, historia (92.833) @sv
alternative label: Vantaa, historia (92.833)
broader: Uudenmaan historia
in scheme: YKL - Yleisten kirjastojen luokitusjärjestelmä
notation: 92.833
preferred label: History of Helsinki metropolitan area @en
preferred label: Huvudstadsregionens historia @sv
scope note: Helsingfors. Esbo. Vanda. Grankulla @sv
scope note: Helsinki. Espoo. Vantaa. Kauniainen

Itä-Uudenmaan historia
type: Concept
type: YKL-luokka
alternative label: Itä-Uusimaa, historia (92.834)
alternative label: Östra Nyland, historia (92.834) @sv
broader: Uudenmaan historia
in scheme: YKL - Yleisten kirjastojen luokitusjärjestelmä
notation: 92.834
preferred label: History of Eastern Uusimaa @en
preferred label: Östra Nylands historia @sv
scope note: Itä-Uusimaa vuodesta 1997 vuoteen 2010. Teokset, jotka koskevat itäistä Uuttamaata.
scope note: Östra Nyland från året 1997 till året 2010. Verk, som rör Östra Nyland. @sv

Hämeen, Pirkanmaan ja Keski-Suomen historia
type: Concept
type: YKL-luokka
alternative label: Häme, historia (92.84+)
alternative label: Hämeen lääni, historia (92.84)
alternative label: Tammerfors, historia (92.84) @sv
alternative label: Tampere, historia (92.84)
alternative label: Tavastehus län, historia (92.84) @sv
alternative label: Tavastland, historia (92.84+) @sv
broader: Suomen historia, paikallishistoria
in scheme: YKL - Yleisten kirjastojen luokitusjärjestelmä
narrower: Kanta-Hämeen historia
narrower: Päijät-Hämeen historia
narrower: Pirkanmaan historia
narrower: Keski-Suomen historia
notation: 92.84
preferred label: History of Tavastia, Pirkanmaa and Central Finland @en
preferred label: Tavastlands, Birkalands och Mellersta Finlands historia @sv
scope note: Tähän historiateokset, jotka koskevat sekä Hämettä että Keski-Suomea
scope note: Verk som rör både Tavastland och Mellersta Finland @sv

Kanta-Hämeen historia
type: Concept
type: YKL-luokka
alternative label: Centrala Tavastland, historia (92.841) @sv
alternative label: Kanta-Häme, historia (92.841)
broader: Hämeen, Pirkanmaan ja Keski-Suomen historia
in scheme: YKL - Yleisten kirjastojen luokitusjärjestelmä
notation: 92.841
preferred label: Egentliga Tavastlans historia @sv
preferred label: History of Tavastia Proper @en

Päijät-Hämeen historia
type: Concept
type: YKL-luokka
alternative label: Päijät-Häme, historia (92.842)
alternative label: Östra Tavastland, historia (92.842) @sv
broader: Hämeen, Pirkanmaan ja Keski-Suomen historia
in scheme: YKL - Yleisten kirjastojen luokitusjärjestelmä
notation: 92.842
preferred label: History of Päijänne Tavastia @en
preferred label: Päijänne-Tavastlands historia @sv

Pirkanmaan historia
type: Concept
type: YKL-luokka
alternative label: Birkaland, historia (92.843) @sv
alternative label: Pirkanmaa, historia (92.843)
broader: Hämeen, Pirkanmaan ja Keski-Suomen historia
in scheme: YKL - Yleisten kirjastojen luokitusjärjestelmä
notation: 92.843
preferred label: Birkalands historia @sv
preferred label: History of Pirkanmaa @en

Keski-Suomen historia
type: Concept
type: YKL-luokka
alternative label: Keski-Suomen lääni, historia (92.845)
alternative label: Keski-Suomi, historia (92.845)
alternative label: Mellersta Finland, historia (92.845) @sv
alternative label: Mellersta Finlands län, historia (92.845) @sv
broader: Hämeen, Pirkanmaan ja Keski-Suomen historia
in scheme: YKL - Yleisten kirjastojen luokitusjärjestelmä
notation: 92.845
preferred label: History of Central Finland @en
preferred label: Mellersta Finlands historia @sv

Satakunnan historia
type: Concept
type: YKL-luokka
alternative label: Satakunda, historia (92.85) @sv
alternative label: Satakunta, historia (92.85)
alternative label: Turun ja Porin lääni, Satakunta, historia (92.85)
alternative label: Åbo och Björneborgs län, Satakunda, historia (92.85) @sv
broader: Suomen historia, paikallishistoria
in scheme: YKL - Yleisten kirjastojen luokitusjärjestelmä
notation: 92.85
preferred label: History of Satakunta @en
preferred label: Satakuntas historia @sv

Savon historia
type: Concept
type: YKL-luokka
alternative label: Savo, historia (92.86+)
alternative label: Savolax, historia (92.86+) @sv
broader: Suomen historia, paikallishistoria
in scheme: YKL - Yleisten kirjastojen luokitusjärjestelmä
narrower: Etelä-Savon historia
narrower: Pohjois-Savon historia
notation: 92.86
preferred label: History of Savonia @en
preferred label: Savolax historia @sv

Etelä-Savon historia
type: Concept
type: YKL-luokka
alternative label: Etelä-Savo, historia (92.861)
alternative label: Mikkelin lääni, historia (92.861)
alternative label: S:t Michels län, historia (92.861) @sv
alternative label: Södra Savolax, historia (92.861) @sv
broader: Savon historia
in scheme: YKL - Yleisten kirjastojen luokitusjärjestelmä
notation: 92.861
preferred label: History of Southern Savonia @en
preferred label: Södra Savolax historia @sv

Pohjois-Savon historia
type: Concept
type: YKL-luokka
alternative label: Kuopio län, historia (92.862) @sv
alternative label: Kuopion lääni, historia (92.862)
alternative label: Norra Savolax, historia (92.862) @sv
alternative label: Pohjois-Savo, historia (92.862)
broader: Savon historia
in scheme: YKL - Yleisten kirjastojen luokitusjärjestelmä
notation: 92.862
preferred label: History of Northern Savonia @en
preferred label: Norra Savolax historia @sv

Karjalan historia
type: Concept
References: Neuvostoliiton historia v. 1946-1991
type: YKL-luokka
alternative label: Avträdda områden, Karelen, historia till år 1944 (92.87) @sv
alternative label: Hogland, historia till år 1944 (92.87) @sv
alternative label: Karelen, Finland, historia (92.87+) @sv
alternative label: Karelen, det avträdda Karelen, historia till år 1944 (92.87) @sv
alternative label: Karelska näset, historia till år 1944 (92.87) @sv
alternative label: Karjala, Suomi, historia (92.87+)
alternative label: Karjalan kannas, historia vuoteen 1944 (92.87)
alternative label: Lavansaari, historia vuoteen 1944 (92.87)
alternative label: Luovutettu Karjala, historia vuoteen 1944 (92.87)
alternative label: Luovutetut alueet, Karjala, historia vuoteen 1944 (92.87)
alternative label: Lövskär, historia till år 1944 (92.87) @sv
alternative label: Seiskari, historia vuoteen 1944 (92.87)
alternative label: Seitskär, historia till år 1944 (92.87) @sv
alternative label: Suursaari, historia vuoteen 1944 (92.87)
alternative label: Tyterskär, historia till år 1944 (92.87) @sv
alternative label: Tytärsaari, historia vuoteen 1944 (92.87)
alternative label: Viborg, historia till år 1944 (92.87) @sv
alternative label: Viborgs län, historia till år 1944 (92.87) @sv
alternative label: Viipuri, historia vuoteen 1944 (92.87)
alternative label: Viipurin lääni, historia vuoteen 1944 (92.87)
broader: Suomen historia, paikallishistoria
in scheme: YKL - Yleisten kirjastojen luokitusjärjestelmä
narrower: Etelä-Karjalan historia
narrower: Kymenlaakson historia
narrower: Pohjois-Karjalan historia
notation: 92.87
preferred label: History of Karelia @en
preferred label: Karelens historia @sv
scope note: Hit också det avträdda Karelens område till 1944 Viborgs läns historia @sv
scope note: Tähän myös luovutetun Karjalan alueen historia vuoteen 1944

Etelä-Karjalan historia
type: Concept
type: YKL-luokka
alternative label: Etelä-Karjala, historia (92.874)
alternative label: Södra Karelen, historia (92.874) @sv
broader: Karjalan historia
in scheme: YKL - Yleisten kirjastojen luokitusjärjestelmä
notation: 92.874
preferred label: History of South Karelia @en
preferred label: Södra Karelens historia @sv

Kymenlaakson historia
type: Concept
type: YKL-luokka
alternative label: Kymen lääni, historia (92.875)
alternative label: Kymenlaakso, historia (92.875)
alternative label: Kymmene län, historia (92.875) @sv
alternative label: Kymmenedalen, historia (92.875) @sv
broader: Karjalan historia
in scheme: YKL - Yleisten kirjastojen luokitusjärjestelmä
notation: 92.875
preferred label: History of Kymenlaakso @en
preferred label: Kymmenedalens historia @sv

Pohjois-Karjalan historia
type: Concept
type: YKL-luokka
alternative label: Norra Karelen, historia (92.876) @sv
alternative label: Norra Karelens län, historia (92.876) @sv
alternative label: Pohjois-Karjala, historia (92.876)
alternative label: Pohjois-Karjalan lääni, historia (92.876)
broader: Karjalan historia
in scheme: YKL - Yleisten kirjastojen luokitusjärjestelmä
notation: 92.876
preferred label: History of North Karelia @en
preferred label: Norra Karelens historia @sv

Pohjanmaan ja Kainuun historia
type: Concept
type: YKL-luokka
alternative label: Oulun lääni, historia (92.88+)
alternative label: Pohjanmaa, historia (92.88+)
alternative label: Uleåborgs län, historia (92.88+) @sv
alternative label: Vaasan lääni, historia (92.88)
alternative label: Vasa län, historia (92.88) @sv
alternative label: Österbotten, historia (92.88+) @sv
broader: Suomen historia, paikallishistoria
in scheme: YKL - Yleisten kirjastojen luokitusjärjestelmä
narrower: Vaasan rannikkoseudun historia
narrower: Pohjois-Pohjanmaan historia
narrower: Keski-Pohjanmaan historia
narrower: Etelä-Pohjanmaan historia
narrower: Kainuun historia
notation: 92.88
preferred label: History of Ostrobothnia and Kainuu @en
preferred label: Österbottens och Kajanalands historia @sv
scope note: Oulun lääni
scope note: Uleåborgs län @sv

Vaasan rannikkoseudun historia
type: Concept
type: YKL-luokka
alternative label: Vaasan rannikkoseutu (92.881)
alternative label: Vaasan rannikkoseutu, historia (92.881)
alternative label: Vasa kustregion (92.881) @sv
alternative label: Vasa kustregion, historia (92.881) @sv
broader: Pohjanmaan ja Kainuun historia
in scheme: YKL - Yleisten kirjastojen luokitusjärjestelmä
notation: 92.881
preferred label: History of Vasa coastal region @en
preferred label: Vasa kustregionens historia @sv

Pohjois-Pohjanmaan historia
type: Concept
type: YKL-luokka
alternative label: Koillismaa, historia (92.882)
alternative label: Nordöstra Österbotten, historia (92.882) @sv
alternative label: Norra Österbotten, historia (92.882) @sv
alternative label: Pohjois-Pohjanmaa, historia (92.882)
broader: Pohjanmaan ja Kainuun historia
in scheme: YKL - Yleisten kirjastojen luokitusjärjestelmä
notation: 92.882
preferred label: History of Northern Ostrobothnia @en
preferred label: Norra Österbottens historia @sv

Keski-Pohjanmaan historia
type: Concept
type: YKL-luokka
alternative label: Keski-Pohjanmaa, historia (92.883)
alternative label: Mellersta Österbotten, historia (92.883) @sv
broader: Pohjanmaan ja Kainuun historia
in scheme: YKL - Yleisten kirjastojen luokitusjärjestelmä
notation: 92.883
preferred label: History of Central Ostrobothnia @en
preferred label: Mellersta Österbottens historia @sv

Etelä-Pohjanmaan historia
type: Concept
type: YKL-luokka
alternative label: Etelä-Pohjanmaa, historia (92.884)
alternative label: Sydösterbotten, historia (92.884) @sv
broader: Pohjanmaan ja Kainuun historia
in scheme: YKL - Yleisten kirjastojen luokitusjärjestelmä
notation: 92.884
preferred label: History of Southern Ostrobothnia @en
preferred label: Södra Österbottens historia @sv

Kainuun historia
type: Concept
type: YKL-luokka
alternative label: Kainuu, historia (92.885)
alternative label: Kajanaland, historia (92.885) @sv
broader: Pohjanmaan ja Kainuun historia
in scheme: YKL - Yleisten kirjastojen luokitusjärjestelmä
notation: 92.885
preferred label: History of Kainuu @en
preferred label: Kajanalands historia @sv

Lapin historia
type: Concept
References: Suomen ja suomalais-ugrilaisten kansojen kansatiede
References: Ruotsin historia
References: Norjan historia
References: Pohjoiskalotin historia
References: Venäjän ja Neuvostoliiton historia
References: Neuvostoliiton historia v. 1946-1991
References: Venäjä vuodesta 1992
type: YKL-luokka
alternative label: Avträdda områden, Salla och Petsamo, historia till år 1944 (92.89) @sv
alternative label: Lapin lääni, historia (92.89)
alternative label: Lappi, Suomen, historia (92.89)
alternative label: Lappland, Finlands historia (92.89) @sv
alternative label: Lapplands län, historia (92.89) @sv
alternative label: Luovutetut alueet, Salla ja Petsamo, historia vuoteen 1944 (92.89)
alternative label: Petsamo, historia till år 1945 (92.89) @sv
alternative label: Petsamo, historia vuoteen 1944 (92.89)
alternative label: Saamelaiset, historia, Suomi (92.89)
alternative label: Sallan alue, historia vuoteen 1944 (92.89)
alternative label: Sallaområdet, historia till år 1944 (92.89) @sv
alternative label: Samer, historia, Finland (92.89) @sv
broader: Suomen historia, paikallishistoria
in scheme: YKL - Yleisten kirjastojen luokitusjärjestelmä
notation: 92.89
preferred label: History of Lapland @en
preferred label: Lapplands historia @sv
scope note: Lapin lääni Tähän myös luovutetut Petsamon ja Sallan alueet vuoteen 1944
scope note: Lapplands län Hit också finlandssamernas historia Hit också de avträdda Petsamo- och Sallaområdenas historia till 1944 @sv

Suomenruotsalaisten historia
type: Concept
References: SUOMI
References: Suomen ja suomalais-ugrilaisten kansojen kansatiede
References: Suomen historia, paikallishistoria
type: YKL-luokka
alternative label: Finlandssvenska bosättningsområden, historia (92.9) @sv
alternative label: Finlandssvenskarnas historia (92.9) @sv
alternative label: Finlandssvenskhet, historia (92.9) @sv
alternative label: Suomenruotsalaisten asuma-alueet, historia (92.9)
alternative label: Suomenruotsalaisten historia (92.9)
alternative label: Suomenruotsalaisuus, historia (92.9)
broader: SUOMEN HISTORIA
in scheme: YKL - Yleisten kirjastojen luokitusjärjestelmä
notation: 92.9
preferred label: Finlandssvenskarnas historia @sv
preferred label: The history of Swedish-speaking Finns @en
scope note: Hit allmänna verk om finlandssvenskarnas historia och finlandssvensk hembygdsforskning Hit också allmänna verk som behandlar finlandssvenskarnas historia under en viss tidsperiod Finlandssvenskarnas historia i en viss region förs till klassen för den ifrågavarande regionens lokalhistoria @sv
scope note: Tähän suomenruotsalaisten historiaa ja kotiseutututkimusta koskevat yleisteokset Tähän myös yleisteokset, jotka koskevat suomenruotsalaisten historiaa jonakin tiettynä aikakautena Tietyn alueen suomenruotsalaisten historia luokitetaan ko. alueen paikallishistoriaan

POHJOISMAIDEN HISTORIA
type: Concept
References: SUOMEN HISTORIA
type: YKL-luokka
alternative label: Aseelliset vapautusrintamat (91 ... 98+)
alternative label: Beväpnade befrielsefronter (91 ... 98+) @sv
alternative label: Bronsåldern, Norden (93) @sv
alternative label: Fennoskandia, historia (93)
alternative label: Fennoskandien, historia (93) @sv
alternative label: Gerillarörelser (91 ... 98+) @sv
alternative label: Historia, landsvis och regionvis (91 ... 98+) @sv
alternative label: Historia, maittain ja alueittain (91 ... 98+)
alternative label: Inrikespolitik, historia (92 ... 98+) @sv
alternative label: Järnåldern, Norden (93) @sv
alternative label: Kivikausi, Pohjoismaat (93)
alternative label: Kolonialpolitik, historia (91 ... 98+) @sv
alternative label: Norden, historia (93) @sv
alternative label: Pohjoismaat, historia (93)
alternative label: Pronssikausi, Pohjoismaat (93)
alternative label: Rautakausi, Pohjoismaat (93)
alternative label: Revolutioner (91 ... 98+) @sv
alternative label: Siirtomaapolitiikka, historia (91 ... 98+)
alternative label: Sissiliikkeet (91 ... 98+)
alternative label: Sisäpolitiikka, historia (92 ... 98+)
alternative label: Skandinavia, historia (93)
alternative label: Skandinavien, historia (93) @sv
alternative label: Statskupper (91 ... 98+) @sv
alternative label: Stenåldern, Norden (93) @sv
alternative label: Ulkopolitiikka, historia (91 ... 98+)
alternative label: Utrikespolitik, historia (91 ... 98+) @sv
alternative label: Vallankaappaukset (91 ... 98+)
alternative label: Vallankumoukset (91 ... 98+)
alternative label: Viikingit, Pohjoismaiden historia (93)
alternative label: Viikinkiaika, Pohjoismaiden historia (93)
alternative label: Vikingar, nordisk historia (93) @sv
alternative label: Vikingatiden, nordisk historia (93) @sv
broader: HISTORIA
in scheme: YKL - Yleisten kirjastojen luokitusjärjestelmä
narrower: Ruotsin historia
narrower: Norjan historia
narrower: Tanskan historia
narrower: Islannin historia
narrower: Pohjoiskalotin historia
notation: 93
preferred label: NORDENS HISTORIA @sv
preferred label: NORDIC HISTORY @en
scope note: Hit historiska verk som behandlar flera nordiska länder, Finland medräknat Hit också de nordiska ländernas gemensamma tidiga historia och arkeologi Vikingatiden i allmänhet Ett enskild nordiskt lands historia, arkeologi och vikingatid förs till klassen för det ifrågavarande landets historia Formtillägget 09 används inte i samband med klasserna 90-99.31 @sv
scope note: Tähän historiateokset, jotka koskevat useampaa kuin yhtä Pohjoismaata, myös Suomea Tähän myös Pohjoismaiden yhteinen varhaishistoria ja arkeologia Viikinkiaika yleensä Tietyn Pohjoismaan historia, varhaishistoria, arkeologia ja viikinkiaika luokitetaan ko. maan historiaan Muotoluokkaa 09 ei käytetä luokkien 90-99.31 yhteydessä

Ruotsin historia
type: Concept
type: YKL-luokka
alternative label: Lappi, Ruotsin historia (93.1+)
alternative label: Lappland, Sveriges historia (93.1+) @sv
alternative label: Ruotsi, historia (93.1+)
alternative label: Saamelaiset, historia, Ruotsi (93.1+)
alternative label: Samer, historia, Sverige (93.1+) @sv
alternative label: Stockholm, historia (93.1+) @sv
alternative label: Sverige, historia (93.1+) @sv
alternative label: Tukholma, historia (93.1+)
broader: POHJOISMAIDEN HISTORIA
in scheme: YKL - Yleisten kirjastojen luokitusjärjestelmä
narrower: Ruotsin historia vuoteen 1523
narrower: Ruotsin historia v. 1524-1718
narrower: Ruotsin historia v. 1719-1809
narrower: Ruotsin historia v. 1810-1905
narrower: Ruotsin historia vuodesta 1906
notation: 93.1
preferred label: History of Sweden @en
preferred label: Sveriges historia @sv

Ruotsin historia vuoteen 1523
type: Concept
type: YKL-luokka
broader: Ruotsin historia
in scheme: YKL - Yleisten kirjastojen luokitusjärjestelmä
notation: 93.11
preferred label: History of Sweden until 1523 @en
preferred label: Sveriges historia till år 1523 @sv
scope note: Hit också allmänna verk om Sveriges arkeologi @sv
scope note: Tähän myös Ruotsin arkeologian yleisteokset

Ruotsin historia v. 1524-1718
type: Concept
type: YKL-luokka
alternative label: Karoliinit, Ruotsin historia (93.12)
alternative label: Karolinerna, Sveriges historia (93.12) @sv
alternative label: Stormaktstiden, Sveriges historia (93.12) @sv
alternative label: Suurvalta-aika, Ruotsin historia (93.12)
broader: Ruotsin historia
in scheme: YKL - Yleisten kirjastojen luokitusjärjestelmä
notation: 93.12
preferred label: History of Sweden years 1524-1718 @en
preferred label: Sveriges historia åren 1524-1718 @sv

Ruotsin historia v. 1719-1809
type: Concept
type: YKL-luokka
alternative label: Frihetstiden, Sveriges historia (93.13) @sv
alternative label: Gustavianska tiden, Sveriges historia (93.13) @sv
alternative label: Kustavilainen aika, Ruotsin historia (93.13)
alternative label: Vapaudenaika, Ruotsin historia (93.13)
broader: Ruotsin historia
in scheme: YKL - Yleisten kirjastojen luokitusjärjestelmä
notation: 93.13
preferred label: History of Sweden years 1719-1809 @en
preferred label: Sveriges historia åren 1719-1809 @sv

Ruotsin historia v. 1810-1905
type: Concept
type: YKL-luokka
broader: Ruotsin historia
in scheme: YKL - Yleisten kirjastojen luokitusjärjestelmä
notation: 93.14
preferred label: History of Sweden years 1810-1905 @en
preferred label: Sveriges historia åren 1810-1905 @sv

Ruotsin historia vuodesta 1906
type: Concept
type: YKL-luokka
broader: Ruotsin historia
in scheme: YKL - Yleisten kirjastojen luokitusjärjestelmä
notation: 93.15
preferred label: History of Sweden from year 1906 @en
preferred label: Sveriges historia från år 1906 @sv

Norjan historia
type: Concept
References: Pohjoiset napamaat. Arktis
type: YKL-luokka
alternative label: Finnmarken, historia (93.2) @sv
alternative label: Lappi, Norjan historia (93.2)
alternative label: Lappland, Norges historia (93.2) @sv
alternative label: Norge, historia (93.2) @sv
alternative label: Norja, historia (93.2)
alternative label: Oslo, historia (93.2)
alternative label: Ruija, historia (93.2)
alternative label: Saamelaiset, historia, Norja (93.2)
alternative label: Samer, historia, Norge (93.2) @sv
broader: POHJOISMAIDEN HISTORIA
in scheme: YKL - Yleisten kirjastojen luokitusjärjestelmä
notation: 93.2
preferred label: History of Norway @en
preferred label: Norges historia @sv

Tanskan historia
type: Concept
References: Pohjoiset napamaat. Arktis
type: YKL-luokka
alternative label: Danmark, historia (93.3+) @sv
alternative label: Köpenhamn, historia (93.3) @sv
alternative label: Kööpenhamina, historia (93.3)
alternative label: Tanska, historia (93.3+)
broader: POHJOISMAIDEN HISTORIA
in scheme: YKL - Yleisten kirjastojen luokitusjärjestelmä
narrower: Färsaarten historia
notation: 93.3
preferred label: Danmarks historia @sv
preferred label: History of Denmark @en

Färsaarten historia
type: Concept
type: YKL-luokka
alternative label: Färsaaret, historia (93.32)
alternative label: Färöarna, historia (93.32) @sv
broader: Tanskan historia
in scheme: YKL - Yleisten kirjastojen luokitusjärjestelmä
notation: 93.32
preferred label: Färöarnas historia @sv
preferred label: History of Faroe Islands @en

Islannin historia
type: Concept
type: YKL-luokka
alternative label: Island, historia (93.4) @sv
alternative label: Islanti, historia (93.4)
broader: POHJOISMAIDEN HISTORIA
in scheme: YKL - Yleisten kirjastojen luokitusjärjestelmä
notation: 93.4
preferred label: History of Iceland @en
preferred label: Islands historia @sv

Pohjoiskalotin historia
type: Concept
References: Lapin historia
References: Ruotsin historia
References: Norjan historia
References: Venäjän ja Neuvostoliiton historia
type: YKL-luokka
alternative label: Lappi, historia (93.5)
alternative label: Lappland, historia (93.5) @sv
alternative label: Nordkalotten, historia (93.5) @sv
alternative label: Pohjoiskalotti, historia (93.5)
alternative label: Saamelaiset, historia (93.5)
alternative label: Samer, historia (93.5) @sv
broader: POHJOISMAIDEN HISTORIA
in scheme: YKL - Yleisten kirjastojen luokitusjärjestelmä
notation: 93.5
preferred label: History of Cap of the North @en
preferred label: Nordkalottens historia @sv
scope note: Hit allmänna verk om Nordkalottens historia Hit också allmänna verk om samernas historia @sv
scope note: Tähän Pohjoiskalotin historian yleisteokset Tähän myös saamelaisten historian yleisteokset

KESKI-EUROOPAN HISTORIA
type: Concept
References: Ranskan historia
References: Puolan historia
type: YKL-luokka
alternative label: Aseelliset vapautusrintamat (91 ... 98+)
alternative label: Beväpnade befrielsefronter (91 ... 98+) @sv
alternative label: Gerillarörelser (91 ... 98+) @sv
alternative label: Historia, landsvis och regionvis (91 ... 98+) @sv
alternative label: Historia, maittain ja alueittain (91 ... 98+)
alternative label: Inrikespolitik, historia (92 ... 98+) @sv
alternative label: Keski-Eurooppa, historia (94+)
alternative label: Kolonialpolitik, historia (91 ... 98+) @sv
alternative label: Mellaneuropa, historia (94+) @sv
alternative label: Revolutioner (91 ... 98+) @sv
alternative label: Siirtomaapolitiikka, historia (91 ... 98+)
alternative label: Sissiliikkeet (91 ... 98+)
alternative label: Sisäpolitiikka, historia (92 ... 98+)
alternative label: Statskupper (91 ... 98+) @sv
alternative label: Ulkopolitiikka, historia (91 ... 98+)
alternative label: Utrikespolitik, historia (91 ... 98+) @sv
alternative label: Vallankaappaukset (91 ... 98+)
alternative label: Vallankumoukset (91 ... 98+)
broader: HISTORIA
in scheme: YKL - Yleisten kirjastojen luokitusjärjestelmä
narrower: Saksan historia
narrower: History of Czech Republic and Slovakia {@en}}
narrower: Itävallan historia
narrower: Unkarin historia
narrower: Sveitsin historia
narrower: Liechtensteinin historia
narrower: Benelux-maiden historia
notation: 94
preferred label: HISTORY OF CENTRAL EUROPE @en
preferred label: MELLANEUROPAS HISTORIA @sv
scope note: Hit allmänna verk om Mellaneuropas historia Formtillägget 09 används inte i samband med klasserna 90-99.31 @sv
scope note: Tähän Keski-Euroopan historian yleisteokset Muotoluokkaa 09 ei käytetä luokkien 90-99.31 yhteydessä

Saksan historia
type: Concept
type: YKL-luokka
alternative label: Berliini, historia (94.1+)
alternative label: Berlin, historia (94.1+) @sv
alternative label: Danzig, historia till året 1945 (94.1+) @sv
alternative label: Danzig, historia vuoteen 1945 (94.1+)
alternative label: Itä-Preussi, historia, Saksa (94.1+)
alternative label: Ostpreussen, historia, Tyskland (94.1+) @sv
alternative label: Preussen, historia (94.1+) @sv
alternative label: Preussi, historia (94.1+)
alternative label: Saksa, historia (94.1+)
alternative label: Tyskland, historia (94.1+) @sv
broader: KESKI-EUROOPAN HISTORIA
in scheme: YKL - Yleisten kirjastojen luokitusjärjestelmä
narrower: Saksan historia, vanha aika ja keskiaika
narrower: Saksan historia, uusi aika
narrower: Saksan historia, nykyaika
notation: 94.1
preferred label: History of Germany @en
preferred label: Tysklands historia @sv

Saksan historia, vanha aika ja keskiaika
type: Concept
type: YKL-luokka
broader: Saksan historia
in scheme: YKL - Yleisten kirjastojen luokitusjärjestelmä
notation: 94.11
preferred label: History of Germany, ancient times and middle ages @en
preferred label: Tysklands historia, gamla tiden och medeltiden @sv
scope note: Till år 1500 Hit även allmänna verk om Tysklands arkeologi @sv
scope note: Vuoteen 1500 Tähän myös Saksan arkeologian yleisteokset

Saksan historia, uusi aika
type: Concept
type: YKL-luokka
broader: Saksan historia
in scheme: YKL - Yleisten kirjastojen luokitusjärjestelmä
notation: 94.12
preferred label: History of Germany, modern age @en
preferred label: Tysklands historia, nya tiden @sv
scope note: V. 1500-1899
scope note: Åren 1500-1899 @sv

Saksan historia, nykyaika
type: Concept
type: YKL-luokka
alternative label: BRD, historia (94.13)
alternative label: DDR, historia (94.13)
alternative label: Itä-Saksa, historia (94.13)
alternative label: Kansallissosialismi, Saksan historia (94.13)
alternative label: Kolmas valtakunta, Saksan historia (94.13)
alternative label: Nationalsocialism, Tysklands historia (94.13) @sv
alternative label: Natsismi, Saksan historia (94.13)
alternative label: Nazism, Tysklands historia (94.13) @sv
alternative label: Saksan demokraattinen tasavalta, historia (94.13)
alternative label: Saksan liittotasavalta, historia (94.13)
alternative label: Tredje riket, Tysklands historia (94.13) @sv
alternative label: Tyska demokratiska republiken, historia (94.13) @sv
alternative label: Tyska förbundsrepubliken, historia (94.13) @sv
alternative label: Weimarin tasavalta, historia (94.13)
alternative label: Weimarrepubliken, historia (94.13) @sv
alternative label: Östtyskland, historia (94.13) @sv
broader: Saksan historia
in scheme: YKL - Yleisten kirjastojen luokitusjärjestelmä
notation: 94.13
preferred label: History of Germany, present time @en
preferred label: Tysklands historia, nutid @sv
scope note: Från år 1900 framåt Hit Förbundsrepubliken Tysklands och Tyska demokratiska republikens historia @sv
scope note: Vuodesta 1900- Tähän Saksan liittotasavallan ja Saksan demokraattisen tasavallan historia

History of Czech Republic and Slovakia {@en}}
type: Concept
type: YKL-luokka
alternative label: Tjeckoslovakien, historia (94.3+) @sv
alternative label: Tšekkoslovakia, historia (94.3+)
broader: KESKI-EUROOPAN HISTORIA
in scheme: YKL - Yleisten kirjastojen luokitusjärjestelmä
narrower: Tšekin historia
narrower: Slovakian historia
notation: 94.3
preferred label: Tjeckiens och Slovakiens historia @sv
preferred label: Tšekin ja Slovakian historia
scope note: Hit även Tjeckoslovakiens historia. @sv
scope note: Tähän myös Tšekkoslovakian historia

Tšekin historia
type: Concept
type: YKL-luokka
alternative label: Tjeckien, historia (94.31) @sv
alternative label: Tšekki, historia (94.31)
broader: History of Czech Republic and Slovakia {@en}}
in scheme: YKL - Yleisten kirjastojen luokitusjärjestelmä
notation: 94.31
preferred label: History of Czech Republic @en
preferred label: Tjeckiens historia @sv

Slovakian historia
type: Concept
type: YKL-luokka
alternative label: Slovakia, historia (94.32)
alternative label: Slovakien, historia (94.32) @sv
broader: History of Czech Republic and Slovakia {@en}}
in scheme: YKL - Yleisten kirjastojen luokitusjärjestelmä
notation: 94.32
preferred label: History of Slovakia @en
preferred label: Slovakiens historia @sv

Itävallan historia
type: Concept
type: YKL-luokka
alternative label: Itävalta, historia (94.4)
alternative label: Itävalta-Unkari, historia (94.4)
alternative label: Österrike, historia (94.4) @sv
alternative label: Österrike-Ungern, historia (94.4) @sv
broader: KESKI-EUROOPAN HISTORIA
in scheme: YKL - Yleisten kirjastojen luokitusjärjestelmä
notation: 94.4
preferred label: History of Austria @en
preferred label: Österrikes historia @sv
scope note: Hit också Österrike-Ungerns historia @sv
scope note: Tähän myös Itävalta-Unkarin historia

Unkarin historia
type: Concept
type: YKL-luokka
alternative label: Ungern, historia (94.5) @sv
alternative label: Unkari, historia (94.5)
broader: KESKI-EUROOPAN HISTORIA
in scheme: YKL - Yleisten kirjastojen luokitusjärjestelmä
notation: 94.5
preferred label: History of Hungary @en
preferred label: Ungerns historia @sv

Sveitsin historia
type: Concept
type: YKL-luokka
alternative label: Schweiz, historia (94.6) @sv
alternative label: Sveitsi, historia (94.6)
broader: KESKI-EUROOPAN HISTORIA
in scheme: YKL - Yleisten kirjastojen luokitusjärjestelmä
notation: 94.6
preferred label: History of Switzerland @en
preferred label: Schweizs historia @sv

Liechtensteinin historia
type: Concept
type: YKL-luokka
alternative label: Liechtenstein, historia (94.7)
broader: KESKI-EUROOPAN HISTORIA
in scheme: YKL - Yleisten kirjastojen luokitusjärjestelmä
notation: 94.7
preferred label: History of Liechtenstein @en
preferred label: Liechtensteins historia @sv

Benelux-maiden historia
type: Concept
type: YKL-luokka
alternative label: Benelux-länder, historia (94.8+) @sv
alternative label: Benelux-maat, historia (94.8+)
broader: KESKI-EUROOPAN HISTORIA
in scheme: YKL - Yleisten kirjastojen luokitusjärjestelmä
narrower: Belgian historia
narrower: Alankomaiden historia
narrower: Luxemburgin historia
notation: 94.8
preferred label: Beneluxländernas historia @sv
preferred label: History of Benelux Union @en

Belgian historia
type: Concept
type: YKL-luokka
alternative label: Belgia, historia (94.81)
alternative label: Belgien, historia (94.81) @sv
broader: Benelux-maiden historia
in scheme: YKL - Yleisten kirjastojen luokitusjärjestelmä
notation: 94.81
preferred label: Belgiens historia @sv
preferred label: History of Belgium @en

Alankomaiden historia
type: Concept
type: YKL-luokka
alternative label: Alankomaat, historia (94.82)
alternative label: Holland, historia (94.82) @sv
alternative label: Hollanti, historia (94.82)
alternative label: Nederländerna, historia (94.82) @sv
broader: Benelux-maiden historia
in scheme: YKL - Yleisten kirjastojen luokitusjärjestelmä
notation: 94.82
preferred label: History of Netherlands @en
preferred label: Nederländernas historia @sv

Luxemburgin historia
type: Concept
type: YKL-luokka
alternative label: Luxemburg, historia (94.83)
broader: Benelux-maiden historia
in scheme: YKL - Yleisten kirjastojen luokitusjärjestelmä
notation: 94.83
preferred label: History of Luxembourg @en
preferred label: Luxemurgs historia @sv

BRITTEINSAARTEN HISTORIA
type: Concept
type: YKL-luokka
alternative label: Aseelliset vapautusrintamat (91 ... 98+)
alternative label: Beväpnade befrielsefronter (91 ... 98+) @sv
alternative label: Britteinsaaret, historia (95+)
alternative label: Brittiska öarna, historia (95+) @sv
alternative label: Gerillarörelser (91 ... 98+) @sv
alternative label: Historia, landsvis och regionvis (91 ... 98+) @sv
alternative label: Historia, maittain ja alueittain (91 ... 98+)
alternative label: Inrikespolitik, historia (92 ... 98+) @sv
alternative label: Kelter, historia, Brittiska öarna (95+) @sv
alternative label: Keltit, historia, Brittein saaret (95+)
alternative label: Kolonialpolitik, historia (91 ... 98+) @sv
alternative label: Revolutioner (91 ... 98+) @sv
alternative label: Siirtomaapolitiikka, historia (91 ... 98+)
alternative label: Sissiliikkeet (91 ... 98+)
alternative label: Sisäpolitiikka, historia (92 ... 98+)
alternative label: Statskupper (91 ... 98+) @sv
alternative label: Ulkopolitiikka, historia (91 ... 98+)
alternative label: Utrikespolitik, historia (91 ... 98+) @sv
alternative label: Vallankaappaukset (91 ... 98+)
alternative label: Vallankumoukset (91 ... 98+)
broader: HISTORIA
in scheme: YKL - Yleisten kirjastojen luokitusjärjestelmä
narrower: Ison-Britannian historia
narrower: Irlannin historia
notation: 95
preferred label: BRITTISKA ÖARNAS HISTORIA @sv
preferred label: HISTORY OF THE BRITISH ISLES @en
scope note: Formtillägget 09 används inte i samband med klasserna 90-99.31 @sv
scope note: Muotoluokkaa 09 ei käytetä luokkien 90-99.31 yhteydessä

Ison-Britannian historia
type: Concept
References: Pohjois-Irlannin historia
type: YKL-luokka
alternative label: Brittiläinen kansainyhteisö, historia (95.1+)
alternative label: Brittiska samväldet, historia (95.1+) @sv
alternative label: England, historia (95.1+) @sv
alternative label: Englanti, historia (95.1+)
alternative label: Förenade konungariket, historia (95.1+) @sv
alternative label: Hebriderna, historia (95.1+) @sv
alternative label: Hebridit, historia (95.1+)
alternative label: Iso-Britannia, historia (95.1+)
alternative label: Kanaalin saaret, historia (95.1+)
alternative label: Kanalöarna, historia (95.1+) @sv
alternative label: London, historia (95.1+) @sv
alternative label: Lontoo, historia (95.1+)
alternative label: Skotlanti, historia (95.1+)
alternative label: Skottland, historia (95.1+) @sv
alternative label: Storbritannien, historia (95.1+) @sv
alternative label: Wales, historia (95.1+)
alternative label: Yhdistynyt kuningaskunta, historia (95.1+)
broader: BRITTEINSAARTEN HISTORIA
in scheme: YKL - Yleisten kirjastojen luokitusjärjestelmä
narrower: Ison-Britannian historia, vanha aika ja keskiaika
narrower: Ison-Britannian historia, uusi aika
narrower: Ison-Britannian historia, nykyaika
notation: 95.1
preferred label: History of United Kingdom @en
preferred label: Storbritanniens historia @sv
scope note: Hit och till underklasserna Förenade kungadömets, Englands, Skottlands och Wales historia Hit och till underklasserna också allmänna verk om det brittiska imperiets och samväldets historia Historia om enskilda kolonier, transmarina områden eller länder som inom samväldet klassificeras enligt de ifrågavarande områdenas historia @sv
scope note: Tähän ja alaluokkiin Yhdistyneen kuningaskunnan, Englannin, Skotlannin ja Walesin historia Tähän ja alaluokkiin myös brittiläisen imperiumin ja kansainyhteisön historiaa koskevat yleisteokset Tietyn siirtomaan, merentakaisen alueen tai kansainyhteisön jäsenmaan historia luokitetaan ko. alueen historiaan

Ison-Britannian historia, vanha aika ja keskiaika
type: Concept
type: YKL-luokka
alternative label: Kelter, arkeologi (95.11) @sv
alternative label: Keltit, arkeologia (95.11)
broader: Ison-Britannian historia
in scheme: YKL - Yleisten kirjastojen luokitusjärjestelmä
notation: 95.11
preferred label: History of United Kingdom, ancient times and middle ages @en
preferred label: Storbritanniens historia, gamla tiden och medeltiden @sv
scope note: Till år 1500 Hit också allmänna verk om Storbritanniens arkeologi @sv
scope note: Vuoteen 1500 Tähän myös Iso-Britannian arkeologian yleisteokset

Ison-Britannian historia, uusi aika
type: Concept
type: YKL-luokka
broader: Ison-Britannian historia
in scheme: YKL - Yleisten kirjastojen luokitusjärjestelmä
notation: 95.12
preferred label: History of United Kingdom, modern age @en
preferred label: Storbritanniens historia , nya tiden @sv
scope note: V. 1500-1899
scope note: Åren 1500-1899 @sv

Ison-Britannian historia, nykyaika
type: Concept
type: YKL-luokka
broader: Ison-Britannian historia
in scheme: YKL - Yleisten kirjastojen luokitusjärjestelmä
notation: 95.13
preferred label: History of United Kingdom, present time @en
preferred label: Storbritanniens historia, nutid @sv
scope note: Från 1900 framåt @sv
scope note: Vuodesta 1900-

Irlannin historia
type: Concept
type: YKL-luokka
alternative label: Irland, historia (95.7+) @sv
alternative label: Irlanti, historia (95.7+)
broader: BRITTEINSAARTEN HISTORIA
in scheme: YKL - Yleisten kirjastojen luokitusjärjestelmä
narrower: Irlannin tasavallan historia
narrower: Pohjois-Irlannin historia
notation: 95.7
preferred label: History of Ireland @en
preferred label: Irlands historia @sv

Irlannin tasavallan historia
type: Concept
type: YKL-luokka
alternative label: Eire, historia (95.71)
alternative label: Irlannin tasavalta, historia (95.71)
alternative label: Irländska republiken, historia (95.71) @sv
broader: Irlannin historia
in scheme: YKL - Yleisten kirjastojen luokitusjärjestelmä
notation: 95.71
preferred label: History of Republic of Ireland @en
preferred label: Irländska republikens historia @sv

Pohjois-Irlannin historia
type: Concept
type: YKL-luokka
alternative label: Nordirland, historia (95.72) @sv
alternative label: Pohjois-Irlanti, historia (95.72)
alternative label: Ulster, historia (95.72)
broader: Irlannin historia
in scheme: YKL - Yleisten kirjastojen luokitusjärjestelmä
notation: 95.72
preferred label: History of Northern Ireland @en
preferred label: Nordirlands historia @sv

ETELÄ-EUROOPAN HISTORIA
type: Concept
type: YKL-luokka
alternative label: Aseelliset vapautusrintamat (91 ... 98+)
alternative label: Beväpnade befrielsefronter (91 ... 98+) @sv
alternative label: Etelä-Eurooppa, historia (96+)
alternative label: Gerillarörelser (91 ... 98+) @sv
alternative label: Historia, landsvis och regionvis (91 ... 98+) @sv
alternative label: Historia, maittain ja alueittain (91 ... 98+)
alternative label: Inrikespolitik, historia (92 ... 98+) @sv
alternative label: Kolonialpolitik, historia (91 ... 98+) @sv
alternative label: Revolutioner (91 ... 98+) @sv
alternative label: Siirtomaapolitiikka, historia (91 ... 98+)
alternative label: Sissiliikkeet (91 ... 98+)
alternative label: Sisäpolitiikka, historia (92 ... 98+)
alternative label: Statskupper (91 ... 98+) @sv
alternative label: Sydeuropa, historia (96+) @sv
alternative label: Ulkopolitiikka, historia (91 ... 98+)
alternative label: Utrikespolitik, historia (91 ... 98+) @sv
alternative label: Vallankaappaukset (91 ... 98+)
alternative label: Vallankumoukset (91 ... 98+)
broader: HISTORIA
in scheme: YKL - Yleisten kirjastojen luokitusjärjestelmä
narrower: Ranskan historia
narrower: Italian historia
narrower: Espanjan historia
narrower: Portugalin historia
narrower: Maltan historia
narrower: Balkanin maiden historia
notation: 96
preferred label: HISTORY OF SOUTHERN EUROPE @en
preferred label: SYDEUROPAS HISTORIA @sv
scope note: Hit allmänna verk om Sydeuropas historia Formtillägget 09 används inte i samband med klasserna 90-99.31 @sv
scope note: Tähän Etelä-Euroopan historian yleisteokset Muotoluokkaa 09 ei käytetä luokkien 90-99.31 yhteydessä

Ranskan historia
type: Concept
type: YKL-luokka
alternative label: Frankrike, historia (96.1+) @sv
alternative label: Franska samväldet, historia (96.1+) @sv
alternative label: Korsika, historia (96.1+)
alternative label: Pariisi, historia (96.1+)
alternative label: Paris, historia (96.1+) @sv
alternative label: Ranska, historia (96.1+)
alternative label: Ranskan liittokunta, historia (96.1+)
alternative label: Riviera, Ranska, historia (96.1+)
alternative label: Rivieran, Frankrike, historia (96.1+) @sv
broader: ETELÄ-EUROOPAN HISTORIA
in scheme: YKL - Yleisten kirjastojen luokitusjärjestelmä
narrower: Ranskan historia, vanha ja keskiaika
narrower: Ranskan historia, uusi aika
narrower: Ranskan historia, nykyaika
narrower: Monacon historia
notation: 96.1
preferred label: Frankrikes historia @sv
preferred label: History of France @en
scope note: De franska koloniernas och de franska transmarina områdenas historia klassificeras enligt det ifrågavarande landets eller områdets historia @sv
scope note: Ranskan siirtomaiden ja merentakaisten alueiden historia luokitetaan ko. maan tai alueen historiaan

Ranskan historia, vanha ja keskiaika
type: Concept
type: YKL-luokka
broader: Ranskan historia
in scheme: YKL - Yleisten kirjastojen luokitusjärjestelmä
notation: 96.11
preferred label: Franrikes historia, gamla tiden och medeltiden @sv
preferred label: History of France, ancient times and middle ages @en
scope note: Till år 1500 Hit också allmänna verk om Frankrikes arkeologi @sv
scope note: Vuoteen 1500 Tähän myös Ranskan arkeologian yleisteokset

Ranskan historia, uusi aika
type: Concept
type: YKL-luokka
alternative label: Franska revolutionen 1789 (96.12) @sv
alternative label: Ranskan vallankumous 1789 (96.12)
alternative label: Revolutionen, Franska (96.12) @sv
alternative label: Vallankumous, Ranskan (96.12)
broader: Ranskan historia
in scheme: YKL - Yleisten kirjastojen luokitusjärjestelmä
notation: 96.12
preferred label: Franrikes historia, nya tiden @sv
preferred label: History of France, modern age @en
scope note: V. 1500-1899
scope note: Åren 1500-1899 @sv

Ranskan historia, nykyaika
type: Concept
type: YKL-luokka
broader: Ranskan historia
in scheme: YKL - Yleisten kirjastojen luokitusjärjestelmä
notation: 96.13
preferred label: Franrikes historia, nutid @sv
preferred label: History of France, present time @en
scope note: Från år 1900 framåt @sv
scope note: Vuodesta 1900-

Monacon historia
type: Concept
type: YKL-luokka
alternative label: Monaco, historia (96.19)
broader: Ranskan historia
in scheme: YKL - Yleisten kirjastojen luokitusjärjestelmä
notation: 96.19
preferred label: History of Monaco @en
preferred label: Monacos historia @sv

Italian historia
type: Concept
References: Vanha aika, antiikin Rooman historia
type: YKL-luokka
alternative label: Italia, historia (96.2)
alternative label: Italien, historia (96.2) @sv
alternative label: Riviera, Italia, historia (96.2)
alternative label: Rivieran, Italien, historia (96.2) @sv
alternative label: Rom (96.2) @sv
alternative label: Rooman kaupunki, nykyhistoria (96.2)
alternative label: Sardinia, historia (96.2)
alternative label: Sardinien, historia (96.2) @sv
alternative label: Sicilien, historia (96.2) @sv
alternative label: Sisilia, historia (96.2)
broader: ETELÄ-EUROOPAN HISTORIA
in scheme: YKL - Yleisten kirjastojen luokitusjärjestelmä
narrower: Vatikaanin historia
narrower: San Marinon historia
notation: 96.2
preferred label: History of Italy @en
preferred label: Italiens historia @sv

Vatikaanin historia
type: Concept
type: YKL-luokka
alternative label: Vatikaanivaltio, historia (96.22)
alternative label: Vatikanstaten, historia (96.22) @sv
broader: Italian historia
in scheme: YKL - Yleisten kirjastojen luokitusjärjestelmä
notation: 96.22
preferred label: History of Vatican City @en
preferred label: Vatikanstatens historia @sv

San Marinon historia
type: Concept
type: YKL-luokka
alternative label: San Marino, historia (96.23)
broader: Italian historia
in scheme: YKL - Yleisten kirjastojen luokitusjärjestelmä
notation: 96.23
preferred label: History of San Marino @en
preferred label: San Marinos historia @sv

Espanjan historia
type: Concept
References: Afrikan saarten historia
type: YKL-luokka
alternative label: Baleaarit, historia (96.3)
alternative label: Balearerna, historia (96.3) @sv
alternative label: Basker, Spaniens historia (96.3) @sv
alternative label: Baskit, Espanjan historia (96.3)
alternative label: Espanja, historia (96.3)
alternative label: Gibraltar, historia (96.3)
alternative label: Ibiza, historia (96.3)
alternative label: Mallorca, historia (96.3)
alternative label: Spanien, historia (96.3) @sv
broader: ETELÄ-EUROOPAN HISTORIA
in scheme: YKL - Yleisten kirjastojen luokitusjärjestelmä
narrower: Andorran historia
notation: 96.3
preferred label: History of Spain @en
preferred label: Spaniens historia @sv
scope note: Hit också Gibraltars historia @sv
scope note: Tähän myös Gibraltarin historia

Andorran historia
type: Concept
type: YKL-luokka
alternative label: Andorra, historia (96.32)
broader: Espanjan historia
in scheme: YKL - Yleisten kirjastojen luokitusjärjestelmä
notation: 96.32
preferred label: Andorras historia @sv
preferred label: History of Andorra @en

Portugalin historia
type: Concept
References: Afrikan saarten historia
type: YKL-luokka
alternative label: Portugal, historia (96.4) @sv
alternative label: Portugali, historia (96.4)
broader: ETELÄ-EUROOPAN HISTORIA
in scheme: YKL - Yleisten kirjastojen luokitusjärjestelmä
notation: 96.4
preferred label: History of Portugal @en
preferred label: Portugals historia @sv

Maltan historia
type: Concept
type: YKL-luokka
alternative label: Malta, historia (96.5)
broader: ETELÄ-EUROOPAN HISTORIA
in scheme: YKL - Yleisten kirjastojen luokitusjärjestelmä
notation: 96.5
preferred label: History of Malta @en
preferred label: Maltas historia @sv

Balkanin maiden historia
type: Concept
type: YKL-luokka
alternative label: Balkanin maat, historia (96.8+)
alternative label: Balkanländerna, historia (96.8+) @sv
broader: ETELÄ-EUROOPAN HISTORIA
in scheme: YKL - Yleisten kirjastojen luokitusjärjestelmä
narrower: Bulgarian historia
narrower: Romanian historia
narrower: Entisen Jugoslavian alueen historia
narrower: Albanian historia
narrower: Kreikan historia
notation: 96.8
preferred label: Balkanhalvöns historia @sv
preferred label: History of Balkans @en

Bulgarian historia
type: Concept
type: YKL-luokka
alternative label: Bulgaria, historia (96.81)
alternative label: Bulgarien, historia (96.81) @sv
broader: Balkanin maiden historia
in scheme: YKL - Yleisten kirjastojen luokitusjärjestelmä
notation: 96.81
preferred label: Bulgariens historia @sv
preferred label: History of Bulgaria @en

Romanian historia
type: Concept
type: YKL-luokka
alternative label: Bessarabia, Romanian historia (96.82)
alternative label: Bessarabien, Rumäniens historia (96.82) @sv
alternative label: Romania, historia (96.82)
alternative label: Rumänien, historia (96.82) @sv
broader: Balkanin maiden historia
in scheme: YKL - Yleisten kirjastojen luokitusjärjestelmä
notation: 96.82
preferred label: History of Romania @en
preferred label: Rumäniens historia @sv

Entisen Jugoslavian alueen historia
type: Concept
type: YKL-luokka
alternative label: Hercegovina, historia (96.83) @sv
alternative label: Herzegovina, historia (96.83)
alternative label: Jugoslavian alue, historia (96.83+)
alternative label: Jugoslavien, f.d., historia (96.83+) @sv
broader: Balkanin maiden historia
in scheme: YKL - Yleisten kirjastojen luokitusjärjestelmä
narrower: Bosnia ja Hertsegovinan historia
narrower: Kosovon historia
narrower: Kroatian historia
narrower: Pohjois-Makedonian historia
narrower: Montenegron historia
narrower: Serbian historia
narrower: Slovenian historia
notation: 96.83
preferred label: Före detta Jugoslaviens historia @sv
preferred label: History of The area of former Yugoslavia @en

Bosnia ja Hertsegovinan historia
type: Concept
type: YKL-luokka
alternative label: Bosnia ja Herzegovina, historia (96.831)
alternative label: Bosnien och Hercegovina, historia (96.831) @sv
broader: Entisen Jugoslavian alueen historia
in scheme: YKL - Yleisten kirjastojen luokitusjärjestelmä
notation: 96.831
preferred label: Bosnia och Hercegovinas historia @sv
preferred label: History of Bosnia and Herzegovina @en

Kosovon historia
type: Concept
type: YKL-luokka
alternative label: Kosovo, historia (96.832)
broader: Entisen Jugoslavian alueen historia
in scheme: YKL - Yleisten kirjastojen luokitusjärjestelmä
notation: 96.832
preferred label: History of Kosovo @en
preferred label: Kosovos historia @sv

Kroatian historia
type: Concept
type: YKL-luokka
alternative label: Kroatia, historia (96.833)
alternative label: Kroatien, historia (96.833) @sv
broader: Entisen Jugoslavian alueen historia
in scheme: YKL - Yleisten kirjastojen luokitusjärjestelmä
notation: 96.833
preferred label: History of Croatia @en
preferred label: Kroatiens historia @sv

Pohjois-Makedonian historia
type: Concept
type: YKL-luokka
alternative label: Makedonia, historia (Entinen Jugoslavian tasavalta Makedonia) (96.834)
alternative label: Makedonien, historia (Den före detta jugoslaviska republiken Makedonien) (96.834) @sv
broader: Entisen Jugoslavian alueen historia
in scheme: YKL - Yleisten kirjastojen luokitusjärjestelmä
notation: 96.834
preferred label: History of North Macedonia @en
preferred label: Nordmakedoniens historia @sv

Montenegron historia
type: Concept
type: YKL-luokka
alternative label: Montenegro, historia (96.835)
broader: Entisen Jugoslavian alueen historia
in scheme: YKL - Yleisten kirjastojen luokitusjärjestelmä
notation: 96.835
preferred label: History of Montenegro @en
preferred label: Montenegros historia @sv

Serbian historia
type: Concept
type: YKL-luokka
alternative label: Serbia, historia (96.836)
alternative label: Serbien, historia (96.836) @sv
alternative label: Vojvodina, historia (96.836)
broader: Entisen Jugoslavian alueen historia
in scheme: YKL - Yleisten kirjastojen luokitusjärjestelmä
notation: 96.836
preferred label: History of Serbia @en
preferred label: Serbiens historia @sv
scope note: Hit också Vojvodina @sv
scope note: Tähän myös Vojvodina

Slovenian historia
type: Concept
type: YKL-luokka
alternative label: Slovenia, historia (96.837)
alternative label: Slovenien, historia (96.837) @sv
broader: Entisen Jugoslavian alueen historia
in scheme: YKL - Yleisten kirjastojen luokitusjärjestelmä
notation: 96.837
preferred label: History of Slovenia @en
preferred label: Sloveniens historia @sv

Albanian historia
type: Concept
type: YKL-luokka
alternative label: Albania, historia (96.84)
alternative label: Albanien, historia (96.84) @sv
broader: Balkanin maiden historia
in scheme: YKL - Yleisten kirjastojen luokitusjärjestelmä
notation: 96.84
preferred label: Albaniens historia @sv
preferred label: History of Albania @en

Kreikan historia
type: Concept
References: Vanha aika, antiikin Kreikan historia
type: YKL-luokka
alternative label: Aigeianmeren saaret, nykyhistoria (96.85)
alternative label: Ateena, nykyhistoria (96.85)
alternative label: Aten, nutidshistoria (96.85) @sv
alternative label: Egeiska öarna, nutidshistoria (96.85) @sv
alternative label: Grekland, nutidshistoria (96.85) @sv
alternative label: Kreeta, nykyhistoria (96.85)
alternative label: Kreikka, nykyhistoria (96.85)
alternative label: Kreta, nutidshistoria (96.85) @sv
alternative label: Makedonia, Kreikan historia (96.85)
alternative label: Makedonien, Greklands historia (96.85) @sv
alternative label: Peloponnesos, nutidshistoria (96.85) @sv
alternative label: Peloponnesos, nykyhistoria (96.85)
alternative label: Rhodos, nutidshistoria (96.85) @sv
alternative label: Rodos, nykyhistoria (96.85)
broader: Balkanin maiden historia
in scheme: YKL - Yleisten kirjastojen luokitusjärjestelmä
notation: 96.85
preferred label: Greklands historia @sv
preferred label: History of Greece @en

ITÄ-EUROOPAN HISTORIA
type: Concept
References: History of Czech Republic and Slovakia {@en}}
References: Unkarin historia
References: Balkanin maiden historia
References: Armenian, Azerbaidzanin, Georgian, Kazakstanin, Kirgisian, Tadzikistanin, Turkmenistanin ja Uzbekistanin historia
type: YKL-luokka
alternative label: Aseelliset vapautusrintamat (91 ... 98+)
alternative label: Beväpnade befrielsefronter (91 ... 98+) @sv
alternative label: Gerillarörelser (91 ... 98+) @sv
alternative label: Historia, landsvis och regionvis (91 ... 98+) @sv
alternative label: Historia, maittain ja alueittain (91 ... 98+)
alternative label: Inrikespolitik, historia (92 ... 98+) @sv
alternative label: Itsenäisten valtioiden yhteisö, historia (97+)
alternative label: Itä-Eurooppa, historia (97+)
alternative label: Kolonialpolitik, historia (91 ... 98+) @sv
alternative label: Oberoende staters samvälde, historia (97+) @sv
alternative label: Revolutioner (91 ... 98+) @sv
alternative label: Siirtomaapolitiikka, historia (91 ... 98+)
alternative label: Sissiliikkeet (91 ... 98+)
alternative label: Sisäpolitiikka, historia (92 ... 98+)
alternative label: Statskupper (91 ... 98+) @sv
alternative label: Ulkopolitiikka, historia (91 ... 98+)
alternative label: Utrikespolitik, historia (91 ... 98+) @sv
alternative label: Vallankaappaukset (91 ... 98+)
alternative label: Vallankumoukset (91 ... 98+)
alternative label: Östeuropa, historia (97+) @sv
broader: HISTORIA
in scheme: YKL - Yleisten kirjastojen luokitusjärjestelmä
narrower: Venäjän ja Neuvostoliiton historia
narrower: Baltian maiden historia
narrower: Puolan historia
narrower: Ukrainan historia
narrower: Valko-Venäjän historia
narrower: Moldovan historia
notation: 97
preferred label: HISTORY OF EASTERN EUROPE @en
preferred label: ÖSTEUROPAS HISTORIA @sv
scope note: Hit också allmänna verk om de socialistiska ländernas historia i Europa Hit också allmänna verk om historien av OSS Formtillägget 09 används inte i samband med klasserna 90-99.31 @sv
scope note: Tähän myös Euroopan sosialististen maiden historiaa koskevat yleisteokset Tähän myös IVY:n historiaa koskevat yleisteokset Muotoluokkaa 09 ei käytetä luokkien 90-99.31 yhteydessä

Venäjän ja Neuvostoliiton historia
type: Concept
type: YKL-luokka
alternative label: Ingermanland, historia (97.1+) @sv
alternative label: Inkeri, historia (97.1+)
alternative label: Itä-Karjala, historia (97.1+)
alternative label: Jakutia, historia (97.1+)
alternative label: Jakutien, historia (97.1+) @sv
alternative label: Kamtjatka, historia (97.1+) @sv
alternative label: Kamtsatka, historia (97.1+)
alternative label: Kolahalvön, historia (97.1+) @sv
alternative label: Kuolan niemimaa, historia (97.1+)
alternative label: Kuriilit, Venäjän historia (97.1+)
alternative label: Kurilerna, Rysslands historia (97.1+) @sv
alternative label: Leningrad, historia (97.1+)
alternative label: Moskova, historia (97.1+)
alternative label: Moskva, historia (97.1+) @sv
alternative label: Murmanskin alue, historia (97.1+)
alternative label: Murmanskområdet, historia (97.1+) @sv
alternative label: Neuvostoliitto, historia (97.1+)
alternative label: Novaja Zemlja, historia (97.1+)
alternative label: Panslavism (97.1+) @sv
alternative label: Panslavismi (97.1+)
alternative label: Pietari, historia (97.1+)
alternative label: Ryssland, historia (97.1+) @sv
alternative label: S:t Petersburg, historia (97.1+) @sv
alternative label: Saamelaiset, historia, Venäjä ja NL (97.1+)
alternative label: Sachalin, historia (97.1+) @sv
alternative label: Sahalin, historia (97.1+)
alternative label: Samer, historia, Ryssland och Sovjetunionen (97.1+) @sv
alternative label: Sibirien, historia (97.1+) @sv
alternative label: Siperia, historia (97.1+)
alternative label: Sovjetunionen, historia (97.1+) @sv
alternative label: Tjetjenien, historia (97.1+) @sv
alternative label: Tsetsenia, historia (97.1+)
alternative label: Venäjä, historia (97.1+)
alternative label: Östkarelen, historia (97.1+) @sv
broader: ITÄ-EUROOPAN HISTORIA
in scheme: YKL - Yleisten kirjastojen luokitusjärjestelmä
narrower: Venäjä vuoteen 1917
narrower: Neuvostoliiton historia 1917-1991
narrower: Venäjä vuodesta 1992
notation: 97.1
preferred label: History of Russia and Soviet Union @en
preferred label: Rysslands och Sovjetunionens historia @sv
scope note: Hit och till underklasserna historia om de europeiska och asiatiska delarna av Ryssland och Sovjetunionen @sv
scope note: Tähän ja alaluokkiin Venäjän ja Neuvostoliiton Euroopan ja Aasian puoleisten alueiden historia

Venäjä vuoteen 1917
type: Concept
type: YKL-luokka
alternative label: Revolutionen, Ryska (97.13) @sv
alternative label: Ryska revolutionen (97.13) @sv
alternative label: Ryssland, arkeologi (97.13) @sv
alternative label: Vallankumous, Venäjän (97.13)
alternative label: Venäjä, arkeologia (97.13)
alternative label: Venäjän vallankumous (97.13)
broader: Venäjän ja Neuvostoliiton historia
in scheme: YKL - Yleisten kirjastojen luokitusjärjestelmä
notation: 97.13
preferred label: Russia until 1917 @en
preferred label: Ryssland till år 1917 @sv
scope note: Hit också arkeologi i Ryssland eller på sovjetiskt område Hit också ryska revolutionen @sv
scope note: Tähän myös Venäjän tai Neuvostoliiton alueen arkeologia Tähän myös Venäjän vallankumous

Neuvostoliiton historia 1917-1991
type: Concept
References: Baltian maiden historia
type: YKL-luokka
alternative label: Neuvosto-Karjala, historia (97.14+)
alternative label: Sovjetkarelen, historia (97.14+) @sv
alternative label: Stalinism, Sovjetunionens historia (97.14+) @sv
alternative label: Stalinismi, Neuvostoliiton historia (97.14+)
broader: Venäjän ja Neuvostoliiton historia
in scheme: YKL - Yleisten kirjastojen luokitusjärjestelmä
narrower: Neuvostoliiton historia v. 1917-1938
narrower: Neuvostoliiton historia v. 1939-1945
narrower: Neuvostoliiton historia v. 1946-1991
notation: 97.14
preferred label: History of Soviet Union years 1917-1991 @en
preferred label: Sovjetunionens historia åren 1917-1991 @sv
scope note: Hit och till underklasserna också Sovjet-Karelens historia @sv
scope note: Tähän ja alaluokkiin myös Neuvosto-Karjalan historia

Neuvostoliiton historia v. 1917-1938
type: Concept
type: YKL-luokka
broader: Neuvostoliiton historia 1917-1991
in scheme: YKL - Yleisten kirjastojen luokitusjärjestelmä
notation: 97.141
preferred label: History of Soviet Union years 1917-1938 @en
preferred label: Sovjetunionens historia åren 1917-1938 @sv

Neuvostoliiton historia v. 1939-1945
type: Concept
type: YKL-luokka
broader: Neuvostoliiton historia 1917-1991
in scheme: YKL - Yleisten kirjastojen luokitusjärjestelmä
notation: 97.142
preferred label: History of Soviet Union years 1939-1945 @en
preferred label: Sovjetunionens historia åren 1939-1945 @sv

Neuvostoliiton historia v. 1946-1991
type: Concept
References: Karjalan historia
References: Lapin historia
References: Baltian maiden historia
type: YKL-luokka
alternative label: Aunus, historia (97.143)
alternative label: Avträdda områden, Karelen, historia från år 1945 (97.143) @sv
alternative label: Avträdda områden, Salla och Petsamo, historia från år 1945 (97.143) @sv
alternative label: Bessarabia, Neuvostoliiton historia (97.143)
alternative label: Bessarabien, Sovjetunionens historia (97.143) @sv
alternative label: Hogland, historia från år 1945 till år 1991 (97.143) @sv
alternative label: Karelen, Karelska republiken, historia (97.143) @sv
alternative label: Karelen, det avträdda Karelen, historia från år 1945 (97.143) @sv
alternative label: Karelska näset, historia från år 1945 (97.143) @sv
alternative label: Karjala, Karjalan tasavalta, historia (97.143)
alternative label: Karjalan kannas, historia vuodesta 1945 (97.143)
alternative label: Lavansaari, historia vuodesta 1945 vuoteen 1991 (97.143)
alternative label: Luovutettu Karjala, historia vuodesta 1945 (97.143)
alternative label: Luovutetut alueet, Karjala, historia vuodesta 1945 (97.143)
alternative label: Luovutetut alueet, Salla ja Petsamo, historia vuodesta 1945 (97.143)
alternative label: Lövskär, historia från år 1945 till år 1991 (97.143) @sv
alternative label: Olonets, historia (97.143) @sv
alternative label: Petsamo, historia från år 1945 (97.143) @sv
alternative label: Petsamo, historia vuodesta 1945 (97.143)
alternative label: Sallan alue, historia vuodesta 1945 (97.143)
alternative label: Sallaområdet, historia från år 1945 (97.143) @sv
alternative label: Seiskari, historia vuodesta 1945 vuoteen 1991 (97.143)
alternative label: Seitskär, historia från år 1945 till år 1991 (97.143) @sv
alternative label: Suursaari, historia vuodesta 1945 vuoteen 1991 (97.143)
alternative label: Tyterskär, historia från år 1945 till år 1991 (97.143) @sv
alternative label: Tytärsaari, historia vuodesta 1945 vuoteen 1991 (97.143)
alternative label: Viborg, historia från år 1945 till år 1991 (97.143) @sv
alternative label: Viipuri, historia vuodesta 1945 vuoteen 1991 (97.143)
broader: Neuvostoliiton historia 1917-1991
in scheme: YKL - Yleisten kirjastojen luokitusjärjestelmä
notation: 97.143
preferred label: History of Soviet Union years 1946-1991 @en
preferred label: Sovjetunionens historia åren 1946-1991 @sv
scope note: Hit också historia om de avträdda områdena i Karelen, Petsamo och Salla från 1945 @sv
scope note: Tähän myös luovutettujen Karjalan, Petsamon ja Sallan alueiden historia v. 1945-1991

Venäjä vuodesta 1992
type: Concept
type: YKL-luokka
alternative label: Hogland, historia från år 1992 (97.15) @sv
alternative label: Lavansaari, historia vuodesta 1992 (97.15)
alternative label: Lövskär, historia från år 1992 (97.15) @sv
alternative label: Seiskari, historia vuodesta 1992 (97.15)
alternative label: Seitskär, historia från år 1992 (97.15) @sv
alternative label: Suursaari, historia vuodesta 1992 (97.15)
alternative label: Tyterskär, historia från år 1992 (97.15) @sv
alternative label: Tytärsaari, historia vuodesta 1992 (97.15)
alternative label: Viborg, historia från år 1992 (97.15) @sv
alternative label: Viipuri, historia vuodesta 1992 (97.15)
broader: Venäjän ja Neuvostoliiton historia
in scheme: YKL - Yleisten kirjastojen luokitusjärjestelmä
notation: 97.15
preferred label: Russia from the year 1992 @en
preferred label: Ryssland från året 1992 @sv
scope note: Hit också historia om de avträdda områdena i Karelen, Petsamo och Salla från år 1992 Karelska republiken. Murmanskområdet. @sv
scope note: Tähän myös luovutettujen Karjalan, Petsamon ja Sallan alueiden historia vuodesta 1992- Karjalan tasavalta. Murmanskin alue

Baltian maiden historia
type: Concept
type: YKL-luokka
alternative label: Baltian maat, historia (97.2+)
alternative label: Baltikum, historia (97.2+) @sv
broader: ITÄ-EUROOPAN HISTORIA
in scheme: YKL - Yleisten kirjastojen luokitusjärjestelmä
narrower: Viron historia
narrower: Latvian historia
narrower: Liettuan historia
notation: 97.2
preferred label: Baltiska ländernas historia @sv
preferred label: History of Baltic States @en

Viron historia
type: Concept
type: YKL-luokka
alternative label: Eesti, historia (97.21)
alternative label: Estland, historia (97.21) @sv
alternative label: Viro, historia (97.21)
broader: Baltian maiden historia
in scheme: YKL - Yleisten kirjastojen luokitusjärjestelmä
notation: 97.21
preferred label: Estlands historia @sv
preferred label: History of Estonia @en

Latvian historia
type: Concept
type: YKL-luokka
alternative label: Latvia, historia (97.22)
alternative label: Lettland, historia (97.22) @sv
broader: Baltian maiden historia
in scheme: YKL - Yleisten kirjastojen luokitusjärjestelmä
notation: 97.22
preferred label: History of Latvia @en
preferred label: Lettlands historia @sv

Liettuan historia
type: Concept
type: YKL-luokka
alternative label: Liettua, historia (97.23)
alternative label: Litauen, historia (97.23) @sv
broader: Baltian maiden historia
in scheme: YKL - Yleisten kirjastojen luokitusjärjestelmä
notation: 97.23
preferred label: History of Lithuania @en
preferred label: Litauens historia @sv

Puolan historia
type: Concept
type: YKL-luokka
alternative label: Gdansk, historia från året 1945 (97.3) @sv
alternative label: Gdansk, historia vuodesta 1945 (97.3)
alternative label: Itä-Preussi, historia, Puola (97.3)
alternative label: Ostpreussen, historia, Polen (97.3) @sv
alternative label: Polen, historia (97.3) @sv
alternative label: Puola, historia (97.3)
broader: ITÄ-EUROOPAN HISTORIA
in scheme: YKL - Yleisten kirjastojen luokitusjärjestelmä
notation: 97.3
preferred label: History of Poland @en
preferred label: Polens historia @sv

Ukrainan historia
type: Concept
type: YKL-luokka
alternative label: Ukraina, historia (97.4)
broader: ITÄ-EUROOPAN HISTORIA
in scheme: YKL - Yleisten kirjastojen luokitusjärjestelmä
notation: 97.4
preferred label: History of Ukraine @en
preferred label: Ukrainas historia @sv

Valko-Venäjän historia
type: Concept
type: YKL-luokka
alternative label: Valko-Venäjä, historia (97.5)
alternative label: Vitryssland, historia (97.5) @sv
broader: ITÄ-EUROOPAN HISTORIA
in scheme: YKL - Yleisten kirjastojen luokitusjärjestelmä
notation: 97.5
preferred label: History of Belarus @en
preferred label: Vitrysslands historia @sv

Moldovan historia
type: Concept
type: YKL-luokka
alternative label: Moldavia, historia (97.6)
alternative label: Moldavien, historia (97.6) @sv
alternative label: Moldova, historia (97.6)
broader: ITÄ-EUROOPAN HISTORIA
in scheme: YKL - Yleisten kirjastojen luokitusjärjestelmä
notation: 97.6
preferred label: History of Moldova @en
preferred label: Moldaviens historia @sv

MUIDEN MAANOSIEN HISTORIA
type: Concept
References: MAAILMANHISTORIA. EUROOPAN HISTORIA
type: YKL-luokka
alternative label: Arabimaat, nykyhistoria (98+)
alternative label: Arabländerna, nutidshistoria (98+) @sv
alternative label: Aseelliset vapautusrintamat (91 ... 98+)
alternative label: Beväpnade befrielsefronter (91 ... 98+) @sv
alternative label: Gerillarörelser (91 ... 98+) @sv
alternative label: Historia, landsvis och regionvis (91 ... 98+) @sv
alternative label: Historia, maittain ja alueittain (91 ... 98+)
alternative label: Inrikespolitik, historia (92 ... 98+) @sv
alternative label: Islam, nutidshistoria (98+) @sv
alternative label: Islam, nykyhistoria (98+)
alternative label: Kolonialpolitik, historia (91 ... 98+) @sv
alternative label: Revolutioner (91 ... 98+) @sv
alternative label: Siirtomaapolitiikka, historia (91 ... 98+)
alternative label: Sissiliikkeet (91 ... 98+)
alternative label: Sisäpolitiikka, historia (92 ... 98+)
alternative label: Statskupper (91 ... 98+) @sv
alternative label: Ulkopolitiikka, historia (91 ... 98+)
alternative label: Utrikespolitik, historia (91 ... 98+) @sv
alternative label: Vallankaappaukset (91 ... 98+)
alternative label: Vallankumoukset (91 ... 98+)
broader: HISTORIA
in scheme: YKL - Yleisten kirjastojen luokitusjärjestelmä
narrower: Aasian historia
narrower: Afrikan historia
narrower: Amerikan historia
narrower: Australian ja Oseanian historia
narrower: Napamaiden historia
notation: 98
preferred label: HISTORY OF OTHER CONTINENTS @en
preferred label: ÖVRIGA VÄRLDSDELARS HISTORIA @sv
scope note: Hit historiska verk som rör två eller flera världsdelar, dock inte Europa Hit också arabländernas gemensamma nutidshistoria Verk som rör Europas och någon annan världsdels historia förs till klassen för världshistoria 91+ Formtillägget 09 används inte i samband med klasserna 90-99.31 @sv
scope note: Tähän kahta tai useampaa maanosaa, ei kuitenkaan Eurooppaa, koskevat historiateokset Tähän myös arabimaiden yhteinen nykyhistoria Teokset, jotka koskevat Euroopan ja jonkin muun maanosan historiaa, luokitetaan maailmanhistoriaan 91+ Muotoluokkaa 09 ei käytetä luokkien 90-99.31 yhteydessä

Aasian historia
type: Concept
References: Venäjän ja Neuvostoliiton historia
type: YKL-luokka
alternative label: Aasia, historia (98.1+)
alternative label: Asien, historia (98.1+) @sv
alternative label: Itämaat, historia (98.1+)
alternative label: Itämaat, kulttuurihistoria (98.1+)
alternative label: Orienten, historia (98.1+) @sv
alternative label: Orienten, kulturhistoria (98.1+) @sv
alternative label: Orientti, historia (98.1+)
alternative label: Orientti, kulttuurihistoria (98.1+)
alternative label: Österlandet, historia (98.1+) @sv
alternative label: Österlandet, kulturhistoria (98.1+) @sv
broader: MUIDEN MAANOSIEN HISTORIA
in scheme: YKL - Yleisten kirjastojen luokitusjärjestelmä
narrower: Etu-Aasian historia
narrower: Etelä-Aasian historia
narrower: Kaakkois-Aasian historia
narrower: Armenian, Azerbaidzanin, Georgian, Kazakstanin, Kirgisian, Tadzikistanin, Turkmenistanin ja Uzbekistanin historia
narrower: Keski- ja Itä-Aasian historia
notation: 98.1
preferred label: Asian history @en
preferred label: Asiens historia @sv
scope note: Hit allmänna verk om Asiens historia @sv
scope note: Tähän Aasian historian yleisteokset

Etu-Aasian historia
type: Concept
References: Vanha aika
References: Keskiaika
References: MUIDEN MAANOSIEN HISTORIA
type: YKL-luokka
alternative label: Afganistan, historia (98.11)
alternative label: Afghanistan, historia (98.11) @sv
alternative label: Arabia, nykyhistoria (98.11)
alternative label: Arabiemiirikunnat, historia (98.11)
alternative label: Arabien, nutidshistoria (98.11) @sv
alternative label: Bahrain, historia (98.11)
alternative label: Etu-Aasia, nykyhistoria (98.11+)
alternative label: Främre Asien, nutidshistoria (98.11+) @sv
alternative label: Förenade Arabemiraten, historia (98.11) @sv
alternative label: Irak, nutidshistoria (98.11) @sv
alternative label: Irak, nykyhistoria (98.11)
alternative label: Iran, nutidshistoria (98.11) @sv
alternative label: Iran, nykyhistoria (98.11)
alternative label: Jemen, historia (98.11)
alternative label: Jordania, historia (98.11)
alternative label: Jordanien, historia (98.11) @sv
alternative label: Kurder, historia (98.11) @sv
alternative label: Kurdistan, historia (98.11)
alternative label: Kurdit, historia (98.11)
alternative label: Kuwait, historia (98.11)
alternative label: Libanon, historia (98.11)
alternative label: Lähi-itä, nykyhistoria (98.11+)
alternative label: Mellanöstern, nutidshistoria (98.11+) @sv
alternative label: Mindre Asien, historia från år 395 e.Kr. (98.11+) @sv
alternative label: Oman, historia (98.11)
alternative label: Persia, historia vuodesta 624 j.Kr. (98.11)
alternative label: Persien, historia från år 624 e. Kr. (98.11) @sv
alternative label: Qatar, historia (98.11)
alternative label: Saudi-Arabia, historia (98.11)
alternative label: Saudi-Arabien, historia (98.11) @sv
alternative label: Syrien, historia från år 636 e. Kr (98.11) @sv
alternative label: Syyria, historia vuodesta 636 j.Kr (98.11)
alternative label: Vähä-Aasia, historia vuodesta 395 j.Kr. (98.11+)
broader: Aasian historia
in scheme: YKL - Yleisten kirjastojen luokitusjärjestelmä
narrower: Turkin historia
narrower: Kyproksen historia
narrower: Israelin ja Palestiinan historia
notation: 98.11
preferred label: Främre Asiens historia @sv
preferred label: History of Western Asia @en
scope note: Afganistan. Arabiemiirikunnat. Bahrain. Irak. Iran. Jemen. Jordania. Kuwait. Libanon. Oman. Quatar. Saudi-Arabia. Syyria
scope note: Afghanistan. Bahrain. Förenade Arabemiraten. Irak. Iran. Jordanien. Kuwait. Libanon. Oman. Qatar. Saudiarabien. Syrien. Yemen @sv

Turkin historia
type: Concept
type: YKL-luokka
alternative label: Osmanien valtakunta, historia (98.111)
alternative label: Osmanska riket, historia (98.111) @sv
alternative label: Ottomaanien valtakunta, historia (98.111)
alternative label: Ottomanska riket, historia (98.111) @sv
alternative label: Turkiet, historia (98.111) @sv
alternative label: Turkki, historia (98.111)
broader: Etu-Aasian historia
in scheme: YKL - Yleisten kirjastojen luokitusjärjestelmä
notation: 98.111
preferred label: History of Turkey @en
preferred label: Turkiets historia @sv

Kyproksen historia
type: Concept
type: YKL-luokka
alternative label: Cypern, historia (98.112) @sv
alternative label: Kypros, historia (98.112)
broader: Etu-Aasian historia
in scheme: YKL - Yleisten kirjastojen luokitusjärjestelmä
notation: 98.112
preferred label: Cyperns historia @sv
preferred label: History of Cyprus @en

Israelin ja Palestiinan historia
type: Concept
References: Ihmisoikeudet. Kansalaisen asema yhteiskunnassa
References: KANSATIEDE. KULTTUURIANTROPOLOGIA
References: Elämäkerrat. Muistelmat, sotamuistelmat
type: YKL-luokka
alternative label: Israel, nutidshistoria (98.114) @sv
alternative label: Israel, nykyhistoria (98.114)
alternative label: Judar, historia (98.114) @sv
alternative label: Juutalaiset, historia (98.114)
alternative label: Palestiina, nykyhistoria (98.114)
alternative label: Palestina, nutidshistoria (98.114) @sv
alternative label: Sionism, judarnas historia (98.114) @sv
alternative label: Sionismi, juutalaisten historia (98.114)
broader: Etu-Aasian historia
in scheme: YKL - Yleisten kirjastojen luokitusjärjestelmä
notation: 98.114
preferred label: History of Israel and Palestine @en
preferred label: Israels och Palestinas historia @sv
scope note: Hit även allmänna verk om judarnas historia Judarnas historia i enskilda världsdelar, länder eller på enskilda områden klassificeras till världsdelens, landets eller områdets historia @sv
scope note: Tähän myös juutalaisten historian yleisteokset Juutalaisten historia tietyssä maanosassa, maassa tai tietyllä alueella luokitetaan ko. maanosan, maan tai alueen historiaan

Etelä-Aasian historia
type: Concept
type: YKL-luokka
alternative label: Bangladesh, historia (98.13)
alternative label: Bhutan, historia (98.13)
alternative label: Ceylon, historia (98.13)
alternative label: Etelä-Aasia, historia (98.13+)
alternative label: Etu-Intia, historia (98.13+)
alternative label: Främre Indien, historia (98.13+) @sv
alternative label: Maldiverna, historia (98.13) @sv
alternative label: Malediivit, historia (98.13)
alternative label: Nepal, historia (98.13)
alternative label: Pakistan, historia (98.13)
alternative label: Sri Lanka, historia (98.13)
alternative label: Sydasien, historia (98.13+) @sv
broader: Aasian historia
in scheme: YKL - Yleisten kirjastojen luokitusjärjestelmä
narrower: Intian historia
notation: 98.13
preferred label: History of South Asia @en
preferred label: Sydasiens historia @sv
scope note: Bangladesh. Bhutan. Maldiverna. Nepal. Pakistan. Sri Lanka @sv
scope note: Bangladesh. Bhutan. Malediivit. Nepal. Pakistan. Sri Lanka

Intian historia
type: Concept
type: YKL-luokka
alternative label: Andamaanit, historia (98.132)
alternative label: Andamanerna, historia (98.132) @sv
alternative label: Indien, historia (98.132) @sv
alternative label: Intia, historia (98.132)
alternative label: Kaster, Indiens historia (98.132) @sv
alternative label: Kastit, Intian historia (98.132)
alternative label: Lackadiverna, historia (98.132) @sv
alternative label: Lakkadiivit, historia (98.132)
alternative label: Nikobaarit, historia (98.132)
alternative label: Nikobarerna, historia (98.132) @sv
alternative label: Sikher, Indiens historia (98.132) @sv
alternative label: Sikhit, Intian historia (98.132)
alternative label: Tamiler, Indiens historia (98.132) @sv
alternative label: Tamilit, Intian historia (98.132)
broader: Etelä-Aasian historia
in scheme: YKL - Yleisten kirjastojen luokitusjärjestelmä
notation: 98.132
preferred label: History of India @en
preferred label: Indiens historia @sv

Kaakkois-Aasian historia
type: Concept
type: YKL-luokka
alternative label: Bali, historia (98.14)
alternative label: Borneo, historia (98.14)
alternative label: Bortre Indien, historia (98.14) @sv
alternative label: Brunei, historia (98.14)
alternative label: Celebes, historia (98.14)
alternative label: Filippiinit, historia (98.14)
alternative label: Filippinerna, historia (98.14) @sv
alternative label: Indokiina, historia (98.14)
alternative label: Indokina, historia (98.14) @sv
alternative label: Indonesia, historia (98.14)
alternative label: Indonesien, historia (98.14) @sv
alternative label: Itä-Intia, historia (98.14)
alternative label: Itä-Timor, historia (98.14)
alternative label: Jaava, historia (98.14)
alternative label: Java, historia (98.14) @sv
alternative label: Kaakkois-Aasia, historia (98.14)
alternative label: Kambodja, historia (98.14) @sv
alternative label: Kambodza, historia (98.14)
alternative label: Laos, historia (98.14)
alternative label: Malackahalvön, historia (98.14) @sv
alternative label: Malaijien saaristo, historia (98.14)
alternative label: Malajiska övärlden, historia (98.14) @sv
alternative label: Malakan niemimaa, historia (98.14)
alternative label: Malaysia, historia (98.14) @sv
alternative label: Malesia, historia (98.14)
alternative label: Moluckerna, historia (98.14) @sv
alternative label: Molukit, historia (98.14)
alternative label: Myanmar, historia (98.14)
alternative label: Ostindien, historia (98.14) @sv
alternative label: Singapore, historia (98.14)
alternative label: Sumatra, historia (98.14)
alternative label: Sydostasien, historia (98.14) @sv
alternative label: Taka-Intia, historia (98.14)
alternative label: Thailand, historia (98.14) @sv
alternative label: Thaimaa, historia (98.14)
alternative label: Timor, historia (98.14)
alternative label: Vietnam, historia (98.14)
alternative label: Östra Timor, historia (98.14) @sv
broader: Aasian historia
in scheme: YKL - Yleisten kirjastojen luokitusjärjestelmä
notation: 98.14
preferred label: History of Southeast Asia @en
preferred label: Sydostasiens historia @sv
scope note: Brunei. Filippiinit. Indonesia. Kambodza. Laos. Malesia. Myanmar. Singapore. Thaimaa. Vietnam
scope note: Brunei. Filippinerna. Indonesien. Kambodja. Laos. Malaysia. Myanmar. Singapore. Thailand. Vietnam @sv

Armenian, Azerbaidzanin, Georgian, Kazakstanin, Kirgisian, Tadzikistanin, Turkmenistanin ja Uzbekistanin historia
type: Concept
References: Venäjän ja Neuvostoliiton historia
References: Keski- ja Itä-Aasian historia
type: YKL-luokka
alternative label: Armenia, historia (98.17)
alternative label: Armenien, historia (98.17) @sv
alternative label: Azerbaidzan, historia (98.17)
alternative label: Azerbajdzjan, historia (98.17) @sv
alternative label: Centralasien, OSS-länderna, historia (98.17) @sv
alternative label: Georgia, historia (98.17)
alternative label: Georgien, historia (98.17) @sv
alternative label: Grusien, historia (98.17) @sv
alternative label: Gruusia, historia (98.17)
alternative label: Kaukasia, historia (98.17)
alternative label: Kaukasien, historia (98.17) @sv
alternative label: Kazakstan, historia (98.17)
alternative label: Keski-Aasia, IVY-maat, historia (98.17)
alternative label: Kirgisia, historia (98.17)
alternative label: Kirgisien, historia (98.17) @sv
alternative label: Tadzikistan, historia (98.17)
alternative label: Tadzjikistan, historia (98.17) @sv
alternative label: Turkestan, historia (98.17)
alternative label: Turkmenistan, historia (98.17)
alternative label: Uzbekistan, historia (98.17)
broader: Aasian historia
in scheme: YKL - Yleisten kirjastojen luokitusjärjestelmä
notation: 98.17
preferred label: Armeniens, Azerbajdzjans, Georgiens, Kazakstans, Kirgizistans, Tadzjikistans, Turkmenistans och Uzbekistans historia @sv
preferred label: History of Armenia, Azerbaijan, Georgia, Kazakhstan, Kyrgyzstan, Tajikistan, Turkmenistan and Uzbekistan @en

Keski- ja Itä-Aasian historia
type: Concept
References: Venäjän ja Neuvostoliiton historia
References: Etelä-Aasian historia
type: YKL-luokka
alternative label: Centralasien, historia (98.18) @sv
alternative label: Etelä-Korea, historia (98.18)
alternative label: Fjärran Östern, historia (98.18+) @sv
alternative label: Folkrepubliken Korea, historia (98.18) @sv
alternative label: Itä-Aasia, historia (98.18+)
alternative label: Kaukoitä, historia (98.18+)
alternative label: Keski-Aasia, historia (98.18)
alternative label: Korea, historia (98.18)
alternative label: Korean kansantasavalta, historia (98.18)
alternative label: Korean tasavalta, historia (98.18)
alternative label: Mongolia, historia (98.18)
alternative label: Mongoliet, historia (98.18) @sv
alternative label: Nordkorea, historia (98.18) @sv
alternative label: Ostasien, historia (98.18+) @sv
alternative label: Pohjois-Korea, historia (98.18)
alternative label: Republiken Korea, historia (98.18) @sv
alternative label: Sydkorea, historia (98.18) @sv
broader: Aasian historia
in scheme: YKL - Yleisten kirjastojen luokitusjärjestelmä
narrower: Kiinan historia
narrower: Japanin historia
notation: 98.18
preferred label: Centralasiens och Östasiens historia @sv
preferred label: History of Central Asia and East Asia @en
scope note: Hit allmänna verk om Central- och Östasiens historia Korea. Republiken Korea. Folkrepubliken Korea. Mongoliet @sv
scope note: Tähän Keski- ja Itä-Aasian historiaa koskevat yleisteokset Korea. Korean tasavalta. Korean kansantasavalta. Mongolia

Kiinan historia
type: Concept
type: YKL-luokka
alternative label: Hongkong, historia (98.183)
alternative label: Kiina, historia (98.183)
alternative label: Kina, historia (98.183) @sv
alternative label: Macao, historia (98.183)
alternative label: Manchuriet, historia (98.183) @sv
alternative label: Mantsuria, historia (98.183)
alternative label: Taiwan, historia (98.183)
alternative label: Tibet, historia (98.183) @sv
alternative label: Tiibet, historia (98.183)
broader: Keski- ja Itä-Aasian historia
in scheme: YKL - Yleisten kirjastojen luokitusjärjestelmä
notation: 98.183
preferred label: History of China @en
preferred label: Kinas historia @sv
scope note: Hit också Hong Kong, Macao, Taiwan och Tibet @sv
scope note: Tähän myös Hongkong, Macao, Taiwan ja Tiibet

Japanin historia
type: Concept
type: YKL-luokka
alternative label: Japan, historia (98.184) @sv
alternative label: Japani, historia (98.184)
alternative label: Kuriilit, Japanin historia (98.184)
alternative label: Kurilerna, Japans historia (98.184) @sv
broader: Keski- ja Itä-Aasian historia
in scheme: YKL - Yleisten kirjastojen luokitusjärjestelmä
notation: 98.184
preferred label: History of Japan @en
preferred label: Japans historia @sv

Afrikan historia
type: Concept
type: YKL-luokka
alternative label: Afrika, historia (98.2+) @sv
alternative label: Afrikka, historia (98.2+)
broader: MUIDEN MAANOSIEN HISTORIA
in scheme: YKL - Yleisten kirjastojen luokitusjärjestelmä
narrower: Pohjois-Afrikan historia
narrower: Länsi-Afrikan historia
narrower: Keski-Afrikan historia
narrower: Itä-Afrikan historia
narrower: Etelä-Afrikan historia
narrower: Afrikan saarten historia
notation: 98.2
preferred label: African history @en
preferred label: Afrikas historia @sv

Pohjois-Afrikan historia
type: Concept
References: Vanha aika, Egyptin historia
References: MUIDEN MAANOSIEN HISTORIA
type: YKL-luokka
alternative label: Algeria, historia (98.21)
alternative label: Algeriet, historia (98.21) @sv
alternative label: Atlasländerna, historia (98.21) @sv
alternative label: Atlasmaat, historia (98.21)
alternative label: Egypten, historia från året 639 e.Kr. (98.21) @sv
alternative label: Egypti, historia vuodesta 639 j.Kr. (98.21)
alternative label: Etelä-Sudan, historia (98.21)
alternative label: Kopter, Egyptens historia (98.21) @sv
alternative label: Koptit, Egyptin historia (98.21)
alternative label: Libya, historia (98.21)
alternative label: Libyen, historia (98.21) @sv
alternative label: Marocko, historia (98.21) @sv
alternative label: Marokko, historia (98.21)
alternative label: Nordafrika, historia (98.21) @sv
alternative label: Pohjois-Afrikka, historia (98.21)
alternative label: Sahara, historia (98.21)
alternative label: Sudan, historia (98.21)
alternative label: Sydsudan, historia (98.21) @sv
alternative label: Tunisia, historia (98.21)
alternative label: Tunisien, historia (98.21) @sv
broader: Afrikan historia
in scheme: YKL - Yleisten kirjastojen luokitusjärjestelmä
notation: 98.21
preferred label: History of North Africa @en
preferred label: Nordafrikas historia @sv
scope note: Algeria. Egypti. Etelä-Sudan. Libya. Marokko. Sudan. Tunisia Tähän myös Saharan alueen historian yleisteokset
scope note: Algeriet. Egypten. Libyen. Marocko. Sudan. Sydsudan. Tunisien Hit även Saharaområdets allmänna historia @sv

Länsi-Afrikan historia
type: Concept
type: YKL-luokka
alternative label: Benin, historia (98.25)
alternative label: Burkina Faso, historia (98.25)
alternative label: Dahomey, historia (98.25)
alternative label: Elfenbenskusten, historia (98.25) @sv
alternative label: Gambia, historia (98.25)
alternative label: Ghana, historia (98.25)
alternative label: Guinea, historia (98.25)
alternative label: Guinea-Bissau, historia (98.25)
alternative label: Liberia, historia (98.25)
alternative label: Länsi-Afrikka, historia (98.25)
alternative label: Mali, historia (98.25)
alternative label: Mauretanien, historia (98.25) @sv
alternative label: Mauritania, historia (98.25)
alternative label: Niger, historia (98.25)
alternative label: Nigeria, historia (98.25)
alternative label: Norsunluurannikko, historia (98.25)
alternative label: Sahel, historia (98.25)
alternative label: Senegal, historia (98.25)
alternative label: Sierra Leone, historia (98.25)
alternative label: Togo, historia (98.25)
alternative label: Västafrika, historia (98.25) @sv
broader: Afrikan historia
in scheme: YKL - Yleisten kirjastojen luokitusjärjestelmä
notation: 98.25
preferred label: History of West Africa @en
preferred label: Västafrikas historia @sv
scope note: Benin. Burkina Faso. Elfenbenskusten. Gambia. Ghana. Guinea. Guinea-Bissau. Liberia. Mali. Mauretanien. Niger. Nigeria. Senegal. Sierra Leone. Togo @sv
scope note: Benin. Burkina Faso. Gambia. Ghana. Guinea. Guinea-Bissau. Liberia. Mali. Mauritania. Niger. Nigeria. Norsunluurannikko. Senegal. Sierra Leone. Togo

Keski-Afrikan historia
type: Concept
type: YKL-luokka
alternative label: Angola, historia (98.26)
alternative label: Brazzaville, Kongo, historia (98.26)
alternative label: Centralafrika, historia (98.26) @sv
alternative label: Ekvatorialguinea, historia (98.26) @sv
alternative label: Gabon, historia (98.26)
alternative label: Kamerun, historia (98.26)
alternative label: Keski-Afrikka, historia (98.26)
alternative label: Kinshasa, Kongo, historia (98.26)
alternative label: Kongo, historia (98.26)
alternative label: Kongo-Brazzaville, historia (98.26)
alternative label: Kongo-Kinshasa, historia (98.26)
alternative label: Päiväntasaajan Guinea, historia (98.26)
alternative label: Tchad, historia (98.26) @sv
alternative label: Tsad, historia (98.26)
alternative label: Zaire, historia (98.26)
broader: Afrikan historia
in scheme: YKL - Yleisten kirjastojen luokitusjärjestelmä
notation: 98.26
preferred label: Centralafrikas historia @sv
preferred label: History of Central Africa @en
scope note: Angola. Centralafrikanska republiken. Ekvatorialguinea. Gabon. Kamerun. Kongo-Brazzaville. Kongo-Kinshasa. Tchad @sv
scope note: Angola. Gabon. Kamerun. Keski-Afrikan tasavalta. Kongo-Brazzaville. Kongo-Kinshasa. Päiväntasaajan Guinea. Tsad

Itä-Afrikan historia
type: Concept
type: YKL-luokka
alternative label: Abessinia, historia (98.27)
alternative label: Abessinien, historia (98.27) @sv
alternative label: Burundi, historia (98.27)
alternative label: Djibouti, historia (98.27)
alternative label: Eritrea, historia (98.27)
alternative label: Etiopia, historia (98.27)
alternative label: Etiopien, historia (98.27) @sv
alternative label: Itä-Afrikka, historia (98.27)
alternative label: Kenia, historia (98.27)
alternative label: Kenya, historia (98.27) @sv
alternative label: Ruanda, historia (98.27)
alternative label: Somalia, historia (98.27)
alternative label: Tansania, historia (98.27)
alternative label: Tanzania, historia (98.27) @sv
alternative label: Uganda, historia (98.27)
alternative label: Östafrika, historia (98.27) @sv
broader: Afrikan historia
in scheme: YKL - Yleisten kirjastojen luokitusjärjestelmä
notation: 98.27
preferred label: History of East Africa @en
preferred label: Östafrikas historia @sv
scope note: Burundi. Djibouti. Eritrea. Etiopia. Kenia. Ruanda. Somalia. Tansania. Uganda
scope note: Burundi. Djibouti. Eritrea. Etiopien. Kenya. Ruanda. Somalia. Tanzania. Uganda @sv

Etelä-Afrikan historia
type: Concept
References: Ihmisoikeudet. Kansalaisen asema yhteiskunnassa
type: YKL-luokka
alternative label: Amboland, historia (98.28) @sv
alternative label: Ambomaa, historia (98.28)
alternative label: Bechuanaland, historia (98.28) @sv
alternative label: Betsuanamaa, historia (98.28)
alternative label: Boer, historia (98.28) @sv
alternative label: Boerkriget (98.28) @sv
alternative label: Botswana, historia (98.28)
alternative label: Buurisota (98.28)
alternative label: Buurit, historia (98.28)
alternative label: Etelä-Afrikka, historia (98.28)
alternative label: Lesotho, historia (98.28)
alternative label: Malawi, historia (98.28)
alternative label: Mosambik, historia (98.28)
alternative label: Moçambique, historia (98.28) @sv
alternative label: Namibia, historia (98.28)
alternative label: Rhodesia, historia (98.28)
alternative label: Sambia, historia (98.28)
alternative label: Swaziland, historia (98.28) @sv
alternative label: Swazimaa, historia (98.28)
alternative label: Sydafrika, historia (98.28) @sv
alternative label: Zambia, historia (98.28) @sv
alternative label: Zimbabwe, historia (98.28)
broader: Afrikan historia
in scheme: YKL - Yleisten kirjastojen luokitusjärjestelmä
notation: 98.28
preferred label: History of South Africa @en
preferred label: Sydafrikas historia @sv
scope note: Botswana. Etelä-Afrikan tasavalta. Lesotho. Malawi. Mosambik. Namibia. Sambia. Swazimaa. Zimbabwe
scope note: Botswana. Lesotho. Malawi. Moçambique. Namibia. Swaziland. Sydafrikanska republiken. Zambia. Zimbabwe @sv

Afrikan saarten historia
type: Concept
type: YKL-luokka
alternative label: Afrikan saaret, historia (98.29)
alternative label: Afrikas öar, historia (98.29) @sv
alternative label: Aldabrasaaret, historia (98.29)
alternative label: Aldabraöarna, historia (98.29) @sv
alternative label: Amiranterna, historia (98.29) @sv
alternative label: Amirantit, historia (98.29)
alternative label: Ascension, historia (98.29)
alternative label: Azorerna, historia (98.29) @sv
alternative label: Azorit, historia (98.29)
alternative label: Kanarian saaret, historia (98.29)
alternative label: Kanarieöarna, historia (98.29) @sv
alternative label: Kap Verde, historia (98.29)
alternative label: Komorerna, historia (98.29) @sv
alternative label: Komorit, historia (98.29)
alternative label: Madagaskar, historia (98.29)
alternative label: Madeira, historia (98.29)
alternative label: Mauritius, historia (98.29)
alternative label: Mayotte, historia (98.29)
alternative label: Principe, historia (98.29)
alternative label: Réunion, historia (98.29)
alternative label: Saint Helena, historia (98.29)
alternative label: Sao Tomé ja Principe, historia (98.29)
alternative label: Sao Tomé och Principe, historia (98.29) @sv
alternative label: Seychellerna, historia (98.29) @sv
alternative label: Seychellit, historia (98.29)
alternative label: Tristan da Cunha, historia (98.29)
broader: Afrikan historia
in scheme: YKL - Yleisten kirjastojen luokitusjärjestelmä
notation: 98.29
preferred label: Afrkas öarnas historia @sv
preferred label: History of Islands of Africa @en
scope note: Aldabrasaaret. Amirantit. Ascension. Azorit. Kanarian saaret. Kap Verde. Komorit. Madagaskar. Madeira. Mauritius. Réunion. Saint Helena. Sao Tomé ja Principe. Seychellit. Tristan da Cunha
scope note: Aldabraöarna. Amiranterna. Ascension. Azorerna. Comorerna. Kanarieöarna. Kap Verde. Madagaskar. Madeira. Mauritius. Réunion. S:t Helena. Sao Tomé och Principe. Seychellerna. Tristan da Cunha @sv

Amerikan historia
type: Concept
References: Amerikan kansojen kansatiede
type: YKL-luokka
alternative label: Amerika, historia (98.3+) @sv
alternative label: Amerikka, historia (98.3+)
alternative label: Mayafolket, historia (98.3+) @sv
alternative label: Mayat, historia (98.3+)
broader: MUIDEN MAANOSIEN HISTORIA
in scheme: YKL - Yleisten kirjastojen luokitusjärjestelmä
narrower: Pohjois-Amerikan historia
narrower: Väli-Amerikan historia
narrower: Etelä-Amerikan historia
notation: 98.3
preferred label: American history @en
preferred label: Amerikas historia @sv

Pohjois-Amerikan historia
type: Concept
type: YKL-luokka
alternative label: Nordamerika, historia (98.31+) @sv
alternative label: Pohjois-Amerikka, historia (98.31+)
broader: Amerikan historia
in scheme: YKL - Yleisten kirjastojen luokitusjärjestelmä
narrower: Yhdysvaltojen historia
narrower: Kanadan historia
narrower: Meksikon historia
notation: 98.31
preferred label: History of North America @en
preferred label: Nordamerikas historia @sv

Yhdysvaltojen historia
type: Concept
References: Karibianmeren alueen historia
References: Havaijin historia
type: YKL-luokka
alternative label: Alaska, historia (98.312+)
alternative label: Aleuterna, historia (98.312+) @sv
alternative label: Aleutit, historia (98.312+)
alternative label: Förenta staterna, historia (98.312+) @sv
alternative label: Georgia, Förenta Staternas historia (98.312+) @sv
alternative label: Georgia, USA:n historia (98.312+)
alternative label: New York, historia (98.312+)
alternative label: USA, historia (98.312+)
alternative label: Vilda västern, historia (98.312+) @sv
alternative label: Villi länsi, historia (98.312+)
alternative label: Yhdysvallat, historia (98.312+)
broader: Pohjois-Amerikan historia
in scheme: YKL - Yleisten kirjastojen luokitusjärjestelmä
narrower: Yhdysvaltojen historia vuoteen 1775
narrower: Yhdysvaltojen historia v. 1775-1860
narrower: Yhdysvaltojen historia v. 1861-1945
narrower: Yhdysvaltojen historia vuodesta 1946
notation: 98.312
preferred label: Förenta staternas historia @sv
preferred label: History of United States of America @en
scope note: Hit även Alaska Förenta Staternas transmarina områdens historia klassificeras till ifrågavarande områdes historia @sv
scope note: Tähän myös Alaska Yhdysvaltain merentakaisten alueiden historia luokitetaan ko. alueen historiaan

Yhdysvaltojen historia vuoteen 1775
type: Concept
type: YKL-luokka
broader: Yhdysvaltojen historia
in scheme: YKL - Yleisten kirjastojen luokitusjärjestelmä
notation: 98.3121
preferred label: Förenta staternas historia till år 1775 @sv
preferred label: History of United States of America until 1775 @en

Yhdysvaltojen historia v. 1775-1860
type: Concept
type: YKL-luokka
broader: Yhdysvaltojen historia
in scheme: YKL - Yleisten kirjastojen luokitusjärjestelmä
notation: 98.3122
preferred label: Förenta staternas historia åren 1775-1860 @sv
preferred label: History of United States of America years 1775-1860 @en

Yhdysvaltojen historia v. 1861-1945
type: Concept
type: YKL-luokka
broader: Yhdysvaltojen historia
in scheme: YKL - Yleisten kirjastojen luokitusjärjestelmä
notation: 98.3123
preferred label: Förenta staternas historia åren 1861-1945 @sv
preferred label: History of United States of America years 1861-1945 @en

Yhdysvaltojen historia vuodesta 1946
type: Concept
type: YKL-luokka
broader: Yhdysvaltojen historia
in scheme: YKL - Yleisten kirjastojen luokitusjärjestelmä
notation: 98.3124
preferred label: Förenta staternas historia från året 1946 @sv
preferred label: History of United States of America from 1946 @en

Kanadan historia
type: Concept
type: YKL-luokka
alternative label: Kanada, historia (98.313)
alternative label: Labrador, historia (98.313)
alternative label: Newfoundland, historia (98.313)
alternative label: Quebec, historia (98.313)
broader: Pohjois-Amerikan historia
in scheme: YKL - Yleisten kirjastojen luokitusjärjestelmä
notation: 98.313
preferred label: History of Canada @en
preferred label: Kanadas historia @sv

Meksikon historia
type: Concept
type: YKL-luokka
alternative label: Asteekit, arkeologia (98.314)
alternative label: Asteekit, historia (98.314)
alternative label: Azteker, arkeologi (98.314) @sv
alternative label: Azteker, historia (98.314) @sv
alternative label: Meksiko, historia (98.314)
alternative label: Mexico, historia (98.314) @sv
alternative label: Pyramider, indianernas historia (98.314) @sv
alternative label: Pyramidit, intiaanien historia (98.314)
broader: Pohjois-Amerikan historia
in scheme: YKL - Yleisten kirjastojen luokitusjärjestelmä
notation: 98.314
preferred label: History of Mexico @en
preferred label: Mexicos historia @sv

Väli-Amerikan historia
type: Concept
type: YKL-luokka
alternative label: Mellanamerika, historia (98.35+) @sv
alternative label: Väli-Amerikka, historia (98.35+)
broader: Amerikan historia
in scheme: YKL - Yleisten kirjastojen luokitusjärjestelmä
narrower: Keski-Amerikan historia
narrower: Karibianmeren alueen historia
notation: 98.35
preferred label: History of Middle America @en
preferred label: Mellanamerikas historia @sv

Keski-Amerikan historia
type: Concept
type: YKL-luokka
alternative label: Belize, historia (98.355)
alternative label: Centralamerika, historia (98.355) @sv
alternative label: Costa Rica, historia (98.355)
alternative label: El Salvador, historia (98.355)
alternative label: Guatemala, historia (98.355)
alternative label: Honduras, historia (98.355)
alternative label: Keski-Amerikka, historia (98.355)
alternative label: Nicaragua, historia (98.355)
alternative label: Panama, historia (98.355)
broader: Väli-Amerikan historia
in scheme: YKL - Yleisten kirjastojen luokitusjärjestelmä
notation: 98.355
preferred label: Centralamerikas historia @sv
preferred label: History of Central America @en
scope note: Belize. Costa Rica. El Salvador. Guatemala. Honduras. Nicaragua. Panama

Karibianmeren alueen historia
type: Concept
type: YKL-luokka
alternative label: Alankomaiden Antillit, historia (98.356)
alternative label: Anguilla, historia (98.356)
alternative label: Antigua ja Barbuda, historia (98.356)
alternative label: Antigua och Barbuda, historia (98.356) @sv
alternative label: Antillerna, historia (98.356) @sv
alternative label: Antillit, historia (98.356)
alternative label: Aruba, historia (98.356)
alternative label: Bahamasaaret, historia (98.356)
alternative label: Bahamaöarna, historia (98.356) @sv
alternative label: Barbados, historia (98.356)
alternative label: Barbuda, historia (98.356)
alternative label: Bermudasaaret, historia (98.356)
alternative label: Bermudaöarna, historia (98.356) @sv
alternative label: Caicos, historia (98.356)
alternative label: Caymansaaret, historia (98.356)
alternative label: Caymanöarna, historia (98.356) @sv
alternative label: Dominica, historia (98.356)
alternative label: Dominikaaninen tasavalta, historia (98.356)
alternative label: Dominikanska republiken, historia (98.356) @sv
alternative label: Grenada, historia (98.356)
alternative label: Grenadiinit, historia (98.356)
alternative label: Grenadinerna, historia (98.356) @sv
alternative label: Guadeloupe, historia (98.356)
alternative label: Haiti, historia (98.356)
alternative label: Isot Antillit, historia (98.356)
alternative label: Jamaica, historia (98.356) @sv
alternative label: Jamaika, historia (98.356)
alternative label: Jungfruöarna, historia (98.356) @sv
alternative label: Karibianmeren alue, historia (98.356)
alternative label: Karibiska öarna, historia (98.356) @sv
alternative label: Kuba, historia (98.356) @sv
alternative label: Kuuba, historia (98.356)
alternative label: Länsi-Intian saaristo, historia (98.356)
alternative label: Martinique, historia (98.356)
alternative label: Montserrat, historia (98.356)
alternative label: Nederländska Antillerna, historia (98.356) @sv
alternative label: Neitsytsaaret, historia (98.356)
alternative label: Nevis, historia (98.356)
alternative label: Pienet Antillit, historia (98.356)
alternative label: Puerto Rico, historia (98.356)
alternative label: Saint Kitts-Nevis, historia (98.356)
alternative label: Saint Lucia, historia (98.356)
alternative label: Saint Vincent ja Grenadiinit, historia (98.356)
alternative label: Saint Vincent och Grenadinerna, historia (98.356) @sv
alternative label: Små Antillerna, historia (98.356) @sv
alternative label: Stora Antillerna, historia (98.356) @sv
alternative label: Tobago, historia (98.356)
alternative label: Trinidad ja Tobago, historia (98.356)
alternative label: Trinidad och Tobago, historia (98.356) @sv
alternative label: Turks ja Caicos, historia (98.356)
alternative label: Turks och Caicos, historia (98.356) @sv
alternative label: Västindiska öarna, historia (98.356) @sv
broader: Väli-Amerikan historia
in scheme: YKL - Yleisten kirjastojen luokitusjärjestelmä
notation: 98.356
preferred label: History of Caribbean Sea @en
preferred label: Karibiens historia @sv
scope note: Isot-Antillit. Pienet-Antillit Alankomaiden Antillit. Anguilla. Antigua. Bahama. Barbados. Bermuda. Dominica. Dominikaaninen tasavalta. Grenada. Guadeloupe. Haiti. Jamaika. Kuuba. Martinique. Neitsytsaaret. Puerto Rico. Saint Kitts-Nevis. Saint Lucia. Saint Vincent. Trinidad ja Tobago
scope note: Stora Antillerna. Små Antillerna Anguilla. Antigua. Bahama. Barbados. Bermuda. Kuba. Dominica. Dominikanska republiken. Grenada. Guadeloupe. Haiti. Jamaica. Jungfruöarna. Martinique. Nederländska Antillerna. Puerto Rico. Saint Christopher och Nevis. Saint Lucia. Saint Vincent och Grenadinerna. Trinidad och Tobago @sv

Etelä-Amerikan historia
type: Concept
type: YKL-luokka
alternative label: Bolivia, historia (98.38)
alternative label: Ecuador, historia (98.38)
alternative label: Etelä-Amerikka, historia (98.38+)
alternative label: Guyana, historia (98.38)
alternative label: Inkafolket, historia (98.38+) @sv
alternative label: Inkat, historia (98.38+)
alternative label: Latinalainen Amerikka, historia (98.38)
alternative label: Latinamerika, historia (98.38) @sv
alternative label: Paraguay, historia (98.38)
alternative label: Surinam, historia (98.38)
alternative label: Sydamerika, historia (98.38+) @sv
alternative label: Uruguay, historia (98.38)
broader: Amerikan historia
in scheme: YKL - Yleisten kirjastojen luokitusjärjestelmä
narrower: Venezuelan historia
narrower: Kolumbian historia
narrower: Perun historia
narrower: Chilen historia
narrower: Argentiinan historia
narrower: Brasilian historia
notation: 98.38
preferred label: History of South America @en
preferred label: Sydamerikas historia @sv
scope note: Bolivia. Ecuador. Guayana. Paraguay. Surinam. Uruguay Tähän myös latinalaisen Amerikan historia yleensä
scope note: Bolivia. Ecuador. Guyana. Paraguay. Surinam. Uruguay Hit också Latinamerikas historia i allmänhet @sv

Venezuelan historia
type: Concept
type: YKL-luokka
alternative label: Venezuela, historia (98.381)
broader: Etelä-Amerikan historia
in scheme: YKL - Yleisten kirjastojen luokitusjärjestelmä
notation: 98.381
preferred label: History of Venezuela @en
preferred label: Venezuelas historia @sv

Kolumbian historia
type: Concept
type: YKL-luokka
alternative label: Colombia, historia (98.382) @sv
alternative label: Kolumbia, historia (98.382)
broader: Etelä-Amerikan historia
in scheme: YKL - Yleisten kirjastojen luokitusjärjestelmä
notation: 98.382
preferred label: Colombias historia @sv
preferred label: History of Colombia @en

Perun historia
type: Concept
type: YKL-luokka
alternative label: Peru, historia (98.383)
broader: Etelä-Amerikan historia
in scheme: YKL - Yleisten kirjastojen luokitusjärjestelmä
notation: 98.383
preferred label: History of Peru @en
preferred label: Perus historia @sv

Chilen historia
type: Concept
type: YKL-luokka
alternative label: Chile, historia (98.385)
broader: Etelä-Amerikan historia
in scheme: YKL - Yleisten kirjastojen luokitusjärjestelmä
notation: 98.385
preferred label: Chiles historia @sv
preferred label: History of Chile @en

Argentiinan historia
type: Concept
type: YKL-luokka
alternative label: Argentiina, historia (98.386)
alternative label: Argentina, historia (98.386) @sv
alternative label: Eldslandet, historia (98.386) @sv
alternative label: Falklandin saaret, historia (98.386)
alternative label: Falklandsöarna, historia (98.386) @sv
alternative label: Tulimaa, historia (98.386)
broader: Etelä-Amerikan historia
in scheme: YKL - Yleisten kirjastojen luokitusjärjestelmä
notation: 98.386
preferred label: Argentinas historia @sv
preferred label: History of Argentina @en
scope note: Hit också Falklandsöarnas historia @sv
scope note: Tähän myös Falklandin saarten historia

Brasilian historia
type: Concept
type: YKL-luokka
alternative label: Amazonas, historia (98.388)
alternative label: Brasilia, historia (98.388)
alternative label: Brasilien, historia (98.388) @sv
broader: Etelä-Amerikan historia
in scheme: YKL - Yleisten kirjastojen luokitusjärjestelmä
notation: 98.388
preferred label: Brasiliens historia @sv
preferred label: History of Brazil @en

Australian ja Oseanian historia
type: Concept
type: YKL-luokka
alternative label: Australia ja Oseania, historia (98.5+)
alternative label: Australien och Oceanien, historia (98.5+) @sv
alternative label: Oceanien, historia (98.5+) @sv
alternative label: Oseania, historia (98.5+)
broader: MUIDEN MAANOSIEN HISTORIA
in scheme: YKL - Yleisten kirjastojen luokitusjärjestelmä
narrower: Australian historia
narrower: Uuden-Seelannin historia
narrower: Uuden-Guinean historia
narrower: Tyynenmeren saarten historia
notation: 98.5
preferred label: Australiens och Oceaniens historia @sv
preferred label: History of Australia and Oceania @en

Australian historia
type: Concept
type: YKL-luokka
alternative label: Aboriginaalit, Australian historia (98.51)
alternative label: Aboriginer, Australiens historia (98.51) @sv
alternative label: Australia, aboriginaalit, historia (98.51)
alternative label: Australia, historia (98.51)
alternative label: Australien, aboriginer, historia (98.51) @sv
alternative label: Australien, historia (98.51) @sv
alternative label: Tasmania, historia (98.51)
alternative label: Tasmanien, historia (98.51) @sv
broader: Australian ja Oseanian historia
in scheme: YKL - Yleisten kirjastojen luokitusjärjestelmä
notation: 98.51
preferred label: Australiens historia @sv
preferred label: History of Australia @en

Uuden-Seelannin historia
type: Concept
type: YKL-luokka
alternative label: Nya Zeeland, historia (98.54) @sv
alternative label: Uusi-Seelanti, historia (98.54)
broader: Australian ja Oseanian historia
in scheme: YKL - Yleisten kirjastojen luokitusjärjestelmä
notation: 98.54
preferred label: History of New Zealand @en
preferred label: Nya Zeelands historia @sv

Uuden-Guinean historia
type: Concept
type: YKL-luokka
alternative label: Nya Guinea, historia (98.56) @sv
alternative label: Papua Nya Guinea, historia (98.56) @sv
alternative label: Papua-Uusi-Guinea, historia (98.56)
alternative label: Uusi-Guinea, historia (98.56)
broader: Australian ja Oseanian historia
in scheme: YKL - Yleisten kirjastojen luokitusjärjestelmä
notation: 98.56
preferred label: History of New Guinea @en
preferred label: Nya Guineas historia @sv

Tyynenmeren saarten historia
type: Concept
References: Uuden-Seelannin historia
References: Uuden-Guinean historia
type: YKL-luokka
alternative label: Bismarckin saaret, historia (98.57)
alternative label: Bismarcköarna, historia (98.57) @sv
alternative label: Cookinsaaret, historia (98.57)
alternative label: Cooköarna, historia (98.57) @sv
alternative label: Ellisin saaret, historia (98.57)
alternative label: Ellisöarna, historia (98.57) @sv
alternative label: Etelämeren saaret, historia (98.57+)
alternative label: Fidzisaaret, historia (98.57)
alternative label: Fijiöarna, historia (98.57) @sv
alternative label: Galapagossaaret, historia (98.57)
alternative label: Galapagosöarna, historia (98.57) @sv
alternative label: Gilbertinsaaret, historia (98.57)
alternative label: Gilbertsöarna, historia (98.57) @sv
alternative label: Guam, historia (98.57)
alternative label: Joulusaari, historia (98.57)
alternative label: Julön, historia (98.57) @sv
alternative label: Karoliinit, Tyynen meren saaret, historia (98.57)
alternative label: Karolinerna, öar i Stilla Havet, historia (98.57) @sv
alternative label: Kiribati, historia (98.57)
alternative label: Kokosöarna, historia (98.57) @sv
alternative label: Kookossaaret, historia (98.57)
alternative label: Länsi-Samoa, historia (98.57)
alternative label: Mariaanit, historia (98.57)
alternative label: Marianerna, historia (98.57) @sv
alternative label: Marquesassaaret, historia (98.57)
alternative label: Marquesasöarna, historia (98.57) @sv
alternative label: Marshallinsaaret, historia (98.57)
alternative label: Marshallöarna, historia (98.57) @sv
alternative label: Melanesia, historia (98.57)
alternative label: Melanesien, historia (98.57) @sv
alternative label: Mikronesia, historia (98.57)
alternative label: Mikronesien, historia (98.57) @sv
alternative label: Nauru, historia (98.57) @sv
alternative label: Naurun tasavalta, historia (98.57)
alternative label: Niue, historia (98.57)
alternative label: Norfolkin saari, historia (98.57)
alternative label: Norfolkön, historia (98.57) @sv
alternative label: Nya Hebriderna, historia (98.57) @sv
alternative label: Nya Kaledonien, historia (98.57) @sv
alternative label: Palau, historia (98.57)
alternative label: Pitcairnin saaret, historia (98.57)
alternative label: Pitcairnöarna, historia (98.57) @sv
alternative label: Polynesia, historia (98.57)
alternative label: Polynesien, historia (98.57) @sv
alternative label: Pääsiäissaari, historia (98.57)
alternative label: Påskön, historia (98.57) @sv
alternative label: Salomonsaaret, historia (98.57)
alternative label: Salomonöarna, historia (98.57) @sv
alternative label: Samoa, historia (98.57)
alternative label: Seurasaaret, historia (98.57)
alternative label: Stillahavsöar, historia (98.57+) @sv
alternative label: Sällskapsöarna, historia (98.57) @sv
alternative label: Söderhavsöar, historia (98.57+) @sv
alternative label: Tahiti, historia (98.57)
alternative label: Tokelau, historia (98.57)
alternative label: Tonga, historia (98.57)
alternative label: Tuvalu, historia (98.57)
alternative label: Tyynenmeren saaret, historia (98.57+)
alternative label: Uudet-Hebridit, historia (98.57)
alternative label: Uusi-Kaledonia, historia (98.57)
alternative label: Vanuatu, historia (98.57)
alternative label: Västra Samoa, historia (98.57) @sv
broader: Australian ja Oseanian historia
in scheme: YKL - Yleisten kirjastojen luokitusjärjestelmä
narrower: Havaijin historia
notation: 98.57
preferred label: History of Pacific Islands @en
preferred label: Stillahavsöarnas historia @sv
scope note: Melanesia. Mikronesia. Polynesia Bismarckinsaaret. Cookinsaaret. Fidzisaaret. Galapagossaaret. Gilbertinsaaret. Joulusaari. Karoliinit. Mariaanit. Marquesassaaret. Marshallinsaaret. Nauru. Pitcairn. Pääsiäissaari. Salomonsaaret. Samoa. Seurasaaret. Tahiti. Tonga. Tuvalu. Uudet-Hebridit. Uusi-Kaledonia. Vanuatu
scope note: Melanesien. Mikronesien. Polynesien. Bismarcköarna. Cooköarna. Fijiöarna. Galapagosöarna. Gilbertsöarna. Julön. Karolinerna. Marianerna. Marquesasöarna. Marshallöarna. Nauru. Nya Hebriderna. Nya Kaledonien. Pitcairn. Påskön. Salomonöarna. Samoa. Sällskapsöarna. Tahiti. Tonga. Tuvalu. Vanuatu @sv

Havaijin historia
type: Concept
type: YKL-luokka
alternative label: Havaiji, historia (98.575)
alternative label: Hawaii, historia (98.575) @sv
broader: Tyynenmeren saarten historia
in scheme: YKL - Yleisten kirjastojen luokitusjärjestelmä
notation: 98.575
preferred label: Hawaiis historia @sv
preferred label: History of Hawaii @en

Napamaiden historia
type: Concept
type: YKL-luokka
alternative label: Napa-alueet, historia (98.6+)
alternative label: Napamaat, historia (98.6+)
alternative label: Polarländerna, historia (98.6+) @sv
alternative label: Polarområden, historia (98.6+) @sv
broader: MUIDEN MAANOSIEN HISTORIA
in scheme: YKL - Yleisten kirjastojen luokitusjärjestelmä
narrower: Pohjoiset napamaat. Arktis
narrower: Eteläiset napamaat. Antarktis
notation: 98.6
preferred label: History of the polar regions @en
preferred label: Polarländernas historia @sv

Pohjoiset napamaat. Arktis
type: Concept
References: Lapin historia
References: Pohjoiskalotin historia
References: Venäjän ja Neuvostoliiton historia
References: Yhdysvaltojen historia
References: Kanadan historia
type: YKL-luokka
alternative label: Arktinen alue, historia (98.61)
alternative label: Arktis, historia (98.61)
alternative label: Arktiskt område, historia (98.61) @sv
alternative label: Björnön, historia (98.61) @sv
alternative label: Frans Joosefin maa, historia (98.61)
alternative label: Frans Josefs land, historia (98.61) @sv
alternative label: Grönland, historia (98.61) @sv
alternative label: Grönlanti, historia (98.61)
alternative label: Huippuvuoret, historia (98.61)
alternative label: Jan Mayen, historia (98.61)
alternative label: Karhusaari, historia (98.61)
alternative label: Napamaat, pohjoiset, historia (98.61)
alternative label: Nordliga polarländerna, historia (98.61) @sv
alternative label: Nordpolen, historia (98.61) @sv
alternative label: Pohjoiset napamaat, historia (98.61)
alternative label: Pohjoisnapa, historia (98.61)
alternative label: Polarländerna, nordliga, historia (98.61) @sv
alternative label: Spetsbergen, historia (98.61) @sv
broader: Napamaiden historia
in scheme: YKL - Yleisten kirjastojen luokitusjärjestelmä
notation: 98.61
preferred label: Nordliga polarländerna. Arktis @sv
preferred label: Northern polar regions. The Arctic @en
scope note: Grönland. Jan Mayen. Franz Josefs land. Svalbard Hit också allmänna verk om de nordliga polarländernas historia @sv
scope note: Grönlanti. Huippuvuoret. Jan Mayen. Frans Joosefin maa Tähän myös Pohjoisten napa-alueiden historian yleisteokset

Eteläiset napamaat. Antarktis
type: Concept
type: YKL-luokka
alternative label: Antarktinen alue, historia (98.62)
alternative label: Antarktis, historia (98.62)
alternative label: Antarktiska kontinenten, historia (98.62) @sv
alternative label: Antarktiskt område, historia (98.62) @sv
alternative label: Eteläiset napamaat, historia (98.62)
alternative label: Etelämanner, historia (98.62)
alternative label: Etelänapa, historia (98.62)
alternative label: Napamaat, eteläiset, historia (98.62)
alternative label: Polarländerna, sydliga, historia (98.62) @sv
alternative label: Sydlaga polarländerna, historia (98.62) @sv
alternative label: Sydpolen, historia (98.62) @sv
broader: Napamaiden historia
in scheme: YKL - Yleisten kirjastojen luokitusjärjestelmä
notation: 98.62
preferred label: Southern polar regions. The Antarctic @en
preferred label: Sydliga polarländerna. @sv
scope note: Antarktis. Sydpolen @sv
scope note: Etelämanner

HENKILÖ- JA SUKUHISTORIA
type: Concept
type: YKL-luokka
alternative label: Henkilöhistoria (99+)
alternative label: Historia, henkilö- ja sukuhistoria (99+)
alternative label: Historia, person- och släkthistoria (99+) @sv
alternative label: Personhistoria (99+) @sv
broader: HISTORIA
in scheme: YKL - Yleisten kirjastojen luokitusjärjestelmä
narrower: Elämäkerrat. Muistelmat
narrower: Elämäkerralliset hakuteokset
narrower: Sukuhistoria. Sukututkimus
notation: 99
preferred label: PERSON- OCH SLÄKTHISTORIA @sv
preferred label: PERSONAL AND FAMILY HISTORY @en
scope note: Formtillägget 09 används inte i samband med klasserna 90-99.31 @sv
scope note: Muotoluokkaa 09 ei käytetä luokkien 90-99.31 yhteydessä

Elämäkerrat. Muistelmat
type: Concept
References: Arkkitehtuurin historia
References: Kuvanveistotaiteen historia
References: Piirustus- ja maalaustaiteen historia
References: Grafiikan historia
References: Valokuvauksen ja valokuvataiteen historia
References: Sisustusarkkitehtuuri. Huonekalutaide
References: Tekstiilitaide
References: Lasitaide. Keramiikkataide
References: Taidetaonta. Korutaide
References: Koristetaide. Ornamentiikka
References: Paperitaide
References: Antiikkiesineiden keräily
References: Taideteollisuuden ja taidekäsityön historia
References: Teatteri- ja näyttämötaiteen historia
References: Tanssi
References: Elokuvan historia. Televisio-ohjelmien historia
References: Henkilöhistoria
References: KERTOMAKIRJALLISUUS
References: Suomen, suomalais-ugrilaisten ja uralilaisten kielten kirjallisuuden historia ja tutkimus
References: Pohjoismaisten kielten kirjallisuuden historia ja tutkimus
References: Saksankielisen kirjallisuuden historia ja tutkimus
References: Englanninkielisen kirjallisuuden historia ja tutkimus
References: Romaanisten kielten kirjallisuuden historia ja tutkimus
References: Slaavilaisten ja balttilaisten kielten kirjallisuuden historia ja tutkimus
References: Muiden indoeurooppalaisten kielten kirjallisuuden historia ja tutkimus
References: Muiden kielten kirjallisuuden historia ja tutkimus
alternative label: Bedragare, personporträtt (99.1+) @sv
alternative label: Bibliotekarier, biografier och memoarer (99.1) @sv
alternative label: Biografier (99.1+) @sv
alternative label: Biografier, forskning (99.1+) @sv
alternative label: Blogit (99.1+)
alternative label: Eläintenhoitajat, elämäkerrat ja muistelmat (99.1)
alternative label: Elämäkerrat (99.1+)
alternative label: Elämäkerrat, tutkimus (99.1+)
alternative label: Elämäkertatutkimus, henkilöhistoria (99.1+)
alternative label: Huijarit, henkilökuvat (99.1+)
alternative label: Informaatikot, elämäkerrat ja muistelmat (99.1)
alternative label: Kirjakustantajat (99.1)
alternative label: Kirjankustantajat, elämäkerrat ja muistelmat (99.1)
alternative label: Kirjastonhoitajat, elämäkerrat ja muistelmat (99.1)
alternative label: Kirjeenvaihto, henkilöhistoria (99.1+)
alternative label: Kirjeet, henkilöhistoria (99.1+)
alternative label: Kirjekokoelmat, henkilöhistoria (99.1+)
alternative label: Kulttuurituottajat, elämäkerrat ja muistelmat (99.1)
alternative label: Lehtimiehet, elämäkerrat ja muistelmat (99.1)
alternative label: Merirosvot, elämäkerrat ja muistelmat (99.1)
alternative label: Muistelmat (99.1+)
alternative label: Muistelmat, tutkimus (99.1+)
alternative label: Museonhoitajat, elämäkerrat ja muistelmat (99.1)
alternative label: Nettipäiväkirjat (99.1+)
alternative label: Nörtit, elämäkerrat ja muistelmat (99.1+)
alternative label: Omaelämäkerrat (99.1+)
alternative label: Palvelijat, elämäkerrat ja muistelmat (99.1)
alternative label: Päiväkirjat (99.1+)
alternative label: Päiväkirjat, tutkimus (99.1+)
alternative label: Radiotuottajat, elämäkerrat ja muistelmat (99.1)
alternative label: Rikoksentekijät, elämäkerrat ja muistelmat (99.1+)
alternative label: Rikoksentekijät, henkilökuvat (99.1+)
alternative label: Rikolliset, elämäkerrat ja muistelmat (99.1+)
alternative label: Rikolliset, henkilökuvat (99.1+)
alternative label: Tapahtumatuottajat, elämäkerrat ja muistelmat (99.1)
alternative label: Televisiotuottajat, elämäkerrat ja muistelmat (99.1)
alternative label: Toimittajat, elämäkerrat ja muistelmat (99.1)
alternative label: Vangit, elämäkerrat ja muistelmat (99.1+)
alternative label: Verkkopäiväkirjat (99.1+)
alternative label: Web-log (99.1+)
broader: HENKILÖ- JA SUKUHISTORIA
in scheme: YKL - Yleisten kirjastojen luokitusjärjestelmä
narrower: Elämäkerrat. Muistelmat, filosofit ja psykologit
narrower: Elämäkerrat. Muistelmat, uskontojen ja kirkkokuntien edustajat
narrower: Elämäkerrat. Muistelmat, yhteiskuntaelämän, kasvatuksen ja maanpuolustuksen edustajat
narrower: Elämäkerrat. Muistelmat, maantieteilijät, tutkimusmatkailijat ja kansatieteilijät
narrower: Elämäkerrat. Muistelmat, luonnontieteilijät ja lääketieteen edustajat
narrower: Elämäkerrat. Muistelmat, Tekniikan, tuotantoelämän, kaupan ja talouselämän edustajat
narrower: Elämäkerrat. Muistelmat, taiteentutkijat ja urheilututkijat
narrower: Elämäkerrat. Muistelmat, kielitieteilijät, kirjallisuudentutkijat
narrower: Elämäkerrat. Muistelmat, historioitsijat, arkeologit, löytöretkeilijät
notation: 99.1
scope note: Hit och till underklasserna oavsett land eller tidsperiod biografier, självbiografier, memoarer, dagböcker och brevsamlingar; dock inte författares, konstnärers och idrottares biografier, självbiografier etc., som förs till klasserna för litteraturhistoria, konsternas historia eller klasserna för olika idrottsgrenar Hit och till underklasserna också forskning av memoarer och dagböcker; dock inte forskning av författares, konstnärers och idrottares memoarer eller dagböcker, som förs till klasserna för litteraturhistoria, konsternas historia eller klasserna för olika idrottsgrenar Hit t.ex. bokförläggare, museiintendenter, bibliotekarien, informatiker, redaktörer och journalister samt personer som verkar på flera olika områden Hit också personhistoria om personer som inte representerar något specialområde eller yrke Verk som behandlar ett speciellt område snarare än personhistoria klassificeras enligt område I osäkra fall ges företräde åt klass 99.1+ Formtillägget 09 används inte i samband med klasserna 90-99.31 @sv

Elämäkerrat. Muistelmat, filosofit ja psykologit
type: Concept
References: Elämäkerrat. Muistelmat, luonnontieteilijät ja lääketieteen edustajat
type: YKL-luokka
alternative label: Filosofer, biografier och memoarer (99.11) @sv
alternative label: Filosofit, elämäkerrat ja muistelmat (99.11)
alternative label: Psykologer, biografier och memoarer (99.11) @sv
alternative label: Psykologit, elämäkerrat ja muistelmat (99.11)
broader: Elämäkerrat. Muistelmat
in scheme: YKL - Yleisten kirjastojen luokitusjärjestelmä
notation: 99.11
preferred label: Biografier. Memoarer, filosofer och psykologer @sv
preferred label: Biographies. Memoirs, philosophers and psychologists @en
scope note: Jos henkilö on tunnettu sekä psykologian tutkijana että psykiatrina, annetaan etusija luokalle 99.11 Muotoluokkaa 09 ei käytetä luokkien 90-99.31 yhteydessä
scope note: Om personen är känd både som forskare i psykologi och som psykiater, ges företräde åt klass 99.11 Formtillägget 09 används inte i samband med klasserna 90-99.31 @sv

Elämäkerrat. Muistelmat, uskontojen ja kirkkokuntien edustajat
type: Concept
References: YLEINEN USKONTOTIEDE
References: Raamatun henkilöt
References: Kääntymys. Uskoon tuleminen. Uskonelämä
References: KRISTILLISET KIRKOT JA YHTEISÖT. KIRKKOHISTORIA
References: MUUT USKONNOT JA MYTOLOGIAT
type: YKL-luokka
alternative label: Arkkipiispat, elämäkerrat ja muistelmat (99.12)
alternative label: Biskopar, biografier och memoarer (99.12) @sv
alternative label: Evangelister, biografier och memoarer (99.12) @sv
alternative label: Evankelistat, elämäkerrat ja muistelmat (99.12)
alternative label: Församlingsarbetare, biografier och memoarer (99.12) @sv
alternative label: Kantorer, biografier och memoarer (99.12) @sv
alternative label: Kanttorit, elämäkerrat ja muistelmat (99.12)
alternative label: Kirkkojen edustajat, elämäkerrat ja muistelmat (99.12)
alternative label: Kirkkomuusikot, elämäkerrat ja muistelmat (99.12)
alternative label: Kirkolliset henkilöt, elämäkerrat ja muistelmat (99.12)
alternative label: Kyrkliga personer, biografier och memoarer (99.12) @sv
alternative label: Kyrkomusiker, biografier och memoarer (99.12) @sv
alternative label: Kyrkornas företrädare, biografier och memoarer (99.12) @sv
alternative label: Lähetystyöntekijät, elämäkerrat ja muistelmat (99.12)
alternative label: Missionärer, biografier och memoarer (99.12) @sv
alternative label: Paavit, elämäkerrat ja muistelmat (99.12)
alternative label: Papit, elämäkerrat ja muistelmat (99.12)
alternative label: Piispat, elämäkerrat ja muistelmat (99.12)
alternative label: Predikare, biografier och memoarer (99.12) @sv
alternative label: Präster, biografier och memoarer (99.12) @sv
alternative label: Påvar, biografier och memoarer (99.12) @sv
alternative label: Religionernas företrädare, biografier och memoarer (99.12) @sv
alternative label: Saarnaajat, elämäkerrat ja muistelmat (99.12)
alternative label: Seurakuntatyöntekijät, elämäkerrat ja muistelmat (99.12)
alternative label: Uskontojen edustajat, elämäkerrat ja muistelmat (99.12)
alternative label: Ärkebiskopar, biografier och memoarer (99.12) @sv
broader: Elämäkerrat. Muistelmat
in scheme: YKL - Yleisten kirjastojen luokitusjärjestelmä
notation: 99.12
preferred label: Biografier. Memoarer, representanter för religioner och kyrkosamfund @sv
preferred label: Biographies. Memoirs, religious and denominational figures @en
scope note: Hit t.ex. biskopar, präster och evangelister samt församlings- eller missionsarbetare Formtillägget 09 används inte i samband med klasserna 90-99.31 @sv
scope note: Tähän esim. piispat, papit ja evankelistat sekä seurakunta- tai lähetystyöntekijät Muotoluokkaa 09 ei käytetä luokkien 90-99.31 yhteydessä

Elämäkerrat. Muistelmat, yhteiskuntaelämän, kasvatuksen ja maanpuolustuksen edustajat
type: Concept
References: Elämäkerrat. Muistelmat, Tekniikan, tuotantoelämän, kaupan ja talouselämän edustajat
type: YKL-luokka
alternative label: Advokater, biografier och memoarer (99.13) @sv
alternative label: Asianajajat, elämäkerrat ja muistelmat (99.13)
alternative label: Europarlamentaarikot, elämäkerrat ja muistelmat (99.13)
alternative label: Europarlamentariker, biografier och memoarer (99.13) @sv
alternative label: Försvarets företrädare, biografier och memoarer (99.13+) @sv
alternative label: Förvaltningens företrädare, biografier och memoarer (99.13) @sv
alternative label: Hallinnon edustajat, elämäkerrat ja muistelmat (99.13)
alternative label: Hallitsijat, elämäkerrat ja muistelmat (99.13)
alternative label: Henkilöhistoria, vakoilijat (99.13)
alternative label: Henkilöhistoria, vakoojat (99.13)
alternative label: Jurister, biografier och memoarer (99.13) @sv
alternative label: Juristit, elämäkerrat ja muistelmat (99.13)
alternative label: Kansanedustajat, elämäkerrat ja muistelmat (99.13)
alternative label: Kasvatuksen edustajat, elämäkerrat ja muistelmat (99.13)
alternative label: Kasvatustieteilijät, elämäkerrat ja muistelmat (99.13)
alternative label: Kungligheter, bibliografier och memoarer (99.13) @sv
alternative label: Kuninkaalliset, elämäkerrat ja muistelmat (99.13)
alternative label: Lakimiehet, elämäkerrat ja muistelmat (99.13)
alternative label: Lärare, biografier och memoarer (99.13) @sv
alternative label: Maanpuolustuksen edustajat, elämäkerrat ja muistelmat (99.13+)
alternative label: Militärer, biografier och memoarer (99.13+) @sv
alternative label: Militärflygare (99.13) @sv
alternative label: Ministerit, elämäkerrat ja muistelmat (99.13)
alternative label: Ministrar, biografier och memoarer (99.13) @sv
alternative label: Officerare, biografier och memoarer (99.13+) @sv
alternative label: Oikeustieteilijät, elämäkerrat ja muistelmat (99.13)
alternative label: Opettajat, elämäkerrat ja muistelmat (99.13)
alternative label: Pedagoger, biografier och memoarer (99.13) @sv
alternative label: Pedagoger, memoarer och biografier (99.13) @sv
alternative label: Personhistoria, spioner (99.13) @sv
alternative label: Poliisit, elämäkerrat ja muistelmat (99.13)
alternative label: Poliitikot, elämäkerrat ja muistelmat (99.13)
alternative label: Poliser, biografier och memoarer (99.13) @sv
alternative label: Politiker, biografier och memoarer (99.13) @sv
alternative label: Presidenter, biografier och memoarer (99.13) @sv
alternative label: Presidentit, elämäkerrat ja muistelmat (99.13)
alternative label: Regenter, biografier och memoarer (99.13) @sv
alternative label: Riksdagsmän, biografier och memoarer (99.13) @sv
alternative label: Rättslärda, biografier och memoarer (99.13) @sv
alternative label: Samhällslivets företrädare, biografier och memoarer (99.13) @sv
alternative label: Socialarbetets företrädare, biografier och memoarer (99.13) @sv
alternative label: Sosiaalityön edustajat, elämäkerrat ja muistelmat (99.13)
alternative label: Sotilashenkilöt, elämäkerrat ja muistelmat (99.13+)
alternative label: Sotilaslentäjät (99.13)
alternative label: Spioner, biografier och memoarer (99.13) @sv
alternative label: Statsmän, biografier och memoarer (99.13) @sv
alternative label: Statsvetenskapsmän, biografier och memoarer (99.13) @sv
alternative label: Tjänstemän, biografier och memoarer (99.13) @sv
alternative label: Upseerit, elämäkerrat ja muistelmat (99.13+)
alternative label: Vakoilijat, elämäkerrat ja muistelmat (99.13)
alternative label: Vakoojat, elämäkerrat ja muistelmat (99.13)
alternative label: Valtiomiehet, elämäkerrat ja muistelmat (99.13)
alternative label: Valtiotieteilijät, elämäkerrat ja muistelmat (99.13)
alternative label: Virkamiehet, elämäkerrat ja muistelmat (99.13)
alternative label: Yhteiskuntaelämän edustajat, elämäkerrat ja muistelmat (99.13)
broader: Elämäkerrat. Muistelmat
in scheme: YKL - Yleisten kirjastojen luokitusjärjestelmä
narrower: Elämäkerrat. Muistelmat, sotamuistelmat
notation: 99.13
preferred label: Biografier. Memoarer, representanter för samhällsliv, pedagogik och försvar @sv
preferred label: Biographies. Memoirs, social, educational and military figures @en
scope note: Hit t.ex. regenter, statsmän, politiker, statsvetare, jurister, representanter för rättsvetenskap och administration, tjänstemän, representanter för socialt arbete, lärare, pedagoger och officerare Formtillägget 09 används inte i samband med klasserna 90-99.31 @sv
scope note: Tähän esim. hallitsijat, valtiomiehet, poliitikot, valtiotieteilijät, lakimiehet, oikeustieteilijät, hallinnon edustajat, virkamiehet, sosiaalityön edustajat, opettajat, kasvatustieteilijät ja upseerit Muotoluokkaa 09 ei käytetä luokkien 90-99.31 yhteydessä

Elämäkerrat. Muistelmat, sotamuistelmat
type: Concept
References: URN:NBN:fi:au:ykl:32.2109
References: KERTOMAKIRJALLISUUS
References: Yleinen sotahistoria
References: Suomen historia v. 1917-1920
References: Suomen historia v. 1939-1945
type: YKL-luokka
alternative label: Frontmän, krigsmemoarer (99.139) @sv
alternative label: Fångläger, hågkomster (99.139) @sv
alternative label: Hemmafront, memoarer (99.139) @sv
alternative label: Keskitysleirimuistelmat (99.139)
alternative label: Koncentrationsläger, hågkomster (99.139) @sv
alternative label: Kotirintama, muistelmat (99.139)
alternative label: Krigsbarn, memoarer (99.139) @sv
alternative label: Krigsflyktingar, memoarer (99.139) @sv
alternative label: Krigsfångar, memoarer (99.139) @sv
alternative label: Krigsmemoarer (99.139) @sv
alternative label: Krigsveteraner, krigsmemoarer (99.139) @sv
alternative label: Rintamamiehet, sotamuistelmat (99.139)
alternative label: Sotalapset, muistelmat (99.139)
alternative label: Sotamuistelmat (99.139)
alternative label: Sotapakolaiset, muistelmat (99.139)
alternative label: Sotavangit, muistelmat (99.139)
alternative label: Sotaveteraanit, sotamuistelmat (99.139)
alternative label: Vankileirimuistelmat (99.139)
broader: Elämäkerrat. Muistelmat, yhteiskuntaelämän, kasvatuksen ja maanpuolustuksen edustajat
in scheme: YKL - Yleisten kirjastojen luokitusjärjestelmä
notation: 99.139
preferred label: Biografier. Memoarer, krigsmemoarer @sv
preferred label: Biographies. Memoirs, war memoirs @en
scope note: Hit alla krigsmemoarer oavsett författarens yrkesområde Hit även memoarer och biografier om hemmafronten, krigsflyktingskap och krigsfångenskap Hit även memoarer om koncentrations- och fångläger Formtillägget 09 används inte i samband med klasserna 90-99.31 @sv
scope note: Tähän kaikki sotamuistelmat kirjoittajan edustamasta ammatista tai elämänalueesta riippumatta Tähän myös kotirintamaa, sotapakolaisia ja sotavankeja koskevat muistelmat ja elämäkerrat Tähän myös keskitysleiri- ja vankileirimuistelmat Muotoluokkaa 09 ei käytetä luokkien 90-99.31 yhteydessä

Elämäkerrat. Muistelmat, maantieteilijät, tutkimusmatkailijat ja kansatieteilijät
type: Concept
References: Elämäkerrat. Muistelmat, kielitieteilijät, kirjallisuudentutkijat
References: Elämäkerrat. Muistelmat, historioitsijat, arkeologit, löytöretkeilijät
type: YKL-luokka
alternative label: Antropologer, biografier och memoarer (99.14) @sv
alternative label: Antropologit, elämäkerrat ja muistelmat (99.14)
alternative label: Etnologer, biografier och memoarer (99.14) @sv
alternative label: Forskningsresanden, biografier och memoarer (99.14) @sv
alternative label: Geografer, biografier och memoarer (99.14) @sv
alternative label: Kansatieteilijät, elämäkerrat ja muistelmat (99.14)
alternative label: Maantieteilijät, elämäkerrat ja muistelmat (99.14)
alternative label: Tutkimusmatkailijat, elämäkerrat ja muistelmat (99.14)
broader: Elämäkerrat. Muistelmat
in scheme: YKL - Yleisten kirjastojen luokitusjärjestelmä
notation: 99.14
preferred label: Biografier. Memoarer, geografer, forskningsresande and etnologer @sv
preferred label: Biographies. Memoirs, geographers, explorers and ethnologists @en
scope note: Hit också antropologer Formtillägget 09 används inte i samband med klasserna 90-99.31 @sv
scope note: Tähän myös antropologit Muotoluokkaa 09 ei käytetä luokkien 90-99.31 yhteydessä

Elämäkerrat. Muistelmat, luonnontieteilijät ja lääketieteen edustajat
type: Concept
References: Hoitotiede. Hoitotyö. Hoitohenkilökunta
References: Hoitomenetelmät
References: Elimet. Taudit
References: Elämäkerrat. Muistelmat, filosofit ja psykologit
References: Elämäkerrat. Muistelmat, Tekniikan, tuotantoelämän, kaupan ja talouselämän edustajat
type: YKL-luokka
alternative label: Astronomer, biografier och memoarer (99.15) @sv
alternative label: Biologer, biografier och memoarer (99.15) @sv
alternative label: Biologit, elämäkerrat ja muistelmat (99.15)
alternative label: Fysiker, biografier och memoarer (99.15) @sv
alternative label: Fyysikot, elämäkerrat ja muistelmat (99.15)
alternative label: Geologer, biografier och memoarer (99.15) @sv
alternative label: Geologit, elämäkerrat ja muistelmat (99.15)
alternative label: Hälsovårdare, biografier och memoarer (99.15) @sv
alternative label: Hälsovårdspersonal, biografier och memoarer (99.15) @sv
alternative label: Kemister, biografier och memoarer (99.15) @sv
alternative label: Kemistit, elämäkerrat ja muistelmat (99.15)
alternative label: Kirurger, biografier och memoarer (99.15) @sv
alternative label: Kirurgit, elämäkerrat ja muistelmat (99.15)
alternative label: Luonnontieteilijät, elämäkerrat ja muistelmat (99.15)
alternative label: Lähihoitajat, elämäkerrat ja muistelmat (99.15)
alternative label: Läkare, biografier och memoarer (99.15) @sv
alternative label: Lääketieteen edustajat, elämäkerrat ja muistelmat (99.15)
alternative label: Lääkärit, elämäkerrat ja muistelmat (99.15)
alternative label: Matemaatikot, elämäkerrat ja muistelmat (99.15)
alternative label: Matematiker, biografier och memoarer (99.15) @sv
alternative label: Medicinens företrädare, biografier och memoarer (99.15) @sv
alternative label: Naturvetenskapsmän, biografier och memoarer (99.15) @sv
alternative label: Närvårdare, biografier och memoarer (99.15) @sv
alternative label: Perushoitajat, elämäkerrat ja muistelmat (99.15)
alternative label: Primärskötare, biografier och memoarer (99.15) @sv
alternative label: Psykiatrer, biografier och memoarer (99.15) @sv
alternative label: Psykiatrit, elämäkerrat ja muistelmat (99.15)
alternative label: Sairaanhoitajat, elämäkerrat ja muistelmat (99.15)
alternative label: Sjukskötare, biografier och memoarer (99.15) @sv
alternative label: Terveydenhoitajat, elämäkerrat ja muistelmat (99.15)
alternative label: Terveydenhuoltohenkilöstö, elämäkerrat ja muistelmat (99.15)
alternative label: Tähtitieteilijät, elämäkerrat ja muistelmat (99.15)
broader: Elämäkerrat. Muistelmat
in scheme: YKL - Yleisten kirjastojen luokitusjärjestelmä
notation: 99.15
preferred label: Biografier. Memoarer, naturvetare och medicinare @sv
preferred label: Biographies. Memoirs, natural scientists and representatives of medicine @en
scope note: Hit t.ex. matematiker, astronomer, fysiker, kemister, biologer samt läkare och sjuksköterskor på olika områden Om personen är känd både som forskare i psykologi och som psykiater, ges företräde åt klass 99.11 Memoarer och biografier, där det väsentliga innehållet utgörs av en enskild behandlingsmetod, sjukdom eller livet som patient, förs till klasserna för medicin 59+ Formtillägget 09 används inte i samband med klasserna 90-99.31 @sv
scope note: Tähän esim. matemaatikot, tähtitieteilijät, fyysikot, kemistit, biologit sekä eri alojen lääkärit ja sairaanhoitajat Jos henkilö on tunnettu sekä psykologian tutkijana että psykiatrina, annetaan etusija luokalle 99.11 Muistelmat ja elämäkerrat, joissa potilaana olo, tietty hoitomuoto tai sairaus on teoksen keskeinen sisältö, sijoitetaan lääketieteen luokkiin 59+ Muotoluokkaa 09 ei käytetä luokkien 90-99.31 yhteydessä

Elämäkerrat. Muistelmat, Tekniikan, tuotantoelämän, kaupan ja talouselämän edustajat
type: Concept
alternative label: Adb-planerare, biografier och memoarer (99.16) @sv
alternative label: Adb-stödpersoner, biografier och memoarer (99.16) @sv
alternative label: Affärsmän, biografier och memoarer (99.16) @sv
alternative label: Atk-suunnittelijat, elämäkerrat ja muistelmat (99.16)
alternative label: Atk-tukihenkilöt, elämäkerrat ja muistelmat (99.16)
alternative label: Bankväsendets företrädare, biografier och memoarer (99.16) @sv
alternative label: Byggmästare, biografier och memoarer (99.16) @sv
alternative label: Datanomer, biografier och memoarer (99.16) @sv
alternative label: Datanomit, elämäkerrat ja muistelmat (99.16)
alternative label: Datormontörer, biografier och uppslagsverk (99.16) @sv
alternative label: Ekonomer, biografier och memoarer (99.16) @sv
alternative label: Ekonomit, elämäkerrat ja muistelmat (99.16)
alternative label: Eläinlääkärit, elämäkerrat ja muistelmat (99.16)
alternative label: Flygare (99.16) @sv
alternative label: Forstmästare, biografier och memoarer (99.16) @sv
alternative label: Företagare, biografier och memoarer (99.16) @sv
alternative label: Försäkringsinrättningarnas företrädare, biografier och memoarer (99.16) @sv
alternative label: Guldgrävare (99.16) @sv
alternative label: Handelns företrädare, biografier och memoarer (99.16) @sv
alternative label: Handelsmän, biografier och memoarer (99.16) @sv
alternative label: Hantverkare, biografier och memoarer (99.16) @sv
alternative label: Industrins företrädare, biografier och memoarer (99.16) @sv
alternative label: Ingenjörer, biografier och memoarer (99.16) @sv
alternative label: Insinöörit, elämäkerrat ja muistelmat (99.16)
alternative label: Jordbrukare, biografier och memoarer (99.16) @sv
alternative label: Kaupan edustajat, elämäkerrat ja muistelmat (99.16)
alternative label: Kauppiaat, elämäkerrat ja muistelmat (99.16)
alternative label: Keittiömestarit, elämäkerrat ja muistelmat (99.16)
alternative label: Keksijät, elämäkerrat ja muistelmat (99.16)
alternative label: Kockar, biografier och memoarer (99.16) @sv
alternative label: Kokit, elämäkerrat ja muistelmat (99.16)
alternative label: Kullankaivajat (99.16)
alternative label: Käsityöammattien edustajat, elämäkerrat ja muistelmat (99.16)
alternative label: Köksmästare, biografier och memoarer (99.16) @sv
alternative label: Lantbrukets företrädare, biografier och memoarer (99.16) @sv
alternative label: Lentäjät (99.16)
alternative label: Liikemiehet, elämäkerrat ja muistelmat (99.16)
alternative label: Liikenteen edustajat, elämäkerrat ja muistelmat (99.16)
alternative label: Maanviljelijät, elämäkerrat ja muistelmat (99.16)
alternative label: Maatalouden edustajat, elämäkerrat ja muistelmat (99.16)
alternative label: Merikapteenit, elämäkerrat ja muistelmat (99.16)
alternative label: Metsurit (99.16)
alternative label: Metsänhoitajat, elämäkerrat ja muistelmat (99.16)
alternative label: Metsätalouden edustajat, elämäkerrat ja muistelmat (99.16)
alternative label: Mikrotukihenkilöt, elämäkerrat ja muistelmat (99.16)
alternative label: Näringslivets företrädare, biografier och memoarer (99.16) @sv
alternative label: Ohjelmoijat, elämäkerrat ja muistelmat (99.16)
alternative label: Operaattorit, elämäkerrat ja muistelmat (99.16)
alternative label: Operatörer, biografier och memoarer (99.16) @sv
alternative label: PC-stödpersoner, biografier och memoarer (99.16) @sv
alternative label: Pankkitoimen edustajat, elämäkerrat ja muistelmat (99.16)
alternative label: Produktionens företrädare, biografier och memoarer (99.16) @sv
alternative label: Programmerare, biografier och memoarer (99.16) @sv
alternative label: Puhelinasentajat, elämäkerrat ja muistelmat (99.16)
alternative label: Radioamatörer, biografier och memoarer (99.16) @sv
alternative label: Radioamatöörit, elämäkerrat ja muistelmat (99.16)
alternative label: Radiosähköttäjät, elämäkerrat ja muistelmat (99.16)
alternative label: Radiotelegrafister, biografier och memoarer (99.16) @sv
alternative label: Rakennusmestarit, elämäkerrat ja muistelmat (99.16)
alternative label: Sjökaptener, biografier och memoarer (99.16) @sv
alternative label: Skogsbrukets företrädare, biografier och memoarer (99.16) @sv
alternative label: Skogshuggare (99.16) @sv
alternative label: Systeemisuunnittelijat, elämäkerrat ja muistelmat (99.16)
alternative label: Systemerare, biografier och memoarer (99.16) @sv
alternative label: Talouselämän edustajat, elämäkerrat ja muistelmat (99.16)
alternative label: Taloustieteilijät, elämäkerrat ja muistelmat (99.16)
alternative label: Tekniikan edustajat, elämäkerrat ja muistelmat (99.16)
alternative label: Teollisuuden edustajat, elämäkerrat ja muistelmat (99.16)
alternative label: Tietokoneasentajat, elämäkerrat ja muistelmat (99.16)
alternative label: Tietoliikenneasentajat, elämäkerrat ja muistelmat (99.16)
alternative label: Tukkilaiset (99.16)
alternative label: Tuotantoelämän edustajat, elämäkerrat ja muistelmat (99.16)
alternative label: Vakuutuslaitosten edustajat, elämäkerrat ja muistelmat (99.16)
alternative label: Yrittäjät, elämäkerrat ja muistelmat (99.16)
broader: Elämäkerrat. Muistelmat
in scheme: YKL - Yleisten kirjastojen luokitusjärjestelmä
notation: 99.16
scope note: Hit t.ex. ingenjörer, uppfinnare, forskare i teknik, representanter för industri, banker och försäkringsbolag, företagare, handelsmän och ekonomer, representanter för hantverkaryrken, kockar och köksmästare, utövare av lant- och skogsbruk, veterinären samt representanter för trafik Formtillägget 09 används inte i samband med klasserna 90-99.31 @sv
scope note: Tähän esim. insinöörit, keksijät, tekniikan tutkijat, teollisuuden, pankkien ja vakuutuslaitosten edustajat, yrittäjät, kauppiaat ja taloustieteilijät, käsityöammattien edustajat, kokit ja keittiömestarit, maa- ja metsätalouden harjoittajat, eläinlääkärit sekä liikenteen edustajat Muotoluokkaa 09 ei käytetä luokkien 90-99.31 yhteydessä

Elämäkerrat. Muistelmat, taiteentutkijat ja urheilututkijat
type: Concept
type: YKL-luokka
alternative label: Idrottsforskare, biografier och memoarer (99.17) @sv
alternative label: Konstforskare, biografier och memoarer (99.17) @sv
alternative label: Konsthistoriker, biografier och memoarer (99.17) @sv
alternative label: Musiikintutkijat, elämäkerrat ja muistelmat (99.17)
alternative label: Musikforskare, biografier och memoarer (99.17) @sv
alternative label: Taidehistorioitsijat, elämäkerrat ja muistelmat (99.17)
alternative label: Taiteentutkijat, elämäkerrat ja muistelmat (99.17)
alternative label: Urheilututkijat, elämäkerrat ja muistelmat (99.17)
broader: Elämäkerrat. Muistelmat
in scheme: YKL - Yleisten kirjastojen luokitusjärjestelmä
notation: 99.17
preferred label: Biografier. Memoarer, konstforskare och idrottsforskare @sv
preferred label: Biographies. Memoirs, art historians and sports researchers @en

Elämäkerrat. Muistelmat, kielitieteilijät, kirjallisuudentutkijat
type: Concept
modified: 2026-05-06T13:21:21
References: Suomen, suomalais-ugrilaisten ja uralilaisten kielten kirjallisuuden historia ja tutkimus
References: Pohjoismaisten kielten kirjallisuuden historia ja tutkimus
References: Saksankielisen kirjallisuuden historia ja tutkimus
References: Englanninkielisen kirjallisuuden historia ja tutkimus
References: Romaanisten kielten kirjallisuuden historia ja tutkimus
References: Slaavilaisten ja balttilaisten kielten kirjallisuuden historia ja tutkimus
References: Muiden indoeurooppalaisten kielten kirjallisuuden historia ja tutkimus
References: Muiden kielten kirjallisuuden historia ja tutkimus
References: Elämäkerrat. Muistelmat, maantieteilijät, tutkimusmatkailijat ja kansatieteilijät
type: YKL-luokka
alternative label: Folkdiktsforskare, biografier och memoarer (99.18) @sv
alternative label: Kansanrunoudentutkijat, elämäkerrat ja muistelmat (99.18)
alternative label: Kielitieteilijät, elämäkerrat ja muistelmat (99.18)
alternative label: Kirjallisuudentutkijat, elämäkerrat ja muistelmat (99.18)
alternative label: Kääntäjät, elämäkerrat ja muistelmat (99.18)
alternative label: Litteraturforskare, biografier och memoarer (99.18) @sv
alternative label: Språkvetare, biografier och memoarer (99.18) @sv
alternative label: Översättare, biografier och memoarer (99.18) @sv
broader: Elämäkerrat. Muistelmat
in scheme: YKL - Yleisten kirjastojen luokitusjärjestelmä
notation: 99.18
preferred label: Biografier. Memoarer, språkvetare och litteraturforskare @sv
preferred label: Biographies. Memoirs, linguists, literary historians @en
scope note: Hit också folkdiktsforskare Formtillägget 09 används inte i samband med klasserna 90-99.31 @sv
scope note: Tähän myös kansanrunoudentutkijat Muotoluokkaa 09 ei käytetä luokkien 90-99.31 yhteydessä

Elämäkerrat. Muistelmat, historioitsijat, arkeologit, löytöretkeilijät
type: Concept
References: Elämäkerrat. Muistelmat, maantieteilijät, tutkimusmatkailijat ja kansatieteilijät
type: YKL-luokka
alternative label: Arkeologer, biografier och memoarer (99.19) @sv
alternative label: Arkeologit, elämäkerrat ja muistelmat (99.19)
alternative label: Historiantutkijat, elämäkerrat ja muistelmat (99.19)
alternative label: Historiker (forskare), biografier och memoarer (99.19) @sv
alternative label: Historiker, biografier och memoarer (99.19) @sv
alternative label: Historioitsijat, elämäkerrat ja muistelmat (99.19)
alternative label: Löytöretkeilijät, elämäkerrat ja muistelmat (99.19)
alternative label: Upptäcktsresande, biografier och memoarer (99.19) @sv
broader: Elämäkerrat. Muistelmat
in scheme: YKL - Yleisten kirjastojen luokitusjärjestelmä
notation: 99.19
preferred label: Biografier. Memoarer, historiker, arkeologer och upptäcktsresande @sv
preferred label: Biographies. Memoirs, historians, archaeologists and explorers @en
scope note: Formtillägget 09 används inte i samband med klasserna 90-99.31 @sv
scope note: Muotoluokkaa 09 ei käytetä luokkien 90-99.31 yhteydessä

Elämäkerralliset hakuteokset
type: Concept
References: URN:NBN:fi:au:ykl:61.7303
References: URN:NBN:fi:au:ykl:69.703
References: Taiteen hakuteokset. Taiteilijamatrikkelit
References: URN:NBN:fi:au:ykl:79.103
References: Kirjallisuustieteen hakuteokset. Kirjailijamatrikkelit
References: Sukukirjat. Sukutaulut
type: YKL-luokka
alternative label: Bibliotekarier, biografiska uppslagsverk (99.2) @sv
alternative label: Biografiska uppslagsverk (99.2+) @sv
alternative label: Bokförläggare, biografiska uppslagsverk (99.2) @sv
alternative label: Elämäkerralliset hakuteokset (99.2+)
alternative label: Evenemangsproducenter, biografiska uppslagsverk (99.2) @sv
alternative label: Frontmän, biografiska uppslagsverk (99.2) @sv
alternative label: Henkilöhakemistot, elämäkerralliset (99.2+)
alternative label: Informaatikot, elämäkerralliset hakuteokset (99.2)
alternative label: Informatiker, biografiska uppslagsverk (99.2) @sv
alternative label: Journalister, biografiska uppslagsverk (99.2) @sv
alternative label: Kirjankustantajat, elämäkerralliset hakuteokset (99.2)
alternative label: Kirjastonhoitajat, elämäkerralliset hakuteokset (99.2)
alternative label: Krigsveteraner, biografiska uppslagsverk (99.2) @sv
alternative label: Lehtimiehet, elämäkerralliset hakuteokset (99.2)
alternative label: Matrikkelit (99.2+)
alternative label: Matriklar (99.2+) @sv
alternative label: Museiintendenter, biografiska uppslagsverk (99.2) @sv
alternative label: Museonhoitajat, elämäkerralliset hakuteokset (99.2)
alternative label: Personregister, biografiska (99.2+) @sv
alternative label: Radioproducenter, biografiska uppslagsverk (99.) @sv
alternative label: Radiotuottajat, elämäkerralliset hakuteokset (99.2)
alternative label: Redaktörer, biografiska uppslagsverk (99.2) @sv
alternative label: Rintamamiehet, elämäkerralliset hakuteokset (99.2)
alternative label: Sankarivainajat, elämäkerralliset hakuteokset (99.2)
alternative label: Sodissa kaatuneiden luettelot (99.2)
alternative label: Sotaveteraanit, elämäkerralliset hakuteokset (99.2)
alternative label: Stupade hjältar, biografiska uppslagsverk (99.2) @sv
alternative label: Stupade, förteckningar (99.2) @sv
alternative label: TV-producenter, biografiska uppslagsverk (99.2) @sv
alternative label: Tapahtumatuottajat, elämäkerralliset hakuteokset (99.2)
alternative label: Televisiotuottajat, elämäkerralliset hakuteokset (99.2)
alternative label: Toimittajat, elämäkerralliset hakuteokset (99.2)
broader: HENKILÖ- JA SUKUHISTORIA
in scheme: YKL - Yleisten kirjastojen luokitusjärjestelmä
narrower: Elämäkerralliset hakuteokset, Filosofit. Psykologit
narrower: Elämäkerralliset hakuteokset, Uskontojen ja kirkkokuntien edustajat
narrower: Elämäkerralliset hakuteokset, Yhteiskuntaelämän, kasvatuksen ja maanpuolustuksen edustajat
narrower: Elämäkerralliset hakuteokset, Maantieteilijät. Tutkimusmatkailijat. Kansatieteilijät
narrower: Elämäkerralliset hakuteokset, Luonnontieteilijät. Lääketieteen edustajat
narrower: Elämäkerralliset hakuteokset, Tekniikan, tuotantoelämän, kaupan ja talouselämän edustajat
narrower: Elämäkerralliset hakuteokset, Taiteentutkijat. Urheilututkijat
narrower: Elämäkerralliset hakuteokset, Kielitieteilijät. Kirjallisuudentutkijat
narrower: Elämäkerralliset hakuteokset, Historioitsijat. Arkeologit. Löytöretkeilijät
notation: 99.2
preferred label: Biografiska uppslagsverk @sv
preferred label: Biographical reference books @en
scope note: Hit och till underklasserna oavsett land eller tidsperiod matriklar och personregister där personuppgifter är huvudsaken Om huvudinnehållet i en matrikel eller ett personregister består av något annat än personuppgifter, t.ex. en läroinrättnings historia, förs matrikeln eller personregistret till ifrågavarande områdes klass I osäkra fall ges företräde åt klass 99.2+ Hit personhistoriska uppslagsverk med blandat innehåll Hit också personhistoriska uppslagsverk om t.ex. bokförläggare, museiintendenter, bibliotekarien, informatiker, redaktörer eller journalister Personhistoriska uppslagsverk om författare, konstnärer och idrottare förs till klasserna för litteraturhistoria eller klasserna för olika konstformer eller idrottsgrenar Formtillägget 03 används inte i samband med klasserna 99.2-99.29 Formtillägget 09 används inte i samband med klasserna 90-99.31 @sv
scope note: Tähän ja alaluokkiin maasta tai aikakaudesta riippumatta matrikkelit ja henkilöhakemistot, joissa henkilötiedot ovat pääasiana Jos matrikkelin tai henkilöhakemiston pääsisältönä ovat muut kuin henkilötiedot, esim. oppilaitoksen historia, se luokitetaan ko. alan luokkaan Epävarmoissa tapauksissa annetaan etusija luokalle 99.2+ Tähän yleiset ja sekasisältöiset henkilöhistorialliset hakuteokset Tähän myös esim. kirjankustantajia, museon- tai kirjastonhoitajia, informaatikkoja, toimittajia tai lehtimiehiä koskevat henkilöhistorialliset hakuteokset Kirjailijoiden, taiteilijoiden ja urheilijoiden elämäkerralliset hakuteokset luokitetaan kirjallisuudenhistoriaan tai eri taide- ja urheilumuotojen luokkiin Muotoluokkaa 03 ei käytetä luokkien 99.2-99.29 yhteydessä Muotoluokkaa 09 ei käytetä luokkien 90-99.31 yhteydessä

Elämäkerralliset hakuteokset, Filosofit. Psykologit
type: Concept
References: Elämäkerralliset hakuteokset, Luonnontieteilijät. Lääketieteen edustajat
type: YKL-luokka
alternative label: Filosofer, biografiska uppslagsverk (99.21) @sv
alternative label: Filosofit, elämäkerralliset hakuteokset (99.21)
alternative label: Psykologer, biografiska uppslagsverk (99.21) @sv
alternative label: Psykologit, elämäkerralliset hakuteokset (99.21)
broader: Elämäkerralliset hakuteokset
in scheme: YKL - Yleisten kirjastojen luokitusjärjestelmä
notation: 99.21
preferred label: Biografiska uppslagsverk, filosofer och psykologer @sv
preferred label: Biographical reference books, philosophers and psychologists @en
scope note: Hit också personhistoriska uppslagsverk med uppgifter om både psykologiforskare och psykiatrer Formtillägget 03 används inte i samband med klasserna 99.2-99.29 Formtillägget 09 används inte i samband med klasserna 90-99.31 @sv
scope note: Tähän myös henkilöhistorialliset hakuteokset, joissa on sekä psykologian tutkijoita että psykiatreja Muotoluokkaa 03 ei käytetä luokkien 99.2-99.29 yhteydessä Muotoluokkaa 09 ei käytetä luokkien 90-99.31 yhteydessä

Elämäkerralliset hakuteokset, Uskontojen ja kirkkokuntien edustajat
type: Concept
References: YLEINEN USKONTOTIEDE
References: Raamatun henkilöt
References: KRISTILLISET KIRKOT JA YHTEISÖT. KIRKKOHISTORIA
References: MUUT USKONNOT JA MYTOLOGIAT
type: YKL-luokka
alternative label: Biskopar, biografiska uppslagsverk (99.22) @sv
alternative label: Församlingsarbetare, biografiska uppslagsverk (99.22) @sv
alternative label: Kantorer, biografiska uppslagsverk (99.22) @sv
alternative label: Kanttorit, elämäkerralliset hakuteokset (99.22)
alternative label: Kirkkojen edustajat, elämäkerralliset hakuteokset (99.22)
alternative label: Kirkkomuusikot, elämäkerralliset hakuteokset (99.22)
alternative label: Kirkolliset henkilöt, elämäkerralliset hakuteokset (99.22)
alternative label: Kyrkliga personer, biografiska uppslagsverk (99.22) @sv
alternative label: Kyrkomusiker, biografiska uppslagsverk (99.22) @sv
alternative label: Kyrkornas företrädare, biografiska uppslagsverk (99.22) @sv
alternative label: Lähetystyöntekijät, elämäkerralliset hakuteokset (99.22)
alternative label: Missionärer, biografiska uppslagsverk (99.22) @sv
alternative label: Papit, elämäkerralliset hakuteokset (99.22)
alternative label: Piispat, elämäkerralliset hakuteokset (99.22)
alternative label: Präster, biografiska uppslagsverk (99.22) @sv
alternative label: Religionernas företrädare, biografiska uppslagsverk (99.22) @sv
alternative label: Seurakuntatyöntekijät, elämäkerralliset hakuteokset (99.22)
alternative label: Uskontojen edustajat, elämäkerralliset hakuteokset (99.22)
broader: Elämäkerralliset hakuteokset
in scheme: YKL - Yleisten kirjastojen luokitusjärjestelmä
notation: 99.22
preferred label: Biografiska uppslagsverk, representanter för religioner och kyrkosamfund @sv
preferred label: Biographical reference books, religious and denominational figures @en
scope note: Hit personhistoriska uppslagsverk om t.ex. biskopar, präster samt församlings- eller missionsarbetare Formtillägget 03 används inte i samband med klasserna 99.2-99.29 Formtillägget 09 används inte i samband med klasserna 90-99.31 @sv
scope note: Tähän esim. piispoja, pappeja sekä seurakunta- tai lähetystyöntekijöitä koskevat henkilöhistorialliset hakuteokset Muotoluokkaa 03 ei käytetä luokkien 99.2-99.29 yhteydessä Muotoluokkaa 09 ei käytetä luokkien 90-99.31 yhteydessä

Elämäkerralliset hakuteokset, Yhteiskuntaelämän, kasvatuksen ja maanpuolustuksen edustajat
type: Concept
References: Koululaitos
References: Elämäkerralliset hakuteokset, Tekniikan, tuotantoelämän, kaupan ja talouselämän edustajat
type: YKL-luokka
alternative label: Advokater, biografiska uppslagsverk (99.23) @sv
alternative label: Asianajajat, elämäkerralliset hakuteokset (99.23)
alternative label: Europarlamentaarikot, elämäkerralliset hakuteokset (99.23)
alternative label: Europarlamentariker, biografiska uppslagsverk (99.23) @sv
alternative label: Försvarets företrädare, biografiska uppslagsverk (99.23) @sv
alternative label: Förvaltningens företrädare, biografiska uppslagsverk (99.23) @sv
alternative label: Hallinnon edustajat, elämäkerralliset hakuteokset (99.23)
alternative label: Hallitsijat, elämäkerralliset hakuteokset (99.23)
alternative label: Jurister, biografiska uppslagsverk (99.23) @sv
alternative label: Juristit, elämäkerralliset hakuteokset (99.23)
alternative label: Kansanedustajat, elämäkerralliset hakuteokset (99.23)
alternative label: Kasvatuksen edustajat, elämäkerralliset hakuteokset (99.23)
alternative label: Kasvatustieteilijät, elämäkerralliset hakuteokset (99.23)
alternative label: Kungligheter, bibliografiska uppslagsverk (99.23) @sv
alternative label: Kuninkaalliset, elämäkerralliset hakuteokset (99.23)
alternative label: Lakimiehet, elämäkerralliset hakuteokset (99.23)
alternative label: Lärare, biografiska uppslagsverk (99.23) @sv
alternative label: Maanpuolustuksen edustajat, elämäkerralliset hakuteokset (99.23)
alternative label: Militärer, biografiska uppslagsverk (99.23) @sv
alternative label: Ministerit, elämäkerralliset hakuteokset (99.23)
alternative label: Ministrar, biografiska uppslagsverk (99.23) @sv
alternative label: Officerare, biografiska uppslagsverk (99.23) @sv
alternative label: Oikeustieteilijät, elämäkerralliset hakuteokset (99.23)
alternative label: Opettajat, elämäkerralliset hakuteokset (99.23)
alternative label: Pedagoger, biografiska uppslagsverk (99.23) @sv
alternative label: Poliisit, elämäkerralliset hakuteokset (99.23)
alternative label: Poliitikot, elämäkerralliset hakuteokset (99.23)
alternative label: Poliser, biografiska uppslagsverk (99.23) @sv
alternative label: Politiker, biografiska uppslagsverk (99.23) @sv
alternative label: Presidenter, biografiska uppslagsverk (99.23) @sv
alternative label: Presidentit, elämäkerralliset hakuteokset (99.23)
alternative label: Regenter, biografiska uppslagsverk (99.23) @sv
alternative label: Riksdagsmän, biografiska uppslagsverk (99.23) @sv
alternative label: Rättslärda, biografiska uppslagsverk (99.23) @sv
alternative label: Samhällslivets företrädare, biografiska uppslagsverk (99.23) @sv
alternative label: Socialarbetets företrädare, biografiska uppslagsverk (99.23) @sv
alternative label: Sosiaalityön edustajat, elämäkerralliset hakuteokset (99.23)
alternative label: Sotilashenkilöt, elämäkerralliset hakuteokset (99.23)
alternative label: Spioner, biografiska uppslagsverk (99.23) @sv
alternative label: Statsmän, biografiska uppslagsverk (99.23) @sv
alternative label: Statsvetenskapsmän, biografiska uppslagsverk (99.23) @sv
alternative label: Tjänstemän, biografiska uppslagsverk (99.23) @sv
alternative label: Upseerit, elämäkerralliset hakuteokset (99.23)
alternative label: Vakoilijat, elämäkerralliset hakuteokset (99.23)
alternative label: Vakoojat, elämäkerralliset hakuteokset (99.23)
alternative label: Valtiomiehet, elämäkerralliset hakuteokset (99.23)
alternative label: Valtiotieteilijät, elämäkerralliset hakuteokset (99.23)
alternative label: Virkamiehet, elämäkerralliset hakuteokset (99.23)
alternative label: Yhteiskuntaelämän edustajat, elämäkerralliset hakuteokset (99.23)
broader: Elämäkerralliset hakuteokset
in scheme: YKL - Yleisten kirjastojen luokitusjärjestelmä
notation: 99.23
preferred label: Biografiska uppslagsverk, representanter för samhällsliv, pedagogik och försvarv @sv
preferred label: Biographical reference books, social, educational and military figures @en
scope note: Hit personhistoriska uppslagsverk om t.ex. politiker, statsvetare, jurister, rättsvetare, representanter för administration, tjänstemän, representanter för socialvård, lärare, pedagoger eller officerare Formtillägget 03 används inte i samband med klasserna 99.2-99.29 Formtillägget 09 används inte i samband med klasserna 90-99.31 @sv
scope note: Tähän esim. poliitikkoja, valtiotieteilijöitä, lakimiehiä, oikeustieteilijöitä, hallinnon edustajia, virkamiehiä, sosiaalitoimen edustajia, opettajia, kasvatustieteilijöitä tai upseereita koskevat henkilöhistorialliset hakuteokset Muotoluokkaa 03 ei käytetä luokkien 99.2-99.29 yhteydessä Muotoluokkaa 09 ei käytetä luokkien 90-99.31 yhteydessä

Elämäkerralliset hakuteokset, Maantieteilijät. Tutkimusmatkailijat. Kansatieteilijät
type: Concept
References: Elämäkerralliset hakuteokset, Kielitieteilijät. Kirjallisuudentutkijat
References: Elämäkerralliset hakuteokset, Historioitsijat. Arkeologit. Löytöretkeilijät
type: YKL-luokka
alternative label: Antropologer, biografiska uppslagsverk (99.24) @sv
alternative label: Antropologit, elämäkerralliset hakuteokset (99.24)
alternative label: Etnologer, biografiska uppslagsverk (99.24) @sv
alternative label: Forskningsresanden, biografiska uppslagsverk (99.24) @sv
alternative label: Geografer, biografiska uppslagsverk (99.24) @sv
alternative label: Kansatieteilijät, elämäkerralliset hakuteokset (99.24)
alternative label: Maantieteilijät, elämäkerralliset hakuteokset (99.24)
alternative label: Tutkimusmatkailijat, elämäkerralliset hakuteokset (99.24)
broader: Elämäkerralliset hakuteokset
in scheme: YKL - Yleisten kirjastojen luokitusjärjestelmä
notation: 99.24
preferred label: Biografiska uppslagsverk, geografer, forskningsresande and etnologer @sv
preferred label: Biographical reference books, geographers, explorers and ethnologists @en
scope note: Hit också personhistoriska uppslagsverk om antropologer Formtillägget 03 används inte i samband med klasserna 99.2-99.29 Formtillägget 09 används inte i samband med klasserna 90-99.31 @sv
scope note: Tähän myös antropologeja koskevat henkilöhistorialliset hakuteokset Muotoluokkaa 03 ei käytetä luokkien 99.2-99.29 yhteydessä Muotoluokkaa 09 ei käytetä luokkien 90-99.31 yhteydessä

Elämäkerralliset hakuteokset, Luonnontieteilijät. Lääketieteen edustajat
type: Concept
References: Elämäkerralliset hakuteokset, Filosofit. Psykologit
References: Elämäkerralliset hakuteokset, Tekniikan, tuotantoelämän, kaupan ja talouselämän edustajat
type: YKL-luokka
alternative label: Astronomer, biografiska uppslagsverk (99.25) @sv
alternative label: Biologer, biografiska uppslagsverk (99.25) @sv
alternative label: Biologit, elämäkerralliset hakuteokset (99.25)
alternative label: Fysiker, biografiska uppslagsverk (99.25) @sv
alternative label: Fyysikot, elämäkerralliset hakuteokset (99.25)
alternative label: Geologer, biografiska uppslagsverk (99.25) @sv
alternative label: Geologit, elämäkerralliset hakuteokset (99.25)
alternative label: Hälsovårdare, biografiska uppslagsverk (99.25) @sv
alternative label: Hälsovårdspersonal, biografiska uppslagsverk (99.25) @sv
alternative label: Kemister, biografiska uppslagsverk (99.25) @sv
alternative label: Kemistit, elämäkerralliset hakuteokset (99.25)
alternative label: Kirurger, biografiska uppslagsverk (99.25) @sv
alternative label: Kirurgit, elämäkerralliset hakuteokset (99.25)
alternative label: Luonnontieteilijät, elämäkerralliset hakuteokset (99.25)
alternative label: Lähihoitajat, elämäkerralliset hakuteokset (99.25)
alternative label: Läkare, biografiska uppslagsverk (99.25) @sv
alternative label: Lääketieteen edustajat, elämäkerralliset hakuteokset (99.25)
alternative label: Lääkärit, elämäkerralliset hakuteokset (99.25)
alternative label: Matemaatikot, elämäkerralliset hakuteokset (99.25)
alternative label: Matematiker, biografiska uppslagsverk (99.25) @sv
alternative label: Medicinens företrädare, biografiska uppslagsverk (99.25) @sv
alternative label: Naturvetenskapsmän, biografiska uppslagsverk (99.25) @sv
alternative label: Närvårdare, biografiska uppslagsverk (99.25) @sv
alternative label: Perushoitajat, elämäkerralliset hakuteokset (99.25)
alternative label: Primärskötare, biografiska uppslagsverk (99.25) @sv
alternative label: Psykiatrer, biografiska uppslagsverk (99.25) @sv
alternative label: Psykiatrit, elämäkerralliset hakuteokset (99.25)
alternative label: Sairaanhoitajat, elämäkerralliset hakuteokset (99.25)
alternative label: Sjukskötare, biografiska uppslagsverk (99.25) @sv
alternative label: Terveydenhoitajat, elämäkerralliset hakuteokset (99.25)
alternative label: Terveydenhuoltohenkilöstö, elämäkerralliset hakuteokset (99.25)
alternative label: Tähtitieteilijät, elämäkerralliset hakuteokset (99.25)
broader: Elämäkerralliset hakuteokset
in scheme: YKL - Yleisten kirjastojen luokitusjärjestelmä
notation: 99.25
preferred label: Biografiska uppslagsverk, naturvetare och medicinare @sv
preferred label: Biographical reference books, natural scientists and representatives of medicine @en
scope note: Hit biografiska uppslagsverk om t.ex. matematiker, astronomer, fysiker, kemister, biologer samt läkare eller sjukskötare på olika områden Om ett personhistoriskt uppslagsverk innehåller både forskare i psykologi och psykiatrer, ges företräde åt klass 99.21 Formtillägget 03 används inte i samband med klasserna 99.2-99.29 Formtillägget 09 används inte i samband med klasserna 90-99.31 @sv
scope note: Tähän esim. matemaatikkoja, tähtitieteilijöitä, fyysikoita, kemistejä, biologeja sekä eri alojen lääkäreitä tai sairaanhoitajia koskevat elämäkerralliset hakuteokset Jos henkilöhistoriallisessa hakuteoksessa on sekä psykologian tutkijoita että psykiatreja, annetaan etusija luokalle 99.21 Muotoluokkaa 03 ei käytetä luokkien 99.2-99.29 yhteydessä Muotoluokkaa 09 ei käytetä luokkien 90-99.31 yhteydessä

Elämäkerralliset hakuteokset, Tekniikan, tuotantoelämän, kaupan ja talouselämän edustajat
type: Concept
alternative label: Adb-planerare, biografiska uppslagsverk (99.26) @sv
alternative label: Adb-stödpersoner, biografiska uppslagsverk (99.26) @sv
alternative label: Affärsmän, biografiska uppslagsverk (99.26) @sv
alternative label: Atk-suunnittelijat, elämäkerralliset hakuteokset (99.26)
alternative label: Atk-tukihenkilöt, elämäkerralliset hakuteokset (99.26)
alternative label: Bankväsendets företrädare, biografiska uppslagsverk (99.26) @sv
alternative label: Byggmästare, biografiska uppslagsverk (99.26) @sv
alternative label: Datanomer, biografiska uppslagsverk (99.26) @sv
alternative label: Datanomit, elämäkerralliset hakuteokset (99.26)
alternative label: Datormontörer, biografiska uppslagsverk (99.26) @sv
alternative label: Ekonomer, biografiska uppslagsverk (99.26) @sv
alternative label: Ekonomit, elämäkerralliset hakuteokset (99.26)
alternative label: Eläinlääkärit, elämäkerralliset hakuteokset (99.26)
alternative label: Forstmästare, biografiska uppslagsverk (99.26) @sv
alternative label: Företagare, biografiska uppslagsverk (99.26) @sv
alternative label: Försäkringsinrättningarnas företrädare, biografiska uppslagsverk (99.26) @sv
alternative label: Handelns företrädare, biografiska uppslagsverk (99.26) @sv
alternative label: Handelsmän, biografiska uppslagsverk (99.26) @sv
alternative label: Hantverkare, biografiska uppslagsverk (99.26) @sv
alternative label: Industrins företrädare, biografiska uppslagsverk (99.26) @sv
alternative label: Ingenjörer, biografiska uppslagsverk (99.26) @sv
alternative label: Insinöörit, elämäkerralliset hakuteokset (99.26)
alternative label: Jordbrukare, biografiska uppslagsverk (99.26) @sv
alternative label: Kaupan edustajat, elämäkerralliset hakuteokset (99.26)
alternative label: Kauppiaat, elämäkerralliset hakuteokset (99.26)
alternative label: Keittiömestarit, elämäkerralliset hakuteokset (99.26)
alternative label: Keksijät, elämäkerralliset hakuteokset (99.26)
alternative label: Kockar, biografiska uppslagsverk (99.26) @sv
alternative label: Kokit, elämäkerralliset hakuteokset (99.26)
alternative label: Käsityöammattien edustajat, elämäkerralliset hakuteokset (99.26)
alternative label: Köksmästare, biografiska uppslagsverk (99.26) @sv
alternative label: Lantbrukets företrädare, biografiska uppslagsverk (99.26) @sv
alternative label: Liikemiehet, elämäkerralliset hakuteokset (99.26)
alternative label: Liikenteen edustajat, elämäkerralliset hakuteokset (99.26)
alternative label: Maanviljelijät, elämäkerralliset hakuteokset (99.26)
alternative label: Maatalouden edustajat, elämäkerralliset hakuteokset (99.26)
alternative label: Merikapteenit, elämäkerralliset hakuteokset (99.26)
alternative label: Metsänhoitajat, elämäkerralliset hakuteokset (99.26)
alternative label: Metsätalouden edustajat, elämäkerralliset hakuteokset (99.26)
alternative label: Mikrotukihenkilöt, elämäkerralliset hakuteokset (99.26)
alternative label: Nationalekonomer, biografiska uppslagsverk (99.26) @sv
alternative label: Näringslivets företrädare, biografiska uppslagsverk (99.26) @sv
alternative label: Ohjelmoijat, elämäkerralliset hakuteokset (99.26)
alternative label: Operaattorit, elämäkerralliset hakuteokset (99.26)
alternative label: Operatörer, biografiska upslagsverk (99.26) @sv
alternative label: PC-stödpersoner, biografiska uppslagsverk (99.26) @sv
alternative label: Pankkitoimen edustajat, elämäkerralliset hakuteokset (99.26)
alternative label: Produktionens företrädare, biografiska uppslagsverk (99.26) @sv
alternative label: Programmerare, biografiska uppslagsverk (99.26) @sv
alternative label: Puhelinasentajat, elämäkerralliset hakuteokset (99.26)
alternative label: Radioamatörer, biografiska uppslagsverk (99.26) @sv
alternative label: Radioamatöörit, elämäkerralliset hakuteokset (99.26)
alternative label: Radiosähköttäjät, elämäkerralliset hakuteokset (99.26)
alternative label: Radiotelegrafister, biografiska uppslagsverk (99.26) @sv
alternative label: Rakennusmestarit, elämäkerralliset hakuteokset (99.26)
alternative label: Sjökaptener, biografiska uppslagsverk (99.26) @sv
alternative label: Skogsbrukets företrädare, biografiska uppslagsverk (99.26) @sv
alternative label: Systeemisuunnittelijat, elämäkerralliset hakuteokset (99.26)
alternative label: Systemerare, biografiska uppslagsverk (99.26) @sv
alternative label: Talouselämän edustajat, elämäkerralliset hakuteokset (99.26)
alternative label: Taloustieteilijät, elämäkerralliset hakuteokset (99.26)
alternative label: Tekniikan edustajat, elämäkerralliset hakuteokset (99.26)
alternative label: Teknikens företrädare, biografiska uppslagsverk (99.26) @sv
alternative label: Telefonmontörer, biografiska uppslagsverk (99.26) @sv
alternative label: Telemontörer, biografiska uppslagsverk (99.26) @sv
alternative label: Teollisuuden edustajat, elämäkerralliset hakuteokset (99.26)
alternative label: Tietokoneasentajat, elämäkerralliset hakuteokset (99.26)
alternative label: Tietoliikenneasentajat, elämäkerralliset hakuteokset (99.26)
alternative label: Trafikens företrädare, biografiska uppslagsverk (99.26) @sv
alternative label: Tuotantoelämän edustajat, elämäkerralliset hakuteokset (99.26)
alternative label: Uppfinnare, biografiska uppslagsverk (99.26) @sv
alternative label: Vakuutuslaitosten edustajat, elämäkerralliset hakuteokset (99.26)
alternative label: Veterinärer, biografiska uppslagsverk (99.26) @sv
alternative label: Yrittäjät, elämäkerralliset hakuteokset (99.26)
broader: Elämäkerralliset hakuteokset
in scheme: YKL - Yleisten kirjastojen luokitusjärjestelmä
notation: 99.26
scope note: Hit biografiska uppslagsverk om t.ex. ingenjörer, uppfinnare, teknikforskare, representanter för industri, banker och försäkringsbolag, företagare, handelsmän och nationalekonomer, representanter för hantverk, utövare av lant- och skogsbruk, veterinären eller representanter för trafik Formtillägget 03 används inte i samband med klasserna 99.2-99.29 Formtillägget 09 används inte i samband med klasserna 90-99.31 @sv
scope note: Tähän esim. insinöörejä, keksijöitä, tekniikan tutkijoita, teollisuuden, pankkien ja vakuutuslaitosten edustajia, yrittäjiä, kauppiaita ja taloustieteilijöitä, käsityöammattien edustajia, maa- ja metsätalouden harjoittajia, eläinlääkäreitä tai liikenteenharjoittajia koskevat elämäkerralliset hakuteokset Muotoluokkaa 03 ei käytetä luokkien 99.2-99.29 yhteydessä Muotoluokkaa 09 ei käytetä luokkien 90-99.31 yhteydessä

Elämäkerralliset hakuteokset, Taiteentutkijat. Urheilututkijat
type: Concept
type: YKL-luokka
alternative label: Idrottsforskare, biografiska uppslagsverk (99.27) @sv
alternative label: Konstforskare, biografiska uppslagsverk (99.27) @sv
alternative label: Konsthistoriker, biografiska uppslagsverk (99.27) @sv
alternative label: Musiikintutkijat, elämäkerralliset hakuteokset (99.27)
alternative label: Musikforskare, biografiska uppslagsverk (99.27) @sv
alternative label: Taidehistorioitsijat, elämäkerralliset hakuteokset (99.27)
alternative label: Taiteentutkijat, elämäkerralliset hakuteokset (99.27)
alternative label: Urheilututkijat, elämäkerralliset hakuteokset (99.27)
broader: Elämäkerralliset hakuteokset
in scheme: YKL - Yleisten kirjastojen luokitusjärjestelmä
notation: 99.27
preferred label: Biografiska uppslagsverk, konstforskare och idrottsforskare @sv
preferred label: Biographical reference books, art historians and sports researchers @en

Elämäkerralliset hakuteokset, Kielitieteilijät. Kirjallisuudentutkijat
type: Concept
References: Kirjallisuustieteen hakuteokset. Kirjailijamatrikkelit
References: Elämäkerralliset hakuteokset, Maantieteilijät. Tutkimusmatkailijat. Kansatieteilijät
type: YKL-luokka
alternative label: Folkdiktsforskare, biografiska uppslagsverk (99.28) @sv
alternative label: Kansanrunoudentutkijat, elämäkerralliset hakuteokset (99.28)
alternative label: Kielitieteilijät, elämäkerralliset hakuteokset (99.28)
alternative label: Kirjallisuudentutkijat, elämäkerralliset hakuteokset (99.28)
alternative label: Litteraturforskare, biografiska uppslagsverk (99.28) @sv
alternative label: Språkvetare, biografiska uppslagsverk (99.28) @sv
broader: Elämäkerralliset hakuteokset
in scheme: YKL - Yleisten kirjastojen luokitusjärjestelmä
notation: 99.28
preferred label: Biografiska uppslagsverk, språkvetare och litteraturforskare @sv
preferred label: Biographical reference books, linguists, literary historians @en
scope note: Hit också biografiska uppslagsverk om folkdiktsforskare Formtillägget 03 används inte i samband med klasserna 99.2-99.29 Formtillägget 09 används inte i samband med klasserna 90-99.31 @sv
scope note: Tähän myös kansanrunoudentutkijoita koskevat elämäkerralliset hakuteokset Muotoluokkaa 03 ei käytetä luokkien 99.2-99.29 yhteydessä Muotoluokkaa 09 ei käytetä luokkien 90-99.31 yhteydessä

Elämäkerralliset hakuteokset, Historioitsijat. Arkeologit. Löytöretkeilijät
type: Concept
References: Elämäkerralliset hakuteokset, Maantieteilijät. Tutkimusmatkailijat. Kansatieteilijät
type: YKL-luokka
alternative label: Arkeologer, biografiska uppslagsverk (99.29) @sv
alternative label: Arkeologit, elämäkerralliset hakuteokset (99.29)
alternative label: Historiantutkijat, elämäkerralliset hakuteokset (99.29)
alternative label: Historiker (forskare), biografiska uppslagsverk (99.29) @sv
alternative label: Historiker, biografiska uppslagsverk (99.29) @sv
alternative label: Historioitsijat, elämäkerralliset hakuteokset (99.29)
alternative label: Löytöretkeilijät, elämäkerralliset hakuteokset (99.29)
alternative label: Upptäcktsresande, biografiska uppslagsverk (99.29) @sv
broader: Elämäkerralliset hakuteokset
in scheme: YKL - Yleisten kirjastojen luokitusjärjestelmä
notation: 99.29
preferred label: Biografiska uppslagsverk, historiker, arkeologer och upptäcktsresande @sv
preferred label: Biographical reference books, historians, archaeologists and explorers @en
scope note: Formtillägget 03 används inte i samband med klasserna 99.2-99.29 Formtillägget 09 används inte i samband med klasserna 90-99.31 @sv
scope note: Muotoluokkaa 03 ei käytetä luokkien 99.2-99.29 yhteydessä Muotoluokkaa 09 ei käytetä luokkien 90-99.31 yhteydessä

Sukuhistoria. Sukututkimus
type: Concept
References: Arkistot
References: Elämäkerrat. Muistelmat
References: Elämäkerralliset hakuteokset
type: YKL-luokka
alternative label: Genealogi (99.3+) @sv
alternative label: Genealogia (99.3+)
alternative label: Henkilönnimitutkimus, sukututkimus (99.3)
alternative label: Kirkonarkistot, sukututkimus (99.3)
alternative label: Kyrkoarkiv, släktforskning (99.3) @sv
alternative label: Landsarkiv, släktforskning (99.3) @sv
alternative label: Maakunta-arkistot, sukututkimus (99.3)
alternative label: Personnamnsforskning, släktforskning (99.3) @sv
alternative label: Riksarkiv, genealogi (99.3) @sv
alternative label: Släkter, forskning (99.3+) @sv
alternative label: Släktforskning (99.3+) @sv
alternative label: Släktforskningshandböcker (99.3) @sv
alternative label: Släkthistoria (99.3+) @sv
alternative label: Släktnamn, släktforskning (99.3) @sv
alternative label: Sukuhistoria (99.3+)
alternative label: Sukunimet, sukututkimus (99.3)
alternative label: Sukututkimus (99.3+)
alternative label: Sukututkimusoppaat (99.3)
alternative label: Suvut, sukututkimus (99.3+)
alternative label: Valtionarkistot, sukututkimus (99.3)
broader: HENKILÖ- JA SUKUHISTORIA
in scheme: YKL - Yleisten kirjastojen luokitusjärjestelmä
narrower: Sukukirjat. Sukutaulut
notation: 99.3
preferred label: Family history. Genealogy @en
preferred label: Släkthistoria. Släktforskning @sv
scope note: Hit handböcker i genealogi Användning av riks-, lands- och kyrkoarkiv som källor för släktforskning Formtillägget 09 används inte i samband med klasserna 90-99.31 @sv
scope note: Tähän sukututkimuksen oppaat Valtion-, maakunta- ja kirkonarkistojen käyttö sukututkimuksen lähteinä Muotoluokkaa 09 ei käytetä luokkien 90-99.31 yhteydessä

Sukukirjat. Sukutaulut
type: Concept
type: YKL-luokka
alternative label: Aateliskalenterit (99.31)
alternative label: Adelskalendrar (99.31) @sv
alternative label: Släktböcker, enskilda släkter (99.31) @sv
alternative label: Släkthistoria, enskilda släkter (99.31) @sv
alternative label: Släkttavlor (99.31) @sv
alternative label: Sukuhistoriat, yksittäiset suvut (99.31)
alternative label: Sukukirjat, yksittäiset suvut (99.31)
alternative label: Sukutaulut (99.31)
broader: Sukuhistoria. Sukututkimus
in scheme: YKL - Yleisten kirjastojen luokitusjärjestelmä
notation: 99.31
preferred label: Family history books. Genealogical tables @en
preferred label: Släktböcker. Antavlor @sv
scope note: Hit oavsett land eller tidsperiod enskilda släkters historia och antavlor Adelskalendrar Formtillägget 09 används inte i samband med klasserna 90-99.31 @sv
scope note: Tähän maasta tai aikakaudesta riippumatta yksittäisten sukujen historia ja sukutaulut Aateliskalenterit Muotoluokkaa 09 ei käytetä luokkien 90-99.31 yhteydessä

Erä
type: Concept
type: Muotoluokka
broader: Fiktiivisen aineiston lisäluokat
in scheme: YKL - Yleisten kirjastojen luokitusjärjestelmä
note: Fiktiiviset kuvaukset eräelämästä, metsästyksestä ja kalastuksesta. Fiktiivinen eräkirjallisuus. Fiktiiviset eräelokuvat. Eräromaanit. Eräkertomukset. Erätarinat. Eränovellit. Käytetään vain luokkien 80-85+ yhteydessä
note: Fiktiva skildringar om vildmarksliv, jakt och fiske. Fiktiv ödemarkslitteratur. Fiktiva filmer om vildmarksliv. Vildmarksromaner. Vildmarksnoveller. Berättelser och sägner om vildmarksliv. Används bara i samband med klasser 80-85+ @sv
preferred label: Hunting&Fishing @en
preferred label: Vildmark @sv

Eläimet
type: Concept
type: Muotoluokka
broader: Fiktiivisen aineiston lisäluokat
in scheme: YKL - Yleisten kirjastojen luokitusjärjestelmä
note: Kaunokirjallinen eläinkirjallisuus. Fiktiiviset eläinaiheiset elokuvat. Eläinromaanit. Eläinkertomukset. Eläintarinat. Eläinsadut. Faabelit. Eläinrunot. Käytetään vain luokkien 80-85+ yhteydessä
note: Skönlitteratur med djur som huvudtema. Fiktiva djurfilmer. Djurromaner. Djurberättelser. Djursagor. Fabler. Djurdikter. Används bara i samband med klasser 80-85+ @sv
preferred label: Animals @en
preferred label: Djur @sv

Uskonto
type: Concept
type: Muotoluokka
broader: Fiktiivisen aineiston lisäluokat
in scheme: YKL - Yleisten kirjastojen luokitusjärjestelmä
note: Oavsett religionssamfund fiktion som har religion eller religiositet som huvudtema. Religiös litteratur. Religiösa filmer. Religiösa romaner. Religiösa noveller. Religiösa berättelser. Religiösa sagor. Religiösa skådespel. Religiös lyrik. Religiösa serier. Används bara i samband med klasser 80-85+ @sv
note: Uskontokunnasta riippumatta fiktio, jossa uskonto tai uskonnollisuus on keskeinen teema. Uskonnollinen kirjallisuus. Uskonnolliset elokuvat. Uskonnolliset romaanit. Uskonnolliset novellit. Uskonnolliset kertomukset. Uskonnolliset näytelmät. Uskonnolliset runot. Uskonnolliset sarjakuvat. Käytetään vain luokkien 80-85+ yhteydessä
preferred label: Religion @en

Novellit
type: Concept
type: Muotoluokka
broader: Fiktiivisen aineiston lisäluokat
in scheme: YKL - Yleisten kirjastojen luokitusjärjestelmä
note: Noveller. Berättelser. Sägner. Kåserier. Kortprosa. Används bara i samband med klasser 80-85+ Tilläggsklass "Noveller" kan användas även i samband med de andra tilläggsklasserna, t.ex. Spänning, Noveller @sv
note: Novellit. Kertomukset. Tarinat. Pakinat. Lyhytproosa. Käytetään vain luokkien 80-85+ yhteydessä Lisäluokkaa "Novellit" voidaan käyttää myös muiden lisäluokkien yhteydessä, esim. Jännitys, Novellit
preferred label: Noveller @sv
preferred label: Short stories (Form tag for fiction) @en

Erotiikka
type: Concept
type: Muotoluokka
broader: Fiktiivisen aineiston lisäluokat
in scheme: YKL - Yleisten kirjastojen luokitusjärjestelmä
note: Eroottiset romaanit, novellit ja kertomukset. Eroottiset elokuvat. Käytetään vain luokkien 80-85+ yhteydessä
note: Erotiska romaner, noveller och berättelser. Erotiska filmer. Används bara i samband med klasser 80-85+ @sv
preferred label: Erotica @en
preferred label: Erotik @sv

Urheilu
type: Concept
type: Muotoluokka
broader: Fiktiivisen aineiston lisäluokat
in scheme: YKL - Yleisten kirjastojen luokitusjärjestelmä
note: Fiktion med idrott som huvudtema. Idrottsromaner. Idrottsfilmer. Används bara i samband med klasser 80-85+ @sv
note: Urheiluaiheinen fiktio. Urheilukirjallisuus. Urheiluelokuvat. Käytetään vain luokkien 80-85+ yhteydessä
preferred label: Idrott @sv
preferred label: Sport @en

Fantasia
type: Concept
type: Muotoluokka
broader: Fiktiivisen aineiston lisäluokat
in scheme: YKL - Yleisten kirjastojen luokitusjärjestelmä
note: Fantasiakirjallisuus. Fantasiaelokuvat. Fantasiaromaanit. Fantasiakertomukset. Fantasianovellit. Fantasianäytelmät. Fantasiasarjakuvat Miekka ja magia -kirjallisuus. Käytetään vain luokkien 80-85+ yhteydessä
note: Fantasylitteratur. Fantasyfilmer Fantasyromaner. Fantasyberättelser. Fantasynoveller. Fantasydramer. Fantasyserier Svärd och magilitteratur. Används bara i samband med klasser 80-85+ @sv
preferred label: Fantasy @en

Historia
type: Concept
type: Muotoluokka
broader: Fiktiivisen aineiston lisäluokat
in scheme: YKL - Yleisten kirjastojen luokitusjärjestelmä
note: Historialliset romaanit. Historialliset elokuvat. Historialliset seikkailuromaanit. Historialliset seikkailuelokuvat. Historialliset kertomukset. Historialliset tarinat. Historialliset novellit. Historialliset sarjakuvat Historialliset näytelmät. Käytetään vain luokkien 80-85+ yhteydessä
note: Historiska romaner. Historiska filmer. Historiska äventyrsböcker. Historiska äventyrsfilmer. Historiska berättelser. Historiska sägner. Historiska noveller. Historiska serier. Historiska dramer. Används bara i samband med klasser 80-85+ @sv
preferred label: History @en

Huumori
type: Concept
type: Muotoluokka
broader: Fiktiivisen aineiston lisäluokat
in scheme: YKL - Yleisten kirjastojen luokitusjärjestelmä
note: Humoristinen kaunokirjallisuus. Humoristiset elokuvat. Humoristiset romaanit. Humoristiset kertomukset. Humoristiset tarinat. Humoristiset novellit. Huumorisarjakuvat. Humoristiset runot. Humoristiset näytelmät. Komiikka. Sketsit. Farssit. Stand up -komiikka Kaskut. Vitsit. Käytetään vain luokkien 80-85+ yhteydessä
note: Humoristisk skönlitteratur. Humoristiska filmer. Humoristiska romaner. Humoristiska berättelser. Humoristiska sägner. Humoristiska noveller. Humoristiska dikter. Humoristiska skådespel. Komik. Farser. Sketcher. Stå-upp-komik. Anekdoter. Vitsar. Används bara i samband med klasser 80-85+ @sv
preferred label: Humor @sv
preferred label: Humour @en

Jännitys
type: Concept
type: Muotoluokka
broader: Fiktiivisen aineiston lisäluokat
in scheme: YKL - Yleisten kirjastojen luokitusjärjestelmä
note: Jännityskirjallisuus. Jännityselokuvat. Jännitysromaanit. Kovaksikeitetty rikoskirjallisuus. Oikeudenkäyntiromaanit. Poliisikirjallisuus. Psykologinen jännityskirjallisuus. Rikoskirjallisuus. Salapoliisikirjallisuus. Seikkailukirjallisuus. Suljettu huone -kirjallisuus. Vakoilukirjallisuus Jännitysnovellit. Jännityskertomukset. Jännityssarjakuvat. Gangsterielokuvat. Kamppailulajielokuvat. Katastrofielokuvat. Oikeussalielokuvat. Poliisielokuvat. Rikoselokuvat. Salapoliisielokuvat. Seikkailuelokuvat. Toimintaelokuvat. Toimintaromaanit. Vakoiluelokuvat. Historiallinen jännityskirjallisuus. Käytetään vain luokkien 80-85+ yhteydessä
note: Thriller. Spänningslitteratur. Spänningsfilmer. Spänningsromaner. Hårdkokt kriminalfiktion. Brottmålsromaner. Polisromaner. Psykologiska thriller. Kriminalfiktion. Detektivlitteratur. Äventyrslitteratur. Låsta rummet-litteratur. Spionromaner. Spänningsnoveller. Spänningsberättelser. Thrillerserier. Thrillerfilmer. Rysare. Psykologiska rysare. Gangsterfilmer. Kampsportsfilmer. Katastroffilmer. Rättegångsfilmer. Polisfilmer. Kriminalfilmer. Detektivfilmer. Äventyrsfilmer. Actionfilmer. Actionromaner. Spionfilmer. Historiska thrillers (litteratur). Används bara i samband med klasser 80-85+ @sv
preferred label: Spänning @sv
preferred label: Thrillers @en

Kauhu
type: Concept
type: Muotoluokka
broader: Fiktiivisen aineiston lisäluokat
in scheme: YKL - Yleisten kirjastojen luokitusjärjestelmä
note: Kauhukirjallisuus. Kauhuelokuvat. Kauhuromaanit. Kauhukertomukset. Kauhunovellit. Kauhusarjakuvat. Goottilaiset kauhuromaanit. Psykologinen kauhukirjallisuus. Kummitustarinat. Splatter. Käytetään vain luokkien 80-85+ yhteydessä
note: Skräcklitteratur. Skräckfilmer. Skräckromaner. Skräckberättelser. Skräcknoveller. Skräckserier. Gotiska romaner. Psykologisk skräcklitterattur. Spökhistorier. Splatter. Används bara i samband med klasser 80-85+ @sv
preferred label: Horror @en
preferred label: Skräck @sv

Romantiikka
type: Concept
type: Muotoluokka
broader: Fiktiivisen aineiston lisäluokat
in scheme: YKL - Yleisten kirjastojen luokitusjärjestelmä
note: Fiktion ofta med underhållningskaraktär som berskriver romantik och kärlek. Kärlesksromaner. Kärleksberättelser. Kärlekssägner. Historiska kärleksromaner. Kärleksdikter Romantiska herrgårds- och läkarromaner. Kärleksfilmer. Historiska kärlesksfilmer. Romantiska komedier. Romantiska dramer. Tvåloperor. Askungeberättelser. Används bara i samband med klasser 80-85+ @sv
note: Romantiikkaa ja rakkautta koskeva fiktio, jolla on usein viihdekirjallisuuden piirteitä. Rakkausromaanit. Rakkauskertomukset. Rakkaustarinat. Historialliset rakkausromaanit. Rakkausrunot. Romanttiset kartano- ja lääkäriromaanit. Rakkauselokuvat. Historialliset rakkauselokuvat. Romanttiset komediat. Romanttiset draamat. Saippuaoopperat. Tuhkimotarinat. Käytetään vain luokkien 80-85+ yhteydessä
preferred label: Romance @en
preferred label: Romantik @sv

Sota
type: Concept
type: Muotoluokka
broader: Fiktiivisen aineiston lisäluokat
in scheme: YKL - Yleisten kirjastojen luokitusjärjestelmä
note: Fiktion med krig som huvudtema. Krigslitteratur. Krigsfilmer. Krigsromaner. Krigsberättelser. Krigsnoveller. Krigsserier. Krigsdikter. Krigsskådespel. Används bara i samband med klasser 80-85+ @sv
note: Sota-aiheinen fiktio. Sotakirjallisuus. Sotaelokuvat. Sotaromaanit. Sotakertomukset. Sota-aiheiset novellit. Sotasarjakuvat. Sotarunot. Sota-aiheiset näytelmät. Käytetään vain luokkien 80-85+ yhteydessä
preferred label: Krig @sv
preferred label: War @en

Scifi
type: Concept
type: Muotoluokka
broader: Fiktiivisen aineiston lisäluokat
in scheme: YKL - Yleisten kirjastojen luokitusjärjestelmä
note: Fiktion keinoin luodut utopiat, dystopiat ja vaihtoehtohistoriat. Tieteiskirjallisuus. Tieteiselokuvat. Tieteisromaanit. Tieteisnovellit. Tieteiskertomukset. Tieteissarjakuvat. Scifi-aiheiset näytelmät ja runot. Kyberpunk. Käytetään vain luokkien 80-85+ yhteydessä
note: Fiktiva utopier, dystopier och alternativa historier. Science fiction-litteratur. Science fiction-filmer. Science fiction-romaner. Science fiction-noveller. Science fiction-berättelser. Science fiction-serier. Skådespel och dikter med science fiction som huvudtema. Kyberpunk. Används bara i samband med klasser 80-85+ @sv

Fiktiivisen aineiston lisäluokat
type: Concept
type: Muotoluokka
in scheme: YKL - Yleisten kirjastojen luokitusjärjestelmä
narrower: Erä
narrower: Eläimet
narrower: Uskonto
narrower: Novellit
narrower: Erotiikka
narrower: Urheilu
narrower: Fantasia
narrower: Historia
narrower: Huumori
narrower: Jännitys
narrower: Kauhu
narrower: Romantiikka
narrower: Sota
narrower: Scifi
preferred label: Form tags for fiction @en
preferred label: Tilläggsklass för fiktivt material @sv
top concept of: YKL - Yleisten kirjastojen luokitusjärjestelmä

Filosofia. Teoria. Tutkimusmenetelmät (Muotoluokka)
type: Concept
type: Muotoluokka
broader: Muotoluokat
in scheme: YKL - Yleisten kirjastojen luokitusjärjestelmä
notation: 01
preferred label: Filosofi. Teori. Forskningsmetoder (Formtillägg) @sv
preferred label: Philosophy. Theory. Research methods (Form tag) @en
scope note: Instrument. Metoder. Metodologi. Används inte i klasserna: 10+, 11+, 12+, 16-16.7, 17+, 20.21-29+, 51+, 53.1+, 54.1+, 78-78.29, 80, 85+, 90.1 Kommer före formtillägget: 09 Kommer efter formtilläggen: 02, 03+, 05+, 06+, 07, 08+ @sv
scope note: Tutkimusvälineet. Metodit. Metodologia Ei käytetä luokissa: 10+, 11+, 12+, 16-16.7, 17+, 20-26+, 28.1-29+, 51+, 53.1+, 54.1+, 80-85+, 78-78.29, 90.1 Voittaa muotoluokat: 09 Häviää muotoluokille: 02, 03+, 05+, 06+, 07, 08+

Kartat. Kartastot (Muotoluokka)
type: Concept
type: Muotoluokka
broader: Muotoluokat
in scheme: YKL - Yleisten kirjastojen luokitusjärjestelmä
notation: 02
preferred label: Kartverk (Formtillägg) @sv
preferred label: Maps. Atlases (Form tag) @en
scope note: Kartblad. Hopvikbara kartor. Väggkartor. Jordglober. Kartor och kartverk i bokform. Digitaliserade kartor. Temakartor. Sjökort. Flygfotografikartor Som karta räknas också en bok där minst hälften av sidorna är kartblad. Används inte i klasserna: 80-85+ Kommer före formtilläggen: 01, 03+, 04, 05+, 06+, 07, 08+, 09 Kommer efter formtilläggen: - @sv
scope note: Karttalehdet. Taitettavat kartat. Kirjanmuotoiset kartat ja kartastot. Seinäkartat. Karttapallot. Mikromuotoiset kartat. Teemakartat. Merikortit. Ilmakuvakartat Kartaksi katsotaan myös kirja, jonka sivuista vähintään puolet on karttasivuja Ei käytetä luokissa: 80-85+ Voittaa muotoluokat: 01, 03+, 04, 05+, 06+, 07, 08+, 09 Häviää muotoluokille: -

Hakuteokset (Muotoluokka)
type: Concept
type: Muotoluokka
broader: Muotoluokat
in scheme: YKL - Yleisten kirjastojen luokitusjärjestelmä
notation: 03
preferred label: Reference books (Form tag) @en
preferred label: Uppslagsverk (Formtillägg) @sv
scope note: Aakkosellisesti, kronologisesti tai systemaattisesti järjestetyt hakuteokset Tietosanakirjat. Hakemistot Ei käytetä luokissa: 03, 80-85+, 99.2+ Voittaa muotoluokat: 01, 04, 05+, 06+, 07, 09 Häviää muotoluokille: 02, 08, 081
scope note: Uppslagsverk som är ordnade alfabetiskt, kronologiskt eller systematiskt Konversationslexikon. Register Används inte i klasserna: 03, 80-85, 99.2+ Kommer före formtilläggen: 01, 04, 05+, 06+, 07, 09 Kommer efter formtilläggen: 02, 08, 081 @sv

Sanakirjat. Sanastot (Muotoluokka)
type: Concept
type: Muotoluokka
broader: Muotoluokat
in scheme: YKL - Yleisten kirjastojen luokitusjärjestelmä
notation: 038
preferred label: Dictionaries. Glossaries (Form tag) @en
preferred label: Ordböcker. Ordlistor (Formtillägg) @sv
scope note: Eri kielten sanakirjat ja sanastot. Yksi-, kaksi- ja monikieliset sanakirjat ja sanastot Sivistys-, synonyymi-, slangi-, frekvenssi-, lyhenne- ja etymologiset sanakirjat ja sanastot Eri alojen sanakirjat ja sanastot, joissa sanojen tai termien merkitykset on esitetty lyhyin määritelmin Ei käytetä luokissa: 03, 80-85+ Voittaa muotoluokat: 01, 03, 04, 05+, 06+, 07, 081, 09 Häviää muotoluokille: 02, 08
scope note: Ordböcker och ordlistor för enskilda språk. En-, två- och flerspråkiga ordböcker och ordlistor Främmande ord, synonym-, slang-, frekvens- och förkortningsordböcker, etymologiska ordböcker och ordlistor Ordböcker och ordlistor över olika områden med korta definitioner av ord och termer Används inte i klasserna: 03, 80-85+ Kommer före formtilläggen: 01, 03, 04, 05+, 06+, 07, 081, 09 Kommer efter formtilläggen: 02, 08 @sv

Kokoomateokset. Kokoelmajulkaisut. (Muotoluokka)
type: Concept
type: Muotoluokka
broader: Muotoluokat
in scheme: YKL - Yleisten kirjastojen luokitusjärjestelmä
notation: 04
preferred label: Compilations. Collections (Form tag) @en
preferred label: Samlingsverk. Samlingspublikationer. (Formtillägg) @sv
scope note: Essä-, novell- och talsamlingar av flera författare Antologier. Festskrifter. Minnesskrifter Används inte i klasserna: 04, 80+ Kommer före formtilläggen: - Kommer efter formtilläggen: 01, 02, 03+, 05+, 06+, 07, 08+, 09 @sv
scope note: Useamman tekijän essee-, novelli- ja puhekokoelmat Antologiat. Juhlakirjat. Muistokirjat Ei käytetä luokissa: 04, 10+, 80+ Voittaa muotoluokat: - Häviää muotoluokille: 01, 02, 03+, 05+, 06+, 07, 08+, 09

Kausijulkaisut (Muotoluokka)
type: Concept
type: Muotoluokka
broader: Muotoluokat
in scheme: YKL - Yleisten kirjastojen luokitusjärjestelmä
notation: 05
preferred label: Periodicals (Form tag) @en
preferred label: Seriella publikationer (Formtillägg) @sv
scope note: Hit och till underklasserna i princip kontinuerligt utkommande publikationer som ges ut regelbundet eller oregelbundet och som har förts till den seriella publikationens gemensamma titel. Formtillägget 05 med underklasser används inte om det gäller ett flerdelat arbete som utkommer under en begränsad period eller en enskild del av en periodisk skrift som klassificerats som monografi Används inte i klasserna: 05+ Kommer före formtilläggen: 01, 04, 06+,07, 09 Kommer efter formtilläggen: 02, 03+, 051, 052, 053, 054, 08+ @sv
scope note: Tähän ja alaluokkiin säännöllisesti tai epäsäännöllisesti toistuvasti ilmestyvät, periaatteessa päättymättömät julkaisut, jotka on luetteloitu kausijulkaisun yhteisnimekkeelle Muotoluokkaa 05 ja sen alaluokkia ei käytetä, jos kyseessä on päättyvä tai päättyväksi suunniteltu moniosainen teos tai kausijulkaisun yksittäinen osa, joka on luetteloitu monografiana Ei käytetä luokissa: 05+ Voittaa muotoluokat: 01, 04, 06+, 07, 09 Häviää muotoluokille: 02, 03+, 051, 052, 053, 054, 08+

Aikakauslehdet (Muotoluokka)
type: Concept
type: Muotoluokka
broader: Muotoluokat
in scheme: YKL - Yleisten kirjastojen luokitusjärjestelmä
notation: 051
preferred label: Magazines (Form tag) @en
preferred label: Tidskrifter (Formtillägg) @sv
scope note: Enskilda tidskriftsnummer och tidskriftsårgångar, som har förts till tidskriftens gemensamma titel Används inte i klasserna: 05+ Kommer före formtilläggen: 01, 04, 05, 052, 06+, 07, 09 Kommer efter formtilläggen: 02, 03+, 053, 054, 08+ @sv
scope note: Yksittäiset aikakauslehtinumerot ja aikakauslehtien vuosikerrat, jotka on luetteloitu lehden yhteisnimekkeelle Ei käytetä luokissa: 05+ Voittaa muotoluokat: 01, 04, 05, 052, 06+, 07, 09 Häviää muotoluokille: 02, 03+, 053, 054, 08+

Sarjat (Muotoluokka)
type: Concept
type: Muotoluokka
broader: Muotoluokat
in scheme: YKL - Yleisten kirjastojen luokitusjärjestelmä
notation: 052
preferred label: Serier (Formtillägg) @sv
preferred label: Series (Form tag) @en
scope note: Arbeten som katalogiserats under seriens titel Som serie betraktas en grupp av skilda arbeten, vilka förutom sina egna titlar har en gemensam serietitel Används inte i klasserna: 05+ Kommer före formtilläggen: 01, 04, 05, 06+, 07, 09 Kommer efter formtilläggen: 02, 03+, 051, 053, 054, 08+ @sv
scope note: Sarjan nimekkeelle luetteloidut julkaisut Sarjaksi katsotaan erillisten teosten muodostama joukko, jolla on omien nimekkeidensä lisäksi myös yhteinen sarjan nimeke Ei käytetä luokissa: 05+ Voittaa muotoluokat: 01, 04, 05, 06+, 07, 09 Häviää muotoluokille: 02, 03+, 051, 053, 054, 08+

Vuosikirjat. Kalenterit. Almanakat (Muotoluokka)
type: Concept
type: Muotoluokka
broader: Muotoluokat
in scheme: YKL - Yleisten kirjastojen luokitusjärjestelmä
notation: 053
preferred label: Yearbooks. Calendars. Almanacs (Form tag) @en
preferred label: Årsböcker. Kalendrar. Almanackor (Formtillägg) @sv
scope note: Vuosikirjat, kalenteri ja almanakat, jotka on luetteloitu vuosikirjan, kalenterin tai almanakan yhteisnimekkeelle Ei käytetä luokissa: 05+ Voittaa muotoluokat: 01, 04, 05, 051, 052, 054, 06+, 07, 09 Häviää muotoluokille: 02, 03+, 08+
scope note: Årsböcker, kalendrar och almanackor, som har förts till årsbokens, kalenderns eller almanackans gemensamma titel Används inte i klasserna: 05+ Kommer före formtilläggen: 01, 04, 05, 051, 052, 054, 06+, 07, 09 Kommer efter formtilläggen: 02, 03+, 08+ @sv

Sanomalehdet (Muotoluokka)
type: Concept
type: Muotoluokka
broader: Muotoluokat
in scheme: YKL - Yleisten kirjastojen luokitusjärjestelmä
notation: 054
preferred label: Newspapers (Form tag) @en
preferred label: Tidningar (Formtillägg) @sv
scope note: Enskilda tidningsnummer och tidningsårgångar, som har förts till tidningens gemensamma titel Används inte i klasserna: 05+ Kommer före formtilläggen: 01, 04, 05, 051, 052, 06+, 07, 09 Kommer efter formtilläggen: 02, 03+, 053, 08+ @sv
scope note: Yksittäiset sanomalehtinumerot ja sanomalehtien vuosikerrat, jotka on luetteloitu lehden yhteisnimekkeelle Ei käytetä luokissa: 05+ Voittaa muotoluokat: 01, 04, 05, 051, 052, 06+, 07, 09 Häviää muotoluokille: 02, 03+, 053, 08+

Järjestöt (Muotoluokka)
type: Concept
type: Muotoluokka
broader: Muotoluokat
in scheme: YKL - Yleisten kirjastojen luokitusjärjestelmä
notation: 06
preferred label: Organisationer (Formtillägg) @sv
preferred label: Organisations (Form tag) @en
scope note: Föreningar. Sällskap. Klubbar. Stiftelser. Fonder. Stipendier. Pris Används inte i klasserna: 06, 36.133, 38.63, 38.71, 80-85+ Kommer före formtilläggen: 01, 04, 07, 09 Kommer efter formtilläggen: 02, 03+, 05+,062, 063, 064, 065, 08+ @sv
scope note: Yhdistykset. Seurat. Kerhot. Säätiöt. Rahastot. Apurahat. Palkinnot Ei käytetä luokissa: 06, 36.133, 38.63, 38.71, 80-85+ Voittaa muotoluokat: 01, 04, 07, 09 Häviää muotoluokille: 02, 03+, 05+, 062, 063, 064, 065, 08+

Museot. Museonhoito (Muotoluokka)
type: Concept
type: Muotoluokka
broader: Muotoluokat
in scheme: YKL - Yleisten kirjastojen luokitusjärjestelmä
notation: 062
preferred label: Museer. Museivård (Formtillägg) @sv
preferred label: Museums. Museum management (Form tag) @en
scope note: Museisamlingar. Konstsamlingar. Används inte i klasserna: 06.2, 80-85+ Kommer före formtilläggen: 01, 04, 06, 07, 09 Kommer efter formtilläggen: 02, 03+, 05+, 063, 064, 065, 08+ @sv
scope note: Museokokoelmat. Taidekokoelmat. Ei käytetä luokissa: 06.2, 80-85+ Voittaa muotoluokat: 01, 04, 06, 07, 09 Häviää muotoluokille: 02, 03+, 05+, 063, 064, 065, 08+

Näyttelyt. Messut (Muotoluokka)
type: Concept
type: Muotoluokka
broader: Muotoluokat
in scheme: YKL - Yleisten kirjastojen luokitusjärjestelmä
notation: 063
preferred label: Exhibitions. Fairs (Form tag) @en
preferred label: Utställningar. Mässor (Formtillägg) @sv
scope note: Används inte i klasserna: 06.2, 80-85+ Kommer före formtilläggen: 01, 04, 06, 062, 065, 07, 09 Kommer efter formtilläggen: 02, 03+, 05+, 08+ @sv
scope note: Ei käytetä luokissa: 06.3, 80-85+ Voittaa muotoluokat: 01, 04, 06, 062, 065, 07, 09 Häviää muotoluokille: 02, 03+, 05+, 08+

Arkistot. Arkistonhoito (Muotoluokka)
type: Concept
type: Muotoluokka
broader: Muotoluokat
in scheme: YKL - Yleisten kirjastojen luokitusjärjestelmä
notation: 064
preferred label: Archives. Archiving (Form tag) @en
preferred label: Arkiv. Arkivskötsel (Formtillägg) @sv
scope note: Arkistokokoelmat. Ei käytetä luokissa: 06.4, 80-85+ Voittaa muotoluokat: 01, 04, 06, 062, 07, 09 Häviää muotoluokille: 02, 03+, 05+, 063, 065, 08+
scope note: Arkivsamlingar. Används inte i klasserna: 06.4, 80-85 Kommer före formtilläggen: 01, 04, 06, 062, 07, 09 Kommer efter formtilläggen: :02, 03+, 05+, 063, 065, 08+ @sv

Kokoukset (Muotoluokka)
type: Concept
type: Muotoluokka
broader: Muotoluokat
in scheme: YKL - Yleisten kirjastojen luokitusjärjestelmä
notation: 065
preferred label: Meetings. (Form tag) @en
preferred label: Möten (Formtillägg) @sv
scope note: Kongresser. Seminarier. Symposier Används också för arbeten där föredrag från kongressen, seminarier eller symposier har samlats Kommer före formtilläggen: 01, 04, 06, 062, 064, 07, 09 Kommer efter formtilläggen: 02, 03+, 05+, 063, 08+ @sv
scope note: Kongressit. Seminaarit. Symposiumit Käytetään myös teoksista, joihin on koottu kokouksen, kongressin, seminaarin tai symposiumin esitelmiä Ei käytetä luokissa: 06.5, 80-85+ Voittaa muotoluokat: 01, 04, 06, 062, 064, 07, 09 Häviää muotoluokille: 02, 03+, 05+, 063, 08+

Oppikirjat. Harjoituskirjat. Musiikin oppimateriaalit (Muotoluokka)
type: Concept
type: Muotoluokka
broader: Muotoluokat
in scheme: YKL - Yleisten kirjastojen luokitusjärjestelmä
notation: 07
preferred label: Läroböcker. Övningsböcker. Läromaterial för musik (Formtillägg) @sv
preferred label: Text books. Exercise books. Music study materials (Form tag) @en
scope note: Läro-, övnings- och arbetsböcker samt lärarhandledningar för dem, ändå icke kursböcker för universitet eller högskolor. Används även för vägledning i sång och musik och för annat läromaterial inom musiken. Anväds inte för handledningar för hobbyverksamhet inom olika områden. Används inte i klasserna: 80-85+. Kommer före formtilläggen: 01, 04, 09. Kommer efter formtilläggen: 02, 03+, 05+, 06+, 08+. Formtillägg används för böcker för den högre utbildningen som tydligt är läroböcker, såsom läkemedelsräkning, matematik för ingenjörer, engelska för sjukvårdare. Däremot standardverk från olika områden, såsom Grunderna i sociologisk forskning eller dylikt får inte formtillägget 07. @sv
scope note: Oppi-, harjoitus- ja työkirjat sekä niihin liittyvät opettajan kirjat, ei kuitenkaan yliopistojen tai korkeakoulujen kurssikirjat. Käytetään myös laulamisen ja soittamisen oppaista sekä muusta musiikin oppimateriaalista. Ei käytetä eri alojen harrasteoppaista. Ei käytetä luokissa: 80-85+. Voittaa muotoluokat: 01, 04, 09. Häviää muotoluokille: 02, 03+, 05+, 06+, 08+. Muotoluokkaa käytetään korkea-asteen selkeissä oppikirjoissa, kuten lääkelaskenta, insinöörin matematiikka, sairaanhoitajan englantia. Sen sijaan tietyn alan perusteokset, kuten Sosiologisen tutkimuksen perusteet tms. eivät saa muotoluokkaa 07.

Taulukot. Tilastot (Muotoluokka)
type: Concept
type: Muotoluokka
broader: Muotoluokat
in scheme: YKL - Yleisten kirjastojen luokitusjärjestelmä
notation: 08
preferred label: Tabeller. Statistik (Formtillägg) @sv
preferred label: Tables. Statistics (Form tag) @en
scope note: Ett arbete där minst hälften utgörs av tabeller eller statistik betraktas som en tabell- eller statistikpublikation Används inte i klasserna: 31.3+, 80-85+ Kommer före formtilläggen: 01, 03, 04, 05+, 06+, 07, 09 Kommer efter formtilläggen: 02, 038, 08 @sv
scope note: Taulukko- tai tilastojulkaisuksi katsotaan teos, josta vähintään puolet on taulukoita tai tilastoja Ei käytetä luokissa: 31.3+, 80-85+ Voittaa muotoluokat: 01, 03+, 04, 05+, 06+, 07, 081, 09 Häviää muotoluokille: 02

Standardit. Normit (Muotoluokka)
type: Concept
type: Muotoluokka
broader: Muotoluokat
in scheme: YKL - Yleisten kirjastojen luokitusjärjestelmä
notation: 081
preferred label: Standarder. Normer (Formtillägg) @sv
preferred label: Standards. Norms (Form tag) @en
scope note: Används inte i klasserna: 60.3, 80-85+ Kommer före formtilläggen: 01, 03, 04, 05+, 06+, 07, 09 Kommer efter formtilläggen: 02, 038, 08 @sv
scope note: Ei käytetä luokissa: 60.3, 80-85+ Voittaa muotoluokat: 01, 03, 04, 05+, 06+, 07, 09 Häviää muotoluokille: 02, 038, 08

Historia (Muotoluokka)
type: Concept
type: Muotoluokka
broader: Muotoluokat
in scheme: YKL - Yleisten kirjastojen luokitusjärjestelmä
notation: 09
preferred label: Historia (Formtillägg) @sv
preferred label: History (Form tag) @en
scope note: Används inte i klasserna: 11+, 16.9, 41-48+, 70-77+, 80-86+, 90-99+ Kommer före formtillägget: 04 Kommer efter formtilläggen: 01, 02, 03+, 05+, 06+, 07, 08+ @sv
scope note: Ei käytetä luokissa: 11+, 41-48+, 70-77+, 80-86+, 90-99+ Voittaa muotoluokat: 04 Häviää muotoluokille: 01, 02, 03+, 05+, 06+, 07, 08+

Muotoluokat
type: Concept
type: Muotoluokka
in scheme: YKL - Yleisten kirjastojen luokitusjärjestelmä
narrower: Filosofia. Teoria. Tutkimusmenetelmät (Muotoluokka)
narrower: Kartat. Kartastot (Muotoluokka)
narrower: Hakuteokset (Muotoluokka)
narrower: Sanakirjat. Sanastot (Muotoluokka)
narrower: Kokoomateokset. Kokoelmajulkaisut. (Muotoluokka)
narrower: Kausijulkaisut (Muotoluokka)
narrower: Aikakauslehdet (Muotoluokka)
narrower: Sarjat (Muotoluokka)
narrower: Vuosikirjat. Kalenterit. Almanakat (Muotoluokka)
narrower: Sanomalehdet (Muotoluokka)
narrower: Järjestöt (Muotoluokka)
narrower: Museot. Museonhoito (Muotoluokka)
narrower: Näyttelyt. Messut (Muotoluokka)
narrower: Arkistot. Arkistonhoito (Muotoluokka)
narrower: Kokoukset (Muotoluokka)
narrower: Oppikirjat. Harjoituskirjat. Musiikin oppimateriaalit (Muotoluokka)
narrower: Taulukot. Tilastot (Muotoluokka)
narrower: Standardit. Normit (Muotoluokka)
narrower: Historia (Muotoluokka)
preferred label: Form tags @en
preferred label: Formtillägg @sv
top concept of: YKL - Yleisten kirjastojen luokitusjärjestelmä

YKL-luokka
type: Class
label: YKL Class @en
label: YKL-klass @sv
subclass of: Concept

Muotoluokka
type: Class
label: Form tag @en
label: Formtilläg @sv
subclass of: Concept